{"text_format":"1","workbook":"xlsx","n_sheets":8,"sheets":["INSTRUCTIVO","DATOS FC","PROPIETARIO actuales","NO PROPIETARIOS adm actuales","ANTERIORES PROP","IMPRIMIR","LISTADOS","BD-GRAL"],"not_rendered":{"charts":0,"images":0,"macros":1,"external_links":0,"defined_names":4,"comments":0,"pivot_tables":0},"unopened":[],"bounds":{"document_bytes":16777216,"sheet_cells":100000,"rows_first":2000,"rows_last":500,"rows_between":2000,"halvings":0,"cell_chars":16384,"cell_head_chars":4096},"cells_cut":0,"cells_raw":0,"read":"whole","date_system":"1900"}

{"sheet":"INSTRUCTIVO","index":0,"n_rows":9,"n_cols":2,"rows_kept":9,"cut":false,"hidden":false,"merged":[[8,1,8,7],[25,1,25,7],[0,0,0,7],[5,1,5,7],[4,1,4,7],[7,1,7,7],[2,1,2,7],[3,1,3,7],[17,1,17,7],[20,1,20,7],[6,1,6,7]]}
["INSTRUCCIONES DE LLENADO -POR FAVOR SEGUIR EL ORDEN-"]
[]
[1,"GUARDAR ARCHIVO:  ELEGIR LA OPCIÓN \"GUARDAR COMO\". PONER NOMBRE DEL FONDO DE COMERCIO Y ELEGIR COMO TIPO: \"ARCHIVO EXCEL HABILITADO PARA MACRO\"."]
[2,"POSICIONARSE EN SOLAPA \"DATOS FC\", Y COMPLETAR DATOS."]
[3,"POSICIONARSE EN SOLAPA \"PROPIETARIOS actuales\", Y COMPLETAR DATOS SEGÚN SEA PROPIETARIOS HUMANO/S O PERSONA/S. JURÍDICA."]
[4,"POSICIONARSE EN SOLAPA \"NO PROPIETARIOS adm actuales\". Para el caso que exista PROPIETARIOS de los órganos de representación, administración y/o fiscalización que NO sean PROPIETARIOS."]
[5,"POSICIONARSE EN SOLAPA \"ANTERIORES PROP\", Y COMPLETAR DATOS SEGÚN SEA PROPIETARIOS ANTERIORES HUMANO/S O PERSONA/S. JURÍDICA."]
[6,"POSICIONARSE EN SOLAPA \"IMPRIMIR\". DEBE PRESIONAR PRIMERO LOS BOTONES UNO (1º) E IMPRIMIR -IR A LA SOLAPA SUPERIOR DE LA HOJA \"ARCHIVO\" y elegir opción \"IMPRIMIR\"-"]
[7,"UNA VEZ IMPRESA FIRMAR EN TODAS LAS PÁGINAS LOS MIEMBRO/AS, REP. LEGALES, GESTOR, APODERADO/A, ESCRIBANO/A, Y NO PROPIETARIOS INTERVINIENTES. LA FIRMA SE DEBE CERTIFICAR POR ANTE JUEZ DE PAZ."]

{"sheet":"DATOS FC","index":1,"n_rows":35,"n_cols":12,"rows_kept":35,"cut":false,"hidden":false,"merged":[[2,0,2,4],[3,0,3,2],[1,0,1,4],[6,3,8,4],[6,0,8,0],[6,1,8,1],[3,3,3,5],[4,4,4,5],[6,2,8,2],[9,3,9,4],[10,3,10,4],[11,3,11,4],[12,3,12,4],[13,3,13,4],[26,0,28,0],[26,1,28,1],[26,2,28,2],[26,3,26,4],[27,3,28,3],[27,4,28,4],[18,5,18,6],[19,5,19,6],[17,5,17,6],[33,5,33,7],[34,5,34,7],[31,5,31,6],[29,5,29,7],[20,5,20,6],[21,5,21,6],[22,5,22,6],[23,5,23,6],[24,5,24,6],[32,5,32,7],[30,5,30,7]]}
["DATOS TRANSFERENCIA FONDO DE COMERCIO"]
["(COMPLETAR CELDAS CON FONDO VERDE)"]
["REGISTRO PÚBLICO DE COMERCIO, Juzgado Pcial. de 1era. Instancia en los Civil, Comercial, Laboral, Minería y Familia, con asiento en la localidad de LAS HERAS -Pcia. de Sta. Cruz, Simón Bolivar 482 (CP9017)-"]
["NOMBRE DEL FONDO DE COMERCIO:"]
[null,null,"FECHA:",null,{"$f":"+IF(D5=0,\"CAMPO OBLIGATORIO, CAUSAL DE RECHAZO\",\"\")","v":"CAMPO OBLIGATORIO, CAUSAL DE RECHAZO"}]
["ANEXO I (GESTIÓN/TRÁMITE)       "]
["REFER.","APELLIDO/s DEL GESTIONANTE","NOMBRE/s DEL DEL GESTIONANTE","DATOS"]
[]
[]
[]
[]
[]
[]
[]
[null,null,null,null,"COMPLETAR"]
[null,null,null,"CONCEPTO"]
[null,null,null,null,"-EN MAYUSCULA -"]
["aa GESTOR",null,null,"TRAMITE QUE SE INICIA:","ELEGIR",{"$f":"+IF(OR(B18=0,C18=0),\"FALTA APELL/NOMB DEL GEST, CAUSAL DE RECHAZO\",\"\")","v":"FALTA APELL/NOMB DEL GEST, CAUSAL DE RECHAZO"},null,null,null,null,null,1]
["ab GESTOR",{"$f":"B$18","v":0},{"$f":"C$18","v":0},"DOMICILIO PROCESAL CONSTITUIDO -art.40 CPCC-:",null,{"$f":"+IF(E19=0,\"CAMPO OBLIGATORIO, CAUSAL DE RECHAZO\",\"\")","v":"CAMPO OBLIGATORIO, CAUSAL DE RECHAZO"},null,null,null,null,null,2]
["ac GESTOR",{"$f":"B$18","v":0},{"$f":"C$18","v":0},"CARÁCTER DEL GESTIONANTE:","ELEGIR",{"$f":"+IF(E20=0,\"CAMPO OBLIGATORIO, CAUSAL DE RECHAZO\",\"\")","v":""},null,null,null,null,null,3]
["ad GESTOR",{"$f":"IF(OR($E$20=\"ESCRIBANO/A\",$E$20=\"APODERADO/A LETRADO/A\"),0,$B18)","v":0},{"$f":"IF(OR($E$20=\"ESCRIBANO/A\",$E$20=\"APODERADO/A LETRADO/A\"),0,$C18)","v":0},{"$f":"IF(OR(E$20=\"ESCRIBANO/A\",E$20=\"APODERADO/A LETRADO/A\"),\"\",\"LETRADO/A/S PATROCINANTE/S:\")","v":"LETRADO/A/S PATROCINANTE/S:"},null,{"$f":"+IF(D21=\"\",\"\",IF(E21=0,\"CAMPO OBLIGATORIO, CAUSAL DE RECHAZO\",\"\"))","v":"CAMPO OBLIGATORIO, CAUSAL DE RECHAZO"},null,null,null,null,null,4]
["ae GESTOR",{"$f":"IF(OR($E$20=\"ESCRIBANO/A\",$E$20=\"APODERADO/A LETRADO/A\"),0,$B19)","v":0},{"$f":"IF(OR($E$20=\"ESCRIBANO/A\",$E$20=\"APODERADO/A LETRADO/A\"),0,$C19)","v":0},{"$f":"IF(OR(E$20=\"ESCRIBANO/A\",E$20=\"APODERADO/A LETRADO/A\"),\"\",\"DOC. IDENTIDAD –sin puntos-:\")","v":"DOC. IDENTIDAD –sin puntos-:"},null,{"$f":"+IF(D22=\"\",\"\",IF(E22=0,\"CAMPO OBLIGATORIO, CAUSAL DE RECHAZO\",\"\"))","v":"CAMPO OBLIGATORIO, CAUSAL DE RECHAZO"},null,null,null,null,null,5]
["af GESTOR",0,0,{"$f":"IF(OR(E$20=\"ESCRIBANO/A\",E$20=\"APODERADO/A LETRADO/A\"),\"\",\"DOMICILIO REAL -indicar Ciudad/Pcia./País\")","v":"DOMICILIO REAL -indicar Ciudad/Pcia./País"},null,"CAMPO OBLIGATORIO, CAUSAL DE RECHAZO",null,null,null,null,null,6]
["ag GESTOR",0,0,{"$f":"IF(OR(E$20=\"ESCRIBANO/A\",E$20=\"APODERADO/A LETRADO/A\"),\"\",\"CEL/TEL -c/código de área, sin puntos o barras-:\")","v":"CEL/TEL -c/código de área, sin puntos o barras-:"},null,"CAMPO OBLIGATORIO, CAUSAL DE RECHAZO",null,null,null,null,null,7]
["ah GESTOR",0,0,{"$f":"IF(OR(E$20=\"ESCRIBANO/A\",E$20=\"APODERADO/A LETRADO/A\"),\"\",\"EMAIL -OBLIGATORIO-:\")","v":"EMAIL -OBLIGATORIO-:"},null,"CAMPO OBLIGATORIO, CAUSAL DE RECHAZO",null,null,null,null,null,8]
["ANEXO II -DATOS DEL FONDO DE COMERCIO-"]
["REFER.","NOMBRE FONDO DE COMERCIO","NOMBRE FONDO DE COMERCIO","DATOS"]
[null,null,null,"CONCEPTO","COMPLETAR -EN MAYUSCULA -"]
[]
["ba FONDO DE COMERCIO",{"$f":"$D$4","v":0},{"$f":"$D$4","v":0},"DIRECCION domicilio legal:",null,{"$f":"+IF(E30=0,\"CAMPO OBLIGATORIO, CAUSAL DE RECHAZO\",\"\")","v":"CAMPO OBLIGATORIO, CAUSAL DE RECHAZO"}]
["bb FONDO DE COMERCIO",{"$f":"IF(E31=0,0,$D$4)","v":0},{"$f":"IF(E31=0,0,$D$4)","v":0},"CUIT –sin puntos ni barras-:",null,"CAMPO OBLIGATORIO, CAUSAL DE RECHAZO"]
["h CAP. INTEG. TOT FORM.",{"$f":"$D$4","v":0},0,"CAPITAL MÍNIMO A INTEGRAR TOTAL (SOCIOS DE ESTE FORM):",{"$f":"+'PROPIETARIO actuales'!#REF!+'PROPIETARIO actuales'!E47+'PROPIETARIO actuales'!E67+'PROPIETARIO actuales'!E87+'PROPIETARIO actuales'!E107+'PROPIETARIO actuales'!E125+'PROPIETARIO actuales'!E145+'PROPIETARIO actuales'!E165+'PROPIETARIO actuales'!#REF!+'PROPIETARIO actuales'!#REF!+'PROPIETARIO actuales'!#REF!+'PROPIETARIO actuales'!#REF!+'PROPIETARIO actuales'!#REF!+'PROPIETARIO actuales'!#REF!+'PROPIETARIO actuales'!#REF!+'PROPIETARIO actuales'!J39+'PROPIETARIO actuales'!J56+'PROPIETARIO actuales'!J73+'PROPIETARIO actuales'!J90+'PROPIETARIO actuales'!J107+'PROPIETARIO actuales'!J124+'PROPIETARIO actuales'!#REF!+'PROPIETARIO actuales'!#REF!+'PROPIETARIO actuales'!#REF!","v":{"$error":"#REF!"}},{"$f":"+IF(E32=0,\"CAMPO OBLIGATORIO, CAUSAL DE RECHAZO\",\"\")","v":{"$error":"#REF!"}}]
["bb FONDO DE COMERCIO",{"$f":"IF(E33=0,0,$D$4)","v":0},{"$f":"IF(E33=0,0,$D$4)","v":0},"FECHA DE TRANSFERENCIA:",null,"CAMPO OBLIGATORIO, CAUSAL DE RECHAZO"]
["b FONDO DE COMERCIO",0,0,"CEL/TEL (de administración) -en su caso indicar que no posee-:",null,{"$f":"+IF(E34=0,\"CAMPO OBLIGATORIO, CAUSAL DE RECHAZO\",\"\")","v":"CAMPO OBLIGATORIO, CAUSAL DE RECHAZO"}]
["b FONDO DE COMERCIO",0,0,"EMAIL (de administración)  -en su caso indicar que no posee-:",null,"CAMPO OBLIGATORIO, CAUSAL DE RECHAZO"]

{"sheet":"PROPIETARIO actuales","index":2,"n_rows":175,"n_cols":10,"rows_kept":175,"cut":false,"hidden":false,"merged":[[7,8,7,10],[8,8,8,10],[9,9,9,10],[1,0,1,4],[2,0,2,4],[3,0,3,2],[3,3,3,4],[6,8,6,9],[6,0,8,0],[6,6,8,6],[5,0,5,4],[5,6,5,9]]}
[{"$f":"+'DATOS FC'!A1","v":"DATOS TRANSFERENCIA FONDO DE COMERCIO"}]
["(COMPLETAR CELDAS CON FONDO VERDE)"]
[{"$f":"+'DATOS FC'!A3:E3","v":"REGISTRO PÚBLICO DE COMERCIO, Juzgado Pcial. de 1era. Instancia en los Civil, Comercial, Laboral, Minería y Familia, con asiento en la localidad de LAS HERAS -Pcia. de Sta. Cruz, Simón Bolivar 482 (CP9017)-"}]
["NOMBRE DEL FONDO DE COMERCIO:",null,null,{"$f":"+'DATOS FC'!D4:E4","v":0}]
[null,"FECHA:",{"$f":"+'DATOS FC'!D5","v":"00:00:00"}]
["DATOS PROPIETARIOS PERSONAS HUMANAS",null,null,null,null,null,"DATOS PROPIETARIOS PERSONAS JURÍDICAS"]
["REFER.","APELLIDO/s DEL MIEMBRO","NOMBRE/s DEL MIEMBRO","DATOS",null,null,"REFER.","RAZON SOCIAL/DENOMINACIÓN MIEMBRO PERSONA JURÍDICA","DATOS"]
[]
[]
[null,null,null,null,null,null,null,null,null,"XX SA"]
[]
[]
[null,null,null,null,"COMPLETAR"]
[null,null,null,"CONCEPTO"]
[null,null,null,null,"-EN MAYUSCULA -"]
["c PROP PH",null,0,"DOC. IDENTIDAD –sin puntos-:",null,null,"c PROP PJ",null,"CUIT –sin puntos ni barras-:"]
["c PROP PH",{"$f":"+B16","v":0},{"$f":"+C16","v":0},"CUIT/CUIL –sin puntos ni barras-:",null,null,"c PROP PJ",{"$f":"H16","v":0},"TIPO DE PERSONA JCA -FONDO DE COMERCIO, asociación, mutual, etc-:"]
["c PROP PH",{"$f":"+B17","v":0},{"$f":"+C17","v":0},"FECHA DE NACIMIENTO –dd/mm/aa-:",null,null,"c PROP PJ",{"$f":"H16","v":0},"ORGANISMO /s DONDE SE INSCRIBIÓ CONSTITUCIÓN (INDICAR LOCALIDAD/PCIA DEL ORG) -si no se inscribió poner: NO INSCRIPTO/A:"]
["c PROP PH",0,0,"LUGAR DE NACIMIENTO:",null,null,"c PROP PJ",{"$f":"IF(I19=\"\",0,H16)","v":0},{"$f":"IF(OR(J18=\"NO INSCRIPTO/A\",J18=\"NO INSCR.\", J18=\"NO INSCR\",J18=\"N/I\", J18= \"NO INSCRIPTO\",J18=\"NO INSCRIPTA\"),\"\",\"DATOS DE RESOLUCIÓN Y FECHA DE INSCRIPCIÓN:\")","v":"DATOS DE RESOLUCIÓN Y FECHA DE INSCRIPCIÓN:"}]
["c PROP PH",0,0,"NACIONALIDAD:",null,null,"c PROP PJ",{"$f":"IF(I20=\"\",0,H16)","v":0},{"$f":"IF(I19=\"\",\"\",\"FECHA DE INSCRIPCION:\")","v":"FECHA DE INSCRIPCION:"}]
["c PROP PH",0,0,"PROFESIÓN/OFICIO:",null,null,"c PROP PJ",{"$f":"H16","v":0},"APELLIDO/S, NOMBRE/S,  DNI Y CARGO DE CADA MIEMBRO DE SU ADMINISTRACIÓN:"]
["c PROP PH",0,0,"DOMICILIO REAL:",null,null,"c PROP PJ",{"$f":"IF(AND(J23>0,J22=0),0,H16)","v":0},"DOMICILIO SOCIAL:"]
["c PROP PH",0,0,"CEL/TEL :",null,null,"c PROP PJ",{"$f":"IF(AND(J22>0,J23=0),0,H16)","v":0},"SEDE SOCIAL:"]
["c PROP PH",{"$f":"IF(E24=0,0,B16)","v":0},{"$f":"IF(E24=0,0,C16)","v":0},"EMAIL:",null,null,"c PROP PJ",{"$f":"H16","v":0},"CEL/TEL :"]
["c PROP PH",{"$f":"B16","v":0},{"$f":"C16","v":0},"ESTADO CIVIL:",null,null,"c PROP PJ",{"$f":"H16","v":0},"OBJETO PRINCIPAL (EN FORMA RESUMIDA):"]
["c PROP PH",{"$f":"IF($E25=\"CASADO/A\",B16,0)","v":0},{"$f":"IF($E25=\"CASADO/A\",C16,0)","v":0},{"$f":"IF(E25=\"CASADO/A\",\"APELLIDO/S CÓNYUGE:\",\"\")","v":""},null,null,"c PROP PJ",{"$f":"IF(J26=0,0,H16)","v":0},"NOTA/OBSERVACIÓN -en mayúscula-:"]
["c PROP PH",{"$f":"IF($E25=\"CASADO/A\",B16,0)","v":0},{"$f":"IF($E25=\"CASADO/A\",C16,0)","v":0},{"$f":"IF(E25=\"CASADO/A\",\"NOMBRE/S CÓNYUGE:\",\"\")","v":""},null,null,"c PROP PJ",null,"CUIT –sin puntos ni barras-:"]
["c PROP PH",{"$f":"IF($E25=\"CASADO/A\",B16,0)","v":0},{"$f":"IF($E25=\"CASADO/A\",C16,0)","v":0},{"$f":"IF(E25=\"CASADO/A\",\"DOC. IDENTIDAD (cónyuge) –sin puntos ni barras-:\",\"\")","v":""},null,null,"c PROP PJ",{"$f":"H27","v":0},"TIPO DE PERSONA JCA -FONDO DE COMERCIO, asociación, mutual, etc-:"]
["i ORG. REP. LEGAL/ ADM.",{"$f":"IF(E29=0,0,B16)","v":0},{"$f":"IF(E29=0,0,C16)","v":0},"NOMBRE CARGO REP. LEGAL/ ADMINISTRACIÓN QUE OCUPA:",null,null,"c PROP PJ",{"$f":"H27","v":0},"ORGANISMO /s DONDE SE INSCRIBIÓ CONSTITUCIÓN (INDICAR LOCALIDAD/PCIA DEL ORG) -si no se inscribió poner: NO INSCRIPTO/A:"]
["j ORG. FISCALIZ.",{"$f":"IF(E30=0,0,B16)","v":0},{"$f":"IF(E30=0,0,C16)","v":0},"NOMBRE CARGO FISCALIZACIÓN QUE OCUPA:",null,null,"c PROP PJ",{"$f":"IF(I30=\"\",0,H27)","v":0},{"$f":"IF(OR(J29=\"NO INSCRIPTO/A\",J29=\"NO INSCR.\", J29=\"NO INSCR\",J29=\"N/I\", J29= \"NO INSCRIPTO\",J29=\"NO INSCRIPTA\"),\"\",\"DATOS DE RESOLUCIÓN Y FECHA DE INSCRIPCIÓN:\")","v":"DATOS DE RESOLUCIÓN Y FECHA DE INSCRIPCIÓN:"}]
["c PROP PH",{"$f":"IF(E31=0,0,B16)","v":0},{"$f":"IF(E31=0,0,C16)","v":0},"NOTA/OBSERVACIÓN -en mayúscula-:",null,null,"c PROP PJ",{"$f":"IF(I31=\"\",0,H27)","v":0},{"$f":"IF(I30=\"\",\"\",\"FECHA DE INSCRIPCION:\")","v":"FECHA DE INSCRIPCION:"}]
["c PROP PH",null,0,"DOC. IDENTIDAD –sin puntos-:",null,null,"c PROP PJ",{"$f":"H27","v":0},"APELLIDO/S, NOMBRE/S,  DNI Y CARGO DE CADA MIEMBRO DE SU ADMINISTRACIÓN:"]
["c PROP PH",{"$f":"+B32","v":0},{"$f":"+C32","v":0},"CUIT/CUIL –sin puntos ni barras-:",null,null,"c PROP PJ",{"$f":"IF(AND(J34>0,J33=0),0,H27)","v":0},"DOMICILIO SOCIAL:"]
["c PROP PH",{"$f":"+B33","v":0},0,"FECHA DE NACIMIENTO –dd/mm/aa-:",null,null,"c PROP PJ",{"$f":"IF(AND(J33>0,J34=0),0,H27)","v":0},"SEDE SOCIAL:"]
["c PROP PH",0,0,"LUGAR DE NACIMIENTO:",null,null,"c PROP PJ",{"$f":"H27","v":0},"CEL/TEL :"]
["c PROP PH",0,0,"NACIONALIDAD:",null,null,"c PROP PJ",{"$f":"H27","v":0},"OBJETO PRINCIPAL (EN FORMA RESUMIDA):"]
["c PROP PH",0,0,"PROFESIÓN/OFICIO:",null,null,"c PROP PJ",{"$f":"IF(J37=0,0,H27)","v":0},"NOTA/OBSERVACIÓN -en mayúscula-:"]
["c PROP PH",0,0,"DOMICILIO REAL:",null,null,"c PROP PJ",null,"CUIT –sin puntos ni barras-:"]
["c PROP PH",0,0,"CEL/TEL :",null,null,"c PROP PJ",{"$f":"H38","v":0},"TIPO DE PERSONA JCA -FONDO DE COMERCIO, asociación, mutual, etc-:"]
["c PROP PH",{"$f":"IF(E40=0,0,B32)","v":0},{"$f":"IF(E40=0,0,C32)","v":0},"EMAIL:",null,null,"c PROP PJ",{"$f":"H38","v":0},"ORGANISMO /s DONDE SE INSCRIBIÓ CONSTITUCIÓN (INDICAR LOCALIDAD/PCIA DEL ORG) -si no se inscribió poner: NO INSCRIPTO/A:"]
["c PROP PH",{"$f":"B32","v":0},{"$f":"C32","v":0},"ESTADO CIVIL:",null,null,"c PROP PJ",{"$f":"IF(I41=\"\",0,H38)","v":0},{"$f":"IF(OR(J40=\"NO INSCRIPTO/A\",J40=\"NO INSCR.\", J40=\"NO INSCR\",J40=\"N/I\", J40= \"NO INSCRIPTO\",J40=\"NO INSCRIPTA\"),\"\",\"DATOS DE RESOLUCIÓN Y FECHA DE INSCRIPCIÓN:\")","v":"DATOS DE RESOLUCIÓN Y FECHA DE INSCRIPCIÓN:"}]
["c PROP PH",{"$f":"IF($E41=\"CASADO/A\",B32,0)","v":0},{"$f":"IF($E41=\"CASADO/A\",C32,0)","v":0},{"$f":"IF(E41=\"CASADO/A\",\"APELLIDO/S CÓNYUGE:\",\"\")","v":""},null,null,"c PROP PJ",{"$f":"IF(I42=\"\",0,H38)","v":0},{"$f":"IF(I41=\"\",\"\",\"FECHA DE INSCRIPCION:\")","v":"FECHA DE INSCRIPCION:"}]
["c PROP PH",{"$f":"IF($E41=\"CASADO/A\",B32,0)","v":0},{"$f":"IF($E41=\"CASADO/A\",C32,0)","v":0},{"$f":"IF(E41=\"CASADO/A\",\"NOMBRE/S CÓNYUGE:\",\"\")","v":""},null,null,"c PROP PJ",{"$f":"H38","v":0},"APELLIDO/S, NOMBRE/S,  DNI Y CARGO DE CADA MIEMBRO DE SU ADMINISTRACIÓN:"]
["c PROP PH",{"$f":"IF($E41=\"CASADO/A\",B32,0)","v":0},{"$f":"IF($E41=\"CASADO/A\",C32,0)","v":0},{"$f":"IF(E41=\"CASADO/A\",\"DOC. IDENTIDAD (cónyuge) –sin puntos ni barras-:\",\"\")","v":""},null,null,"c PROP PJ",{"$f":"IF(AND(J45>0,J44=0),0,H38)","v":0},"DOMICILIO SOCIAL:"]
["i ORG. REP. LEGAL/ ADM.",{"$f":"IF(E45=0,0,B32)","v":0},{"$f":"IF(E45=0,0,C32)","v":0},"NOMBRE CARGO REP. LEGAL/ ADMINISTRACIÓN QUE OCUPA:",null,null,"c PROP PJ",{"$f":"IF(AND(J44>0,J45=0),0,H38)","v":0},"SEDE SOCIAL:"]
["j ORG. FISCALIZ.",{"$f":"IF(E46=0,0,B32)","v":0},{"$f":"IF(E46=0,0,C32)","v":0},"NOMBRE CARGO FISCALIZACIÓN QUE OCUPA:",null,null,"c PROP PJ",{"$f":"H38","v":0},"CEL/TEL :"]
["c PROP PH",{"$f":"IF(E47=0,0,B32)","v":0},{"$f":"IF(E47=0,0,C32)","v":0},"NOTA/OBSERVACIÓN -en mayúscula-:",null,null,"c PROP PJ",{"$f":"H38","v":0},"OBJETO PRINCIPAL (EN FORMA RESUMIDA):"]
["c PROP PH",null,0,"DOC. IDENTIDAD –sin puntos-:",null,null,"c PROP PJ",{"$f":"IF(J48=0,0,H38)","v":0},"NOTA/OBSERVACIÓN -en mayúscula-:"]
["c PROP PH",{"$f":"+B48","v":0},{"$f":"+C48","v":0},"CUIT/CUIL –sin puntos ni barras-:",null,null,"c PROP PJ",null,"CUIT –sin puntos ni barras-:"]
["c PROP PH",{"$f":"+B49","v":0},0,"FECHA DE NACIMIENTO –dd/mm/aa-:",null,null,"c PROP PJ",{"$f":"H49","v":0},"TIPO DE PERSONA JCA -FONDO DE COMERCIO, asociación, mutual, etc-:"]
["c PROP PH",0,0,"LUGAR DE NACIMIENTO:",null,null,"c PROP PJ",{"$f":"H49","v":0},"ORGANISMO /s DONDE SE INSCRIBIÓ CONSTITUCIÓN (INDICAR LOCALIDAD/PCIA DEL ORG) -si no se inscribió poner: NO INSCRIPTO/A:"]
["c PROP PH",0,0,"NACIONALIDAD:",null,null,"c PROP PJ",{"$f":"IF(I52=\"\",0,H49)","v":0},{"$f":"IF(OR(J51=\"NO INSCRIPTO/A\",J51=\"NO INSCR.\", J51=\"NO INSCR\",J51=\"N/I\", J51= \"NO INSCRIPTO\",J51=\"NO INSCRIPTA\"),\"\",\"DATOS DE RESOLUCIÓN Y FECHA DE INSCRIPCIÓN:\")","v":"DATOS DE RESOLUCIÓN Y FECHA DE INSCRIPCIÓN:"}]
["c PROP PH",0,0,"PROFESIÓN/OFICIO:",null,null,"c PROP PJ",{"$f":"IF(I53=\"\",0,H49)","v":0},{"$f":"IF(I52=\"\",\"\",\"FECHA DE INSCRIPCION:\")","v":"FECHA DE INSCRIPCION:"}]
["c PROP PH",0,0,"DOMICILIO REAL:",null,null,"c PROP PJ",{"$f":"H49","v":0},"APELLIDO/S, NOMBRE/S,  DNI Y CARGO DE CADA MIEMBRO DE SU ADMINISTRACIÓN:"]
["c PROP PH",0,0,"CEL/TEL :",null,null,"c PROP PJ",{"$f":"IF(AND(J56>0,J55=0),0,H49)","v":0},"DOMICILIO SOCIAL:"]
["c PROP PH",{"$f":"IF(E56=0,0,B48)","v":0},{"$f":"IF(E56=0,0,C48)","v":0},"EMAIL:",null,null,"c PROP PJ",{"$f":"IF(AND(J55>0,J56=0),0,H49)","v":0},"SEDE SOCIAL:"]
["c PROP PH",{"$f":"B48","v":0},{"$f":"C48","v":0},"ESTADO CIVIL:",null,null,"c PROP PJ",{"$f":"H49","v":0},"CEL/TEL :"]
["c PROP PH",{"$f":"IF($E57=\"CASADO/A\",B48,0)","v":0},{"$f":"IF($E57=\"CASADO/A\",C48,0)","v":0},{"$f":"IF(E57=\"CASADO/A\",\"APELLIDO/S CÓNYUGE:\",\"\")","v":""},null,null,"c PROP PJ",{"$f":"H49","v":0},"OBJETO PRINCIPAL (EN FORMA RESUMIDA):"]
["c PROP PH",{"$f":"IF($E57=\"CASADO/A\",B48,0)","v":0},{"$f":"IF($E57=\"CASADO/A\",C48,0)","v":0},{"$f":"IF(E57=\"CASADO/A\",\"NOMBRE/S CÓNYUGE:\",\"\")","v":""},null,null,"c PROP PJ",{"$f":"IF(J59=0,0,H49)","v":0},"NOTA/OBSERVACIÓN -en mayúscula-:"]
["c PROP PH",{"$f":"IF($E57=\"CASADO/A\",B48,0)","v":0},{"$f":"IF($E57=\"CASADO/A\",C48,0)","v":0},{"$f":"IF(E57=\"CASADO/A\",\"DOC. IDENTIDAD (cónyuge) –sin puntos ni barras-:\",\"\")","v":""},null,null,"c PROP PJ",null,"CUIT –sin puntos ni barras-:"]
["i ORG. REP. LEGAL/ ADM.",{"$f":"IF(E61=0,0,B48)","v":0},{"$f":"IF(E61=0,0,C48)","v":0},"NOMBRE CARGO REP. LEGAL/ ADMINISTRACIÓN QUE OCUPA:",null,null,"c PROP PJ",{"$f":"H60","v":0},"TIPO DE PERSONA JCA -FONDO DE COMERCIO, asociación, mutual, etc-:"]
["j ORG. FISCALIZ.",{"$f":"IF(E62=0,0,B48)","v":0},{"$f":"IF(E62=0,0,C48)","v":0},"NOMBRE CARGO FISCALIZACIÓN QUE OCUPA:",null,null,"c PROP PJ",{"$f":"H60","v":0},"ORGANISMO /s DONDE SE INSCRIBIÓ CONSTITUCIÓN (INDICAR LOCALIDAD/PCIA DEL ORG) -si no se inscribió poner: NO INSCRIPTO/A:"]
["c PROP PH",{"$f":"IF(E63=0,0,B48)","v":0},{"$f":"IF(E63=0,0,C48)","v":0},"NOTA/OBSERVACIÓN -en mayúscula-:",null,null,"c PROP PJ",{"$f":"IF(I63=\"\",0,H60)","v":0},{"$f":"IF(OR(J62=\"NO INSCRIPTO/A\",J62=\"NO INSCR.\", J62=\"NO INSCR\",J62=\"N/I\", J62= \"NO INSCRIPTO\",J62=\"NO INSCRIPTA\"),\"\",\"DATOS DE RESOLUCIÓN Y FECHA DE INSCRIPCIÓN:\")","v":"DATOS DE RESOLUCIÓN Y FECHA DE INSCRIPCIÓN:"}]
["c PROP PH",null,0,"DOC. IDENTIDAD –sin puntos-:",null,null,"c PROP PJ",{"$f":"IF(I64=\"\",0,H60)","v":0},{"$f":"IF(I63=\"\",\"\",\"FECHA DE INSCRIPCION:\")","v":"FECHA DE INSCRIPCION:"}]
["c PROP PH",{"$f":"+B64","v":0},{"$f":"+C64","v":0},"CUIT/CUIL –sin puntos ni barras-:",null,null,"c PROP PJ",{"$f":"H60","v":0},"APELLIDO/S, NOMBRE/S,  DNI Y CARGO DE CADA MIEMBRO DE SU ADMINISTRACIÓN:"]
["c PROP PH",{"$f":"+B65","v":0},0,"FECHA DE NACIMIENTO –dd/mm/aa-:",null,null,"c PROP PJ",{"$f":"IF(AND(J67>0,J66=0),0,H60)","v":0},"DOMICILIO SOCIAL:"]
["c PROP PH",0,0,"LUGAR DE NACIMIENTO:",null,null,"c PROP PJ",{"$f":"IF(AND(J66>0,J67=0),0,H60)","v":0},"SEDE SOCIAL:"]
["c PROP PH",0,0,"NACIONALIDAD:",null,null,"c PROP PJ",{"$f":"H60","v":0},"CEL/TEL :"]
["c PROP PH",0,0,"PROFESIÓN/OFICIO:",null,null,"c PROP PJ",{"$f":"H60","v":0},"OBJETO PRINCIPAL (EN FORMA RESUMIDA):"]
["c PROP PH",0,0,"DOMICILIO REAL:",null,null,"c PROP PJ",{"$f":"IF(J70=0,0,H60)","v":0},"NOTA/OBSERVACIÓN -en mayúscula-:"]
["c PROP PH",0,0,"CEL/TEL :",null,null,"c PROP PJ",null,"CUIT –sin puntos ni barras-:"]
["c PROP PH",{"$f":"IF(E72=0,0,B64)","v":0},{"$f":"IF(E72=0,0,C64)","v":0},"EMAIL:",null,null,"c PROP PJ",{"$f":"H71","v":0},"TIPO DE PERSONA JCA -FONDO DE COMERCIO, asociación, mutual, etc-:"]
["c PROP PH",{"$f":"B64","v":0},{"$f":"C64","v":0},"ESTADO CIVIL:",null,null,"c PROP PJ",{"$f":"H71","v":0},"ORGANISMO /s DONDE SE INSCRIBIÓ CONSTITUCIÓN (INDICAR LOCALIDAD/PCIA DEL ORG) -si no se inscribió poner: NO INSCRIPTO/A:"]
["c PROP PH",{"$f":"IF($E73=\"CASADO/A\",B64,0)","v":0},{"$f":"IF($E73=\"CASADO/A\",C64,0)","v":0},{"$f":"IF(E73=\"CASADO/A\",\"APELLIDO/S CÓNYUGE:\",\"\")","v":""},null,null,"c PROP PJ",{"$f":"IF(I74=\"\",0,H71)","v":0},{"$f":"IF(OR(J73=\"NO INSCRIPTO/A\",J73=\"NO INSCR.\", J73=\"NO INSCR\",J73=\"N/I\", J73= \"NO INSCRIPTO\",J73=\"NO INSCRIPTA\"),\"\",\"DATOS DE RESOLUCIÓN Y FECHA DE INSCRIPCIÓN:\")","v":"DATOS DE RESOLUCIÓN Y FECHA DE INSCRIPCIÓN:"}]
["c PROP PH",{"$f":"IF($E73=\"CASADO/A\",B64,0)","v":0},{"$f":"IF($E73=\"CASADO/A\",C64,0)","v":0},{"$f":"IF(E73=\"CASADO/A\",\"NOMBRE/S CÓNYUGE:\",\"\")","v":""},null,null,"c PROP PJ",{"$f":"IF(I75=\"\",0,H71)","v":0},{"$f":"IF(I74=\"\",\"\",\"FECHA DE INSCRIPCION:\")","v":"FECHA DE INSCRIPCION:"}]
["c PROP PH",{"$f":"IF($E73=\"CASADO/A\",B64,0)","v":0},{"$f":"IF($E73=\"CASADO/A\",C64,0)","v":0},{"$f":"IF(E73=\"CASADO/A\",\"DOC. IDENTIDAD (cónyuge) –sin puntos ni barras-:\",\"\")","v":""},null,null,"c PROP PJ",{"$f":"H71","v":0},"APELLIDO/S, NOMBRE/S,  DNI Y CARGO DE CADA MIEMBRO DE SU ADMINISTRACIÓN:"]
["i ORG. REP. LEGAL/ ADM.",{"$f":"IF(E77=0,0,B64)","v":0},{"$f":"IF(E77=0,0,C64)","v":0},"NOMBRE CARGO REP. LEGAL/ ADMINISTRACIÓN QUE OCUPA:",null,null,"c PROP PJ",{"$f":"IF(AND(J78>0,J77=0),0,H71)","v":0},"DOMICILIO SOCIAL:"]
["j ORG. FISCALIZ.",{"$f":"IF(E78=0,0,B64)","v":0},{"$f":"IF(E78=0,0,C64)","v":0},"NOMBRE CARGO FISCALIZACIÓN QUE OCUPA:",null,null,"c PROP PJ",{"$f":"IF(AND(J77>0,J78=0),0,H71)","v":0},"SEDE SOCIAL:"]
["c PROP PH",{"$f":"IF(E79=0,0,B64)","v":0},{"$f":"IF(E79=0,0,C64)","v":0},"NOTA/OBSERVACIÓN -en mayúscula-:",null,null,"c PROP PJ",{"$f":"H71","v":0},"CEL/TEL :"]
["c PROP PH",null,0,"DOC. IDENTIDAD –sin puntos-:",null,null,"c PROP PJ",{"$f":"H71","v":0},"OBJETO PRINCIPAL (EN FORMA RESUMIDA):"]
["c PROP PH",{"$f":"+B80","v":0},{"$f":"+C80","v":0},"CUIT/CUIL –sin puntos ni barras-:",null,null,"c PROP PJ",{"$f":"IF(J81=0,0,H71)","v":0},"NOTA/OBSERVACIÓN -en mayúscula-:"]
["c PROP PH",{"$f":"+B81","v":0},0,"FECHA DE NACIMIENTO –dd/mm/aa-:",null,null,"c PROP PJ",null,"CUIT –sin puntos ni barras-:"]
["c PROP PH",0,0,"LUGAR DE NACIMIENTO:",null,null,"c PROP PJ",{"$f":"H82","v":0},"TIPO DE PERSONA JCA -FONDO DE COMERCIO, asociación, mutual, etc-:"]
["c PROP PH",0,0,"NACIONALIDAD:",null,null,"c PROP PJ",{"$f":"H82","v":0},"ORGANISMO /s DONDE SE INSCRIBIÓ CONSTITUCIÓN (INDICAR LOCALIDAD/PCIA DEL ORG) -si no se inscribió poner: NO INSCRIPTO/A:"]
["c PROP PH",0,0,"PROFESIÓN/OFICIO:",null,null,"c PROP PJ",{"$f":"IF(I85=\"\",0,H82)","v":0},{"$f":"IF(OR(J84=\"NO INSCRIPTO/A\",J84=\"NO INSCR.\", J84=\"NO INSCR\",J84=\"N/I\", J84= \"NO INSCRIPTO\",J84=\"NO INSCRIPTA\"),\"\",\"DATOS DE RESOLUCIÓN Y FECHA DE INSCRIPCIÓN:\")","v":"DATOS DE RESOLUCIÓN Y FECHA DE INSCRIPCIÓN:"}]
["c PROP PH",0,0,"DOMICILIO REAL:",null,null,"c PROP PJ",{"$f":"IF(I86=\"\",0,H82)","v":0},{"$f":"IF(I85=\"\",\"\",\"FECHA DE INSCRIPCION:\")","v":"FECHA DE INSCRIPCION:"}]
["c PROP PH",0,0,"CEL/TEL :",null,null,"c PROP PJ",{"$f":"H82","v":0},"APELLIDO/S, NOMBRE/S,  DNI Y CARGO DE CADA MIEMBRO DE SU ADMINISTRACIÓN:"]
["c PROP PH",{"$f":"IF(E88=0,0,B80)","v":0},{"$f":"IF(E88=0,0,C80)","v":0},"EMAIL:",null,null,"c PROP PJ",{"$f":"IF(AND(J89>0,J88=0),0,H82)","v":0},"DOMICILIO SOCIAL:"]
["c PROP PH",{"$f":"B80","v":0},{"$f":"C80","v":0},"ESTADO CIVIL:",null,null,"c PROP PJ",{"$f":"IF(AND(J88>0,J89=0),0,H82)","v":0},"SEDE SOCIAL:"]
["c PROP PH",{"$f":"IF($E89=\"CASADO/A\",B80,0)","v":0},{"$f":"IF($E89=\"CASADO/A\",C80,0)","v":0},{"$f":"IF(E89=\"CASADO/A\",\"APELLIDO/S CÓNYUGE:\",\"\")","v":""},null,null,"c PROP PJ",{"$f":"H82","v":0},"CEL/TEL :"]
["c PROP PH",{"$f":"IF($E89=\"CASADO/A\",B80,0)","v":0},{"$f":"IF($E89=\"CASADO/A\",C80,0)","v":0},{"$f":"IF(E89=\"CASADO/A\",\"NOMBRE/S CÓNYUGE:\",\"\")","v":""},null,null,"c PROP PJ",{"$f":"H82","v":0},"OBJETO PRINCIPAL (EN FORMA RESUMIDA):"]
["c PROP PH",{"$f":"IF($E89=\"CASADO/A\",B80,0)","v":0},{"$f":"IF($E89=\"CASADO/A\",C80,0)","v":0},{"$f":"IF(E89=\"CASADO/A\",\"DOC. IDENTIDAD (cónyuge) –sin puntos ni barras-:\",\"\")","v":""},null,null,"c PROP PJ",{"$f":"IF(J92=0,0,H82)","v":0},"NOTA/OBSERVACIÓN -en mayúscula-:"]
["i ORG. REP. LEGAL/ ADM.",{"$f":"IF(E93=0,0,B80)","v":0},{"$f":"IF(E93=0,0,C80)","v":0},"NOMBRE CARGO REP. LEGAL/ ADMINISTRACIÓN QUE OCUPA:",null,null,"c PROP PJ",null,"CUIT –sin puntos ni barras-:"]
["j ORG. FISCALIZ.",{"$f":"IF(E94=0,0,B80)","v":0},{"$f":"IF(E94=0,0,C80)","v":0},"NOMBRE CARGO FISCALIZACIÓN QUE OCUPA:",null,null,"c PROP PJ",{"$f":"H93","v":0},"TIPO DE PERSONA JCA -FONDO DE COMERCIO, asociación, mutual, etc-:"]
["c PROP PH",{"$f":"IF(E95=0,0,B80)","v":0},{"$f":"IF(E95=0,0,C80)","v":0},"NOTA/OBSERVACIÓN -en mayúscula-:",null,null,"c PROP PJ",{"$f":"H93","v":0},"ORGANISMO /s DONDE SE INSCRIBIÓ CONSTITUCIÓN (INDICAR LOCALIDAD/PCIA DEL ORG) -si no se inscribió poner: NO INSCRIPTO/A:"]
["c PROP PH",null,0,"DOC. IDENTIDAD –sin puntos-:",null,null,"c PROP PJ",{"$f":"IF(I96=\"\",0,H93)","v":0},{"$f":"IF(OR(J95=\"NO INSCRIPTO/A\",J95=\"NO INSCR.\", J95=\"NO INSCR\",J95=\"N/I\", J95= \"NO INSCRIPTO\",J95=\"NO INSCRIPTA\"),\"\",\"DATOS DE RESOLUCIÓN Y FECHA DE INSCRIPCIÓN:\")","v":"DATOS DE RESOLUCIÓN Y FECHA DE INSCRIPCIÓN:"}]
["c PROP PH",{"$f":"+B96","v":0},{"$f":"+C96","v":0},"CUIT/CUIL –sin puntos ni barras-:",null,null,"c PROP PJ",{"$f":"IF(I97=\"\",0,H93)","v":0},{"$f":"IF(I96=\"\",\"\",\"FECHA DE INSCRIPCION:\")","v":"FECHA DE INSCRIPCION:"}]
["c PROP PH",{"$f":"+B97","v":0},0,"FECHA DE NACIMIENTO –dd/mm/aa-:",null,null,"c PROP PJ",{"$f":"H93","v":0},"APELLIDO/S, NOMBRE/S,  DNI Y CARGO DE CADA MIEMBRO DE SU ADMINISTRACIÓN:"]
["c PROP PH",0,0,"LUGAR DE NACIMIENTO:",null,null,"c PROP PJ",{"$f":"IF(AND(J100>0,J99=0),0,H93)","v":0},"DOMICILIO SOCIAL:"]
["c PROP PH",0,0,"NACIONALIDAD:",null,null,"c PROP PJ",{"$f":"IF(AND(J99>0,J100=0),0,H93)","v":0},"SEDE SOCIAL:"]
["c PROP PH",0,0,"PROFESIÓN/OFICIO:",null,null,"c PROP PJ",{"$f":"H93","v":0},"CEL/TEL :"]
["c PROP PH",0,0,"DOMICILIO REAL:",null,null,"c PROP PJ",{"$f":"H93","v":0},"OBJETO PRINCIPAL (EN FORMA RESUMIDA):"]
["c PROP PH",0,0,"CEL/TEL :",null,null,"c PROP PJ",{"$f":"IF(J103=0,0,H93)","v":0},"NOTA/OBSERVACIÓN -en mayúscula-:"]
["c PROP PH",{"$f":"IF(E104=0,0,B96)","v":0},{"$f":"IF(E104=0,0,C96)","v":0},"EMAIL:",null,null,"c PROP PJ",null,"CUIT –sin puntos ni barras-:"]
["c PROP PH",{"$f":"B96","v":0},{"$f":"C96","v":0},"ESTADO CIVIL:",null,null,"c PROP PJ",{"$f":"H104","v":0},"TIPO DE PERSONA JCA -FONDO DE COMERCIO, asociación, mutual, etc-:"]
["c PROP PH",{"$f":"IF($E105=\"CASADO/A\",B96,0)","v":0},{"$f":"IF($E105=\"CASADO/A\",C96,0)","v":0},{"$f":"IF(E105=\"CASADO/A\",\"APELLIDO/S CÓNYUGE:\",\"\")","v":""},null,null,"c PROP PJ",{"$f":"H104","v":0},"ORGANISMO /s DONDE SE INSCRIBIÓ CONSTITUCIÓN (INDICAR LOCALIDAD/PCIA DEL ORG) -si no se inscribió poner: NO INSCRIPTO/A:"]
["c PROP PH",{"$f":"IF($E105=\"CASADO/A\",B96,0)","v":0},{"$f":"IF($E105=\"CASADO/A\",C96,0)","v":0},{"$f":"IF(E105=\"CASADO/A\",\"NOMBRE/S CÓNYUGE:\",\"\")","v":""},null,null,"c PROP PJ",{"$f":"IF(I107=\"\",0,H104)","v":0},{"$f":"IF(OR(J106=\"NO INSCRIPTO/A\",J106=\"NO INSCR.\", J106=\"NO INSCR\",J106=\"N/I\", J106= \"NO INSCRIPTO\",J106=\"NO INSCRIPTA\"),\"\",\"DATOS DE RESOLUCIÓN Y FECHA DE INSCRIPCIÓN:\")","v":"DATOS DE RESOLUCIÓN Y FECHA DE INSCRIPCIÓN:"}]
["c PROP PH",{"$f":"IF($E105=\"CASADO/A\",B96,0)","v":0},{"$f":"IF($E105=\"CASADO/A\",C96,0)","v":0},{"$f":"IF(E105=\"CASADO/A\",\"DOC. IDENTIDAD (cónyuge) –sin puntos ni barras-:\",\"\")","v":""},null,null,"c PROP PJ",{"$f":"IF(I108=\"\",0,H104)","v":0},{"$f":"IF(I107=\"\",\"\",\"FECHA DE INSCRIPCION:\")","v":"FECHA DE INSCRIPCION:"}]
["i ORG. REP. LEGAL/ ADM.",{"$f":"IF(E109=0,0,B96)","v":0},{"$f":"IF(E109=0,0,C96)","v":0},"NOMBRE CARGO REP. LEGAL/ ADMINISTRACIÓN QUE OCUPA:",null,null,"c PROP PJ",{"$f":"H104","v":0},"APELLIDO/S, NOMBRE/S,  DNI Y CARGO DE CADA MIEMBRO DE SU ADMINISTRACIÓN:"]
["j ORG. FISCALIZ.",{"$f":"IF(E110=0,0,B96)","v":0},{"$f":"IF(E110=0,0,C96)","v":0},"NOMBRE CARGO FISCALIZACIÓN QUE OCUPA:",null,null,"c PROP PJ",{"$f":"IF(AND(J111>0,J110=0),0,H104)","v":0},"DOMICILIO SOCIAL:"]
["c PROP PH",{"$f":"IF(E111=0,0,B96)","v":0},{"$f":"IF(E111=0,0,C96)","v":0},"NOTA/OBSERVACIÓN -en mayúscula-:",null,null,"c PROP PJ",{"$f":"IF(AND(J110>0,J111=0),0,H104)","v":0},"SEDE SOCIAL:"]
["c PROP PH",null,0,"DOC. IDENTIDAD –sin puntos-:",null,null,"c PROP PJ",{"$f":"H104","v":0},"CEL/TEL :"]
["c PROP PH",{"$f":"+B112","v":0},{"$f":"+C112","v":0},"CUIT/CUIL –sin puntos ni barras-:",null,null,"c PROP PJ",{"$f":"H104","v":0},"OBJETO PRINCIPAL (EN FORMA RESUMIDA):"]
["c PROP PH",{"$f":"+B113","v":0},0,"FECHA DE NACIMIENTO –dd/mm/aa-:",null,null,"c PROP PJ",{"$f":"IF(J114=0,0,H104)","v":0},"NOTA/OBSERVACIÓN -en mayúscula-:"]
["c PROP PH",0,0,"LUGAR DE NACIMIENTO:",null,null,"c PROP PJ",null,"CUIT –sin puntos ni barras-:"]
["c PROP PH",0,0,"NACIONALIDAD:",null,null,"c PROP PJ",{"$f":"H115","v":0},"TIPO DE PERSONA JCA -FONDO DE COMERCIO, asociación, mutual, etc-:"]
["c PROP PH",0,0,"PROFESIÓN/OFICIO:",null,null,"c PROP PJ",{"$f":"H115","v":0},"ORGANISMO /s DONDE SE INSCRIBIÓ CONSTITUCIÓN (INDICAR LOCALIDAD/PCIA DEL ORG) -si no se inscribió poner: NO INSCRIPTO/A:"]
["c PROP PH",0,0,"DOMICILIO REAL:",null,null,"c PROP PJ",{"$f":"IF(I118=\"\",0,H115)","v":0},{"$f":"IF(OR(J117=\"NO INSCRIPTO/A\",J117=\"NO INSCR.\", J117=\"NO INSCR\",J117=\"N/I\", J117= \"NO INSCRIPTO\",J117=\"NO INSCRIPTA\"),\"\",\"DATOS DE RESOLUCIÓN Y FECHA DE INSCRIPCIÓN:\")","v":"DATOS DE RESOLUCIÓN Y FECHA DE INSCRIPCIÓN:"}]
["c PROP PH",0,0,"CEL/TEL :",null,null,"c PROP PJ",{"$f":"IF(I119=\"\",0,H115)","v":0},{"$f":"IF(I118=\"\",\"\",\"FECHA DE INSCRIPCION:\")","v":"FECHA DE INSCRIPCION:"}]
["c PROP PH",{"$f":"IF(E120=0,0,B112)","v":0},{"$f":"IF(E120=0,0,C112)","v":0},"EMAIL:",null,null,"c PROP PJ",{"$f":"H115","v":0},"APELLIDO/S, NOMBRE/S,  DNI Y CARGO DE CADA MIEMBRO DE SU ADMINISTRACIÓN:"]
["c PROP PH",{"$f":"B112","v":0},{"$f":"C112","v":0},"ESTADO CIVIL:",null,null,"c PROP PJ",{"$f":"IF(AND(J122>0,J121=0),0,H115)","v":0},"DOMICILIO SOCIAL:"]
["c PROP PH",{"$f":"IF($E121=\"CASADO/A\",B112,0)","v":0},{"$f":"IF($E121=\"CASADO/A\",C112,0)","v":0},{"$f":"IF(E121=\"CASADO/A\",\"APELLIDO/S CÓNYUGE:\",\"\")","v":""},null,null,"c PROP PJ",{"$f":"IF(AND(J121>0,J122=0),0,H115)","v":0},"SEDE SOCIAL:"]
["c PROP PH",{"$f":"IF($E121=\"CASADO/A\",B112,0)","v":0},{"$f":"IF($E121=\"CASADO/A\",C112,0)","v":0},{"$f":"IF(E121=\"CASADO/A\",\"NOMBRE/S CÓNYUGE:\",\"\")","v":""},null,null,"c PROP PJ",{"$f":"H115","v":0},"CEL/TEL :"]
["c PROP PH",{"$f":"IF($E121=\"CASADO/A\",B112,0)","v":0},{"$f":"IF($E121=\"CASADO/A\",C112,0)","v":0},{"$f":"IF(E121=\"CASADO/A\",\"DOC. IDENTIDAD (cónyuge) –sin puntos ni barras-:\",\"\")","v":""},null,null,"c PROP PJ",{"$f":"H115","v":0},"OBJETO PRINCIPAL (EN FORMA RESUMIDA):"]
["i ORG. REP. LEGAL/ ADM.",{"$f":"IF(E125=0,0,B112)","v":0},{"$f":"IF(E125=0,0,C112)","v":0},"NOMBRE CARGO REP. LEGAL/ ADMINISTRACIÓN QUE OCUPA:",null,null,"c PROP PJ",{"$f":"IF(J125=0,0,H115)","v":0},"NOTA/OBSERVACIÓN -en mayúscula-:"]
["j ORG. FISCALIZ.",{"$f":"IF(E126=0,0,B112)","v":0},{"$f":"IF(E126=0,0,C112)","v":0},"NOMBRE CARGO FISCALIZACIÓN QUE OCUPA:"]
["c PROP PH",{"$f":"IF(E127=0,0,B112)","v":0},{"$f":"IF(E127=0,0,C112)","v":0},"NOTA/OBSERVACIÓN -en mayúscula-:"]
["c PROP PH",null,0,"DOC. IDENTIDAD –sin puntos-:"]
["c PROP PH",{"$f":"+B128","v":0},{"$f":"+C128","v":0},"CUIT/CUIL –sin puntos ni barras-:"]
["c PROP PH",{"$f":"+B129","v":0},0,"FECHA DE NACIMIENTO –dd/mm/aa-:"]
["c PROP PH",0,0,"LUGAR DE NACIMIENTO:"]
["c PROP PH",0,0,"NACIONALIDAD:"]
["c PROP PH",0,0,"PROFESIÓN/OFICIO:"]
["c PROP PH",0,0,"DOMICILIO REAL:"]
["c PROP PH",0,0,"CEL/TEL :"]
["c PROP PH",{"$f":"IF(E136=0,0,B128)","v":0},{"$f":"IF(E136=0,0,C128)","v":0},"EMAIL:"]
["c PROP PH",{"$f":"B128","v":0},{"$f":"C128","v":0},"ESTADO CIVIL:"]
["c PROP PH",{"$f":"IF($E137=\"CASADO/A\",B128,0)","v":0},{"$f":"IF($E137=\"CASADO/A\",C128,0)","v":0},{"$f":"IF(E137=\"CASADO/A\",\"APELLIDO/S CÓNYUGE:\",\"\")","v":""}]
["c PROP PH",{"$f":"IF($E137=\"CASADO/A\",B128,0)","v":0},{"$f":"IF($E137=\"CASADO/A\",C128,0)","v":0},{"$f":"IF(E137=\"CASADO/A\",\"NOMBRE/S CÓNYUGE:\",\"\")","v":""}]
["c PROP PH",{"$f":"IF($E137=\"CASADO/A\",B128,0)","v":0},{"$f":"IF($E137=\"CASADO/A\",C128,0)","v":0},{"$f":"IF(E137=\"CASADO/A\",\"DOC. IDENTIDAD (cónyuge) –sin puntos ni barras-:\",\"\")","v":""}]
["i ORG. REP. LEGAL/ ADM.",{"$f":"IF(E141=0,0,B128)","v":0},{"$f":"IF(E141=0,0,C128)","v":0},"NOMBRE CARGO REP. LEGAL/ ADMINISTRACIÓN QUE OCUPA:"]
["j ORG. FISCALIZ.",{"$f":"IF(E142=0,0,B128)","v":0},{"$f":"IF(E142=0,0,C128)","v":0},"NOMBRE CARGO FISCALIZACIÓN QUE OCUPA:"]
["c PROP PH",{"$f":"IF(E143=0,0,B128)","v":0},{"$f":"IF(E143=0,0,C128)","v":0},"NOTA/OBSERVACIÓN -en mayúscula-:"]
["c PROP PH",null,0,"DOC. IDENTIDAD –sin puntos-:"]
["c PROP PH",{"$f":"+B144","v":0},{"$f":"+C144","v":0},"CUIT/CUIL –sin puntos ni barras-:"]
["c PROP PH",{"$f":"+B145","v":0},0,"FECHA DE NACIMIENTO –dd/mm/aa-:"]
["c PROP PH",0,0,"LUGAR DE NACIMIENTO:"]
["c PROP PH",0,0,"NACIONALIDAD:"]
["c PROP PH",0,0,"PROFESIÓN/OFICIO:"]
["c PROP PH",0,0,"DOMICILIO REAL:"]
["c PROP PH",0,0,"CEL/TEL :"]
["c PROP PH",{"$f":"IF(E152=0,0,B144)","v":0},{"$f":"IF(E152=0,0,C144)","v":0},"EMAIL:"]
["c PROP PH",{"$f":"B144","v":0},{"$f":"C144","v":0},"ESTADO CIVIL:"]
["c PROP PH",{"$f":"IF($E153=\"CASADO/A\",B144,0)","v":0},{"$f":"IF($E153=\"CASADO/A\",C144,0)","v":0},{"$f":"IF(E153=\"CASADO/A\",\"APELLIDO/S CÓNYUGE:\",\"\")","v":""}]
["c PROP PH",{"$f":"IF($E153=\"CASADO/A\",B144,0)","v":0},{"$f":"IF($E153=\"CASADO/A\",C144,0)","v":0},{"$f":"IF(E153=\"CASADO/A\",\"NOMBRE/S CÓNYUGE:\",\"\")","v":""}]
["c PROP PH",{"$f":"IF($E153=\"CASADO/A\",B144,0)","v":0},{"$f":"IF($E153=\"CASADO/A\",C144,0)","v":0},{"$f":"IF(E153=\"CASADO/A\",\"DOC. IDENTIDAD (cónyuge) –sin puntos ni barras-:\",\"\")","v":""}]
["i ORG. REP. LEGAL/ ADM.",{"$f":"IF(E157=0,0,B144)","v":0},{"$f":"IF(E157=0,0,C144)","v":0},"NOMBRE CARGO REP. LEGAL/ ADMINISTRACIÓN QUE OCUPA:"]
["j ORG. FISCALIZ.",{"$f":"IF(E158=0,0,B144)","v":0},{"$f":"IF(E158=0,0,C144)","v":0},"NOMBRE CARGO FISCALIZACIÓN QUE OCUPA:"]
["c PROP PH",{"$f":"IF(E159=0,0,B144)","v":0},{"$f":"IF(E159=0,0,C144)","v":0},"NOTA/OBSERVACIÓN -en mayúscula-:"]
["c PROP PH",null,0,"DOC. IDENTIDAD –sin puntos-:"]
["c PROP PH",{"$f":"+B160","v":0},{"$f":"+C160","v":0},"CUIT/CUIL –sin puntos ni barras-:"]
["c PROP PH",{"$f":"+B161","v":0},0,"FECHA DE NACIMIENTO –dd/mm/aa-:"]
["c PROP PH",0,0,"LUGAR DE NACIMIENTO:"]
["c PROP PH",0,0,"NACIONALIDAD:"]
["c PROP PH",0,0,"PROFESIÓN/OFICIO:"]
["c PROP PH",0,0,"DOMICILIO REAL:"]
["c PROP PH",0,0,"CEL/TEL :"]
["c PROP PH",{"$f":"IF(E168=0,0,B160)","v":0},{"$f":"IF(E168=0,0,C160)","v":0},"EMAIL:"]
["c PROP PH",{"$f":"B160","v":0},{"$f":"C160","v":0},"ESTADO CIVIL:"]
["c PROP PH",{"$f":"IF($E169=\"CASADO/A\",B160,0)","v":0},{"$f":"IF($E169=\"CASADO/A\",C160,0)","v":0},{"$f":"IF(E169=\"CASADO/A\",\"APELLIDO/S CÓNYUGE:\",\"\")","v":""}]
["c PROP PH",{"$f":"IF($E169=\"CASADO/A\",B160,0)","v":0},{"$f":"IF($E169=\"CASADO/A\",C160,0)","v":0},{"$f":"IF(E169=\"CASADO/A\",\"NOMBRE/S CÓNYUGE:\",\"\")","v":""}]
["c PROP PH",{"$f":"IF($E169=\"CASADO/A\",B160,0)","v":0},{"$f":"IF($E169=\"CASADO/A\",C160,0)","v":0},{"$f":"IF(E169=\"CASADO/A\",\"DOC. IDENTIDAD (cónyuge) –sin puntos ni barras-:\",\"\")","v":""}]
["i ORG. REP. LEGAL/ ADM.",{"$f":"IF(E173=0,0,B160)","v":0},{"$f":"IF(E173=0,0,C160)","v":0},"NOMBRE CARGO REP. LEGAL/ ADMINISTRACIÓN QUE OCUPA:"]
["j ORG. FISCALIZ.",{"$f":"IF(E174=0,0,B160)","v":0},{"$f":"IF(E174=0,0,C160)","v":0},"NOMBRE CARGO FISCALIZACIÓN QUE OCUPA:"]
["c PROP PH",{"$f":"IF(E175=0,0,B160)","v":0},{"$f":"IF(E175=0,0,C160)","v":0},"NOTA/OBSERVACIÓN -en mayúscula-:"]

{"sheet":"NO PROPIETARIOS adm actuales","index":3,"n_rows":247,"n_cols":4,"rows_kept":247,"cut":false,"hidden":false,"merged":[[1,0,1,4],[2,0,2,4],[3,0,3,2],[3,3,3,4],[6,3,6,4],[5,0,5,4]]}
[{"$f":"+'DATOS FC'!A1","v":"DATOS TRANSFERENCIA FONDO DE COMERCIO"}]
["(COMPLETAR CELDAS CON FONDO VERDE)"]
[{"$f":"+'DATOS FC'!A3:E3","v":"REGISTRO PÚBLICO DE COMERCIO, Juzgado Pcial. de 1era. Instancia en los Civil, Comercial, Laboral, Minería y Familia, con asiento en la localidad de LAS HERAS -Pcia. de Sta. Cruz, Simón Bolivar 482 (CP9017)-"}]
["NOMBRE DEL FONDO DE COMERCIO:",null,null,{"$f":"+'DATOS FC'!D4:E4","v":0}]
[null,"FECHA:",{"$f":"+'DATOS FC'!D5","v":"00:00:00"}]
["TERCEROS -NO PROPIETARIOS- INTEGRANTES DE LOS ORGANOS DEL FONDO DE COMERCIO"]
["REFER.","APELLIDO/s DEL TERCERO","APELLIDO/s DEL TERCERO","DATOS"]
["l NO PROPIETARIO",null,null,"DOC. IDENTIDAD –sin puntos-:"]
["l NO PROPIETARIO",{"$f":"B8","v":0},{"$f":"C8","v":0},"CUIT/CUIL –sin puntos ni barras-:"]
["l NO PROPIETARIO",{"$f":"B8","v":0},{"$f":"C8","v":0},"FECHA DE NACIMIENTO –dd/mm/aa-:"]
["l NO PROPIETARIO",{"$f":"B8","v":0},{"$f":"C8","v":0},"LUGAR DE NACIMIENTO:"]
["l NO PROPIETARIO",{"$f":"B8","v":0},{"$f":"C8","v":0},"NACIONALIDAD:"]
["l NO PROPIETARIO",{"$f":"B8","v":0},{"$f":"C8","v":0},"PROFESIÓN/OFICIO:"]
["l NO PROPIETARIO",{"$f":"B8","v":0},{"$f":"C8","v":0},"DOMICILIO REAL:"]
["l NO PROPIETARIO",{"$f":"B8","v":0},{"$f":"C8","v":0},"CEL/TEL :"]
["l NO PROPIETARIO",{"$f":"+IF(E16=0,0,B8)","v":0},{"$f":"+IF(E16=0,0,C8)","v":0},"EMAIL:"]
["l NO PROPIETARIO",{"$f":"B8","v":0},{"$f":"C8","v":0},"ESTADO CIVIL:"]
["l NO PROPIETARIO",{"$f":"IF($E17=\"CASADO/A\",B8,0)","v":0},{"$f":"IF($E17=\"CASADO/A\",C8,0)","v":0},{"$f":"IF(E17=\"CASADO/A\",\"APELLIDO/S CÓNYUGE:\",\"\")","v":""}]
["l NO PROPIETARIO",{"$f":"IF($E17=\"CASADO/A\",B8,0)","v":0},{"$f":"IF($E17=\"CASADO/A\",C8,0)","v":0},{"$f":"IF(E17=\"CASADO/A\",\"NOMBRE/S CÓNYUGE:\",\"\")","v":""}]
["l NO PROPIETARIO",{"$f":"IF($E17=\"CASADO/A\",B8,0)","v":0},{"$f":"IF($E17=\"CASADO/A\",C8,0)","v":0},{"$f":"IF(E17=\"CASADO/A\",\"DOC. IDENTIDAD (cónyuge) –sin puntos ni barras-:\",\"\")","v":""}]
["i ORG. REP. LEGAL/ ADM.",{"$f":"IF(E21=0,0,B8)","v":0},{"$f":"IF(E21=0,0,C8)","v":0},"NOMBRE CARGO REP. LEGAL/ ADMINISTRACIÓN QUE OCUPA:"]
["j ORG. FISCALIZ.",{"$f":"IF(OR(E22=0,E22=\"PRESCINDE ART. 9 ACTO CONSTITUIVO\"),0,B8)","v":0},{"$f":"IF(OR(F22=0,E22=\"PRESCINDE ART.9 ACTO CONSTITUIVO\"),0,C8)","v":0},"NOMBRE CARGO FISCALIZACIÓN QUE OCUPA:"]
["l NO PROPIETARIO",{"$f":"IF(E23=0,0,B8)","v":0},{"$f":"IF(E23=0,0,C8)","v":0},"NOTA/OBSERVACIÓN -en mayúscula-:"]
["l NO PROPIETARIO",null,null,"DOC. IDENTIDAD –sin puntos-:"]
["l NO PROPIETARIO",{"$f":"B24","v":0},{"$f":"C24","v":0},"CUIT/CUIL –sin puntos ni barras-:"]
["l NO PROPIETARIO",{"$f":"B24","v":0},{"$f":"C24","v":0},"FECHA DE NACIMIENTO –dd/mm/aa-:"]
["l NO PROPIETARIO",{"$f":"B24","v":0},{"$f":"C24","v":0},"LUGAR DE NACIMIENTO:"]
["l NO PROPIETARIO",{"$f":"B24","v":0},{"$f":"C24","v":0},"NACIONALIDAD:"]
["l NO PROPIETARIO",{"$f":"B24","v":0},{"$f":"C24","v":0},"PROFESIÓN/OFICIO:"]
["l NO PROPIETARIO",{"$f":"B24","v":0},{"$f":"C24","v":0},"DOMICILIO REAL:"]
["l NO PROPIETARIO",{"$f":"B24","v":0},{"$f":"C24","v":0},"CEL/TEL :"]
["l NO PROPIETARIO",{"$f":"+IF(E32=0,0,B24)","v":0},{"$f":"+IF(E32=0,0,C24)","v":0},"EMAIL:"]
["l NO PROPIETARIO",{"$f":"B24","v":0},{"$f":"C24","v":0},"ESTADO CIVIL:"]
["l NO PROPIETARIO",{"$f":"IF($E33=\"CASADO/A\",B24,0)","v":0},{"$f":"IF($E33=\"CASADO/A\",C24,0)","v":0},{"$f":"IF(E33=\"CASADO/A\",\"APELLIDO/S CÓNYUGE:\",\"\")","v":""}]
["l NO PROPIETARIO",{"$f":"IF($E33=\"CASADO/A\",B24,0)","v":0},{"$f":"IF($E33=\"CASADO/A\",C24,0)","v":0},{"$f":"IF(E33=\"CASADO/A\",\"NOMBRE/S CÓNYUGE:\",\"\")","v":""}]
["l NO PROPIETARIO",{"$f":"IF($E33=\"CASADO/A\",B24,0)","v":0},{"$f":"IF($E33=\"CASADO/A\",C24,0)","v":0},{"$f":"IF(E33=\"CASADO/A\",\"DOC. IDENTIDAD (cónyuge) –sin puntos ni barras-:\",\"\")","v":""}]
["i ORG. REP. LEGAL/ ADM.",{"$f":"IF(E37=0,0,B24)","v":0},{"$f":"IF(E37=0,0,C24)","v":0},"NOMBRE CARGO REP. LEGAL/ ADMINISTRACIÓN QUE OCUPA:"]
["j ORG. FISCALIZ.",{"$f":"IF(OR(E38=0,E38=\"PRESCINDE ART. 9 ACTO CONSTITUIVO\"),0,B24)","v":0},{"$f":"IF(OR(F38=0,E38=\"PRESCINDE ART.9 ACTO CONSTITUIVO\"),0,C24)","v":0},"NOMBRE CARGO FISCALIZACIÓN QUE OCUPA:"]
["l NO PROPIETARIO",{"$f":"IF(E39=0,0,B24)","v":0},{"$f":"IF(E39=0,0,C24)","v":0},"NOTA/OBSERVACIÓN -en mayúscula-:"]
["l NO PROPIETARIO",null,null,"DOC. IDENTIDAD –sin puntos-:"]
["l NO PROPIETARIO",{"$f":"B40","v":0},{"$f":"C40","v":0},"CUIT/CUIL –sin puntos ni barras-:"]
["l NO PROPIETARIO",{"$f":"B40","v":0},{"$f":"C40","v":0},"FECHA DE NACIMIENTO –dd/mm/aa-:"]
["l NO PROPIETARIO",{"$f":"B40","v":0},{"$f":"C40","v":0},"LUGAR DE NACIMIENTO:"]
["l NO PROPIETARIO",{"$f":"B40","v":0},{"$f":"C40","v":0},"NACIONALIDAD:"]
["l NO PROPIETARIO",{"$f":"B40","v":0},{"$f":"C40","v":0},"PROFESIÓN/OFICIO:"]
["l NO PROPIETARIO",{"$f":"B40","v":0},{"$f":"C40","v":0},"DOMICILIO REAL:"]
["l NO PROPIETARIO",{"$f":"B40","v":0},{"$f":"C40","v":0},"CEL/TEL :"]
["l NO PROPIETARIO",{"$f":"+IF(E48=0,0,B40)","v":0},{"$f":"+IF(E48=0,0,C40)","v":0},"EMAIL:"]
["l NO PROPIETARIO",{"$f":"B40","v":0},{"$f":"C40","v":0},"ESTADO CIVIL:"]
["l NO PROPIETARIO",{"$f":"IF($E49=\"CASADO/A\",B40,0)","v":0},{"$f":"IF($E49=\"CASADO/A\",C40,0)","v":0},{"$f":"IF(E49=\"CASADO/A\",\"APELLIDO/S CÓNYUGE:\",\"\")","v":""}]
["l NO PROPIETARIO",{"$f":"IF($E49=\"CASADO/A\",B40,0)","v":0},{"$f":"IF($E49=\"CASADO/A\",C40,0)","v":0},{"$f":"IF(E49=\"CASADO/A\",\"NOMBRE/S CÓNYUGE:\",\"\")","v":""}]
["l NO PROPIETARIO",{"$f":"IF($E49=\"CASADO/A\",B40,0)","v":0},{"$f":"IF($E49=\"CASADO/A\",C40,0)","v":0},{"$f":"IF(E49=\"CASADO/A\",\"DOC. IDENTIDAD (cónyuge) –sin puntos ni barras-:\",\"\")","v":""}]
["i ORG. REP. LEGAL/ ADM.",{"$f":"IF(E53=0,0,B40)","v":0},{"$f":"IF(E53=0,0,C40)","v":0},"NOMBRE CARGO REP. LEGAL/ ADMINISTRACIÓN QUE OCUPA:"]
["j ORG. FISCALIZ.",{"$f":"IF(OR(E54=0,E54=\"PRESCINDE ART. 9 ACTO CONSTITUIVO\"),0,B40)","v":0},{"$f":"IF(OR(F54=0,E54=\"PRESCINDE ART.9 ACTO CONSTITUIVO\"),0,C40)","v":0},"NOMBRE CARGO FISCALIZACIÓN QUE OCUPA:"]
["l NO PROPIETARIO",{"$f":"IF(E55=0,0,B40)","v":0},{"$f":"IF(E55=0,0,C40)","v":0},"NOTA/OBSERVACIÓN -en mayúscula-:"]
["l NO PROPIETARIO",null,null,"DOC. IDENTIDAD –sin puntos-:"]
["l NO PROPIETARIO",{"$f":"B56","v":0},{"$f":"C56","v":0},"CUIT/CUIL –sin puntos ni barras-:"]
["l NO PROPIETARIO",{"$f":"B56","v":0},{"$f":"C56","v":0},"FECHA DE NACIMIENTO –dd/mm/aa-:"]
["l NO PROPIETARIO",{"$f":"B56","v":0},{"$f":"C56","v":0},"LUGAR DE NACIMIENTO:"]
["l NO PROPIETARIO",{"$f":"B56","v":0},{"$f":"C56","v":0},"NACIONALIDAD:"]
["l NO PROPIETARIO",{"$f":"B56","v":0},{"$f":"C56","v":0},"PROFESIÓN/OFICIO:"]
["l NO PROPIETARIO",{"$f":"B56","v":0},{"$f":"C56","v":0},"DOMICILIO REAL:"]
["l NO PROPIETARIO",{"$f":"B56","v":0},{"$f":"C56","v":0},"CEL/TEL :"]
["l NO PROPIETARIO",{"$f":"+IF(E64=0,0,B56)","v":0},{"$f":"+IF(E64=0,0,C56)","v":0},"EMAIL:"]
["l NO PROPIETARIO",{"$f":"B56","v":0},{"$f":"C56","v":0},"ESTADO CIVIL:"]
["l NO PROPIETARIO",{"$f":"IF($E65=\"CASADO/A\",B56,0)","v":0},{"$f":"IF($E65=\"CASADO/A\",C56,0)","v":0},{"$f":"IF(E65=\"CASADO/A\",\"APELLIDO/S CÓNYUGE:\",\"\")","v":""}]
["l NO PROPIETARIO",{"$f":"IF($E65=\"CASADO/A\",B56,0)","v":0},{"$f":"IF($E65=\"CASADO/A\",C56,0)","v":0},{"$f":"IF(E65=\"CASADO/A\",\"NOMBRE/S CÓNYUGE:\",\"\")","v":""}]
["l NO PROPIETARIO",{"$f":"IF($E65=\"CASADO/A\",B56,0)","v":0},{"$f":"IF($E65=\"CASADO/A\",C56,0)","v":0},{"$f":"IF(E65=\"CASADO/A\",\"DOC. IDENTIDAD (cónyuge) –sin puntos ni barras-:\",\"\")","v":""}]
["i ORG. REP. LEGAL/ ADM.",{"$f":"IF(E69=0,0,B56)","v":0},{"$f":"IF(E69=0,0,C56)","v":0},"NOMBRE CARGO REP. LEGAL/ ADMINISTRACIÓN QUE OCUPA:"]
["j ORG. FISCALIZ.",{"$f":"IF(OR(E70=0,E70=\"PRESCINDE ART. 9 ACTO CONSTITUIVO\"),0,B56)","v":0},{"$f":"IF(OR(F70=0,E70=\"PRESCINDE ART.9 ACTO CONSTITUIVO\"),0,C56)","v":0},"NOMBRE CARGO FISCALIZACIÓN QUE OCUPA:"]
["l NO PROPIETARIO",{"$f":"IF(E71=0,0,B56)","v":0},{"$f":"IF(E71=0,0,C56)","v":0},"NOTA/OBSERVACIÓN -en mayúscula-:"]
["l NO PROPIETARIO",null,null,"DOC. IDENTIDAD –sin puntos-:"]
["l NO PROPIETARIO",{"$f":"B72","v":0},{"$f":"C72","v":0},"CUIT/CUIL –sin puntos ni barras-:"]
["l NO PROPIETARIO",{"$f":"B72","v":0},{"$f":"C72","v":0},"FECHA DE NACIMIENTO –dd/mm/aa-:"]
["l NO PROPIETARIO",{"$f":"B72","v":0},{"$f":"C72","v":0},"LUGAR DE NACIMIENTO:"]
["l NO PROPIETARIO",{"$f":"B72","v":0},{"$f":"C72","v":0},"NACIONALIDAD:"]
["l NO PROPIETARIO",{"$f":"B72","v":0},{"$f":"C72","v":0},"PROFESIÓN/OFICIO:"]
["l NO PROPIETARIO",{"$f":"B72","v":0},{"$f":"C72","v":0},"DOMICILIO REAL:"]
["l NO PROPIETARIO",{"$f":"B72","v":0},{"$f":"C72","v":0},"CEL/TEL :"]
["l NO PROPIETARIO",{"$f":"+IF(E80=0,0,B72)","v":0},{"$f":"+IF(E80=0,0,C72)","v":0},"EMAIL:"]
["l NO PROPIETARIO",{"$f":"B72","v":0},{"$f":"C72","v":0},"ESTADO CIVIL:"]
["l NO PROPIETARIO",{"$f":"IF($E81=\"CASADO/A\",B72,0)","v":0},{"$f":"IF($E81=\"CASADO/A\",C72,0)","v":0},{"$f":"IF(E81=\"CASADO/A\",\"APELLIDO/S CÓNYUGE:\",\"\")","v":""}]
["l NO PROPIETARIO",{"$f":"IF($E81=\"CASADO/A\",B72,0)","v":0},{"$f":"IF($E81=\"CASADO/A\",C72,0)","v":0},{"$f":"IF(E81=\"CASADO/A\",\"NOMBRE/S CÓNYUGE:\",\"\")","v":""}]
["l NO PROPIETARIO",{"$f":"IF($E81=\"CASADO/A\",B72,0)","v":0},{"$f":"IF($E81=\"CASADO/A\",C72,0)","v":0},{"$f":"IF(E81=\"CASADO/A\",\"DOC. IDENTIDAD (cónyuge) –sin puntos ni barras-:\",\"\")","v":""}]
["i ORG. REP. LEGAL/ ADM.",{"$f":"IF(E85=0,0,B72)","v":0},{"$f":"IF(E85=0,0,C72)","v":0},"NOMBRE CARGO REP. LEGAL/ ADMINISTRACIÓN QUE OCUPA:"]
["j ORG. FISCALIZ.",{"$f":"IF(OR(E86=0,E86=\"PRESCINDE ART. 9 ACTO CONSTITUIVO\"),0,B72)","v":0},{"$f":"IF(OR(F86=0,E86=\"PRESCINDE ART.9 ACTO CONSTITUIVO\"),0,C72)","v":0},"NOMBRE CARGO FISCALIZACIÓN QUE OCUPA:"]
["l NO PROPIETARIO",{"$f":"IF(E87=0,0,B72)","v":0},{"$f":"IF(E87=0,0,C72)","v":0},"NOTA/OBSERVACIÓN -en mayúscula-:"]
["l NO PROPIETARIO",null,null,"DOC. IDENTIDAD –sin puntos-:"]
["l NO PROPIETARIO",{"$f":"B88","v":0},{"$f":"C88","v":0},"CUIT/CUIL –sin puntos ni barras-:"]
["l NO PROPIETARIO",{"$f":"B88","v":0},{"$f":"C88","v":0},"FECHA DE NACIMIENTO –dd/mm/aa-:"]
["l NO PROPIETARIO",{"$f":"B88","v":0},{"$f":"C88","v":0},"LUGAR DE NACIMIENTO:"]
["l NO PROPIETARIO",{"$f":"B88","v":0},{"$f":"C88","v":0},"NACIONALIDAD:"]
["l NO PROPIETARIO",{"$f":"B88","v":0},{"$f":"C88","v":0},"PROFESIÓN/OFICIO:"]
["l NO PROPIETARIO",{"$f":"B88","v":0},{"$f":"C88","v":0},"DOMICILIO REAL:"]
["l NO PROPIETARIO",{"$f":"B88","v":0},{"$f":"C88","v":0},"CEL/TEL :"]
["l NO PROPIETARIO",{"$f":"+IF(E96=0,0,B88)","v":0},{"$f":"+IF(E96=0,0,C88)","v":0},"EMAIL:"]
["l NO PROPIETARIO",{"$f":"B88","v":0},{"$f":"C88","v":0},"ESTADO CIVIL:"]
["l NO PROPIETARIO",{"$f":"IF($E97=\"CASADO/A\",B88,0)","v":0},{"$f":"IF($E97=\"CASADO/A\",C88,0)","v":0},{"$f":"IF(E97=\"CASADO/A\",\"APELLIDO/S CÓNYUGE:\",\"\")","v":""}]
["l NO PROPIETARIO",{"$f":"IF($E97=\"CASADO/A\",B88,0)","v":0},{"$f":"IF($E97=\"CASADO/A\",C88,0)","v":0},{"$f":"IF(E97=\"CASADO/A\",\"NOMBRE/S CÓNYUGE:\",\"\")","v":""}]
["l NO PROPIETARIO",{"$f":"IF($E97=\"CASADO/A\",B88,0)","v":0},{"$f":"IF($E97=\"CASADO/A\",C88,0)","v":0},{"$f":"IF(E97=\"CASADO/A\",\"DOC. IDENTIDAD (cónyuge) –sin puntos ni barras-:\",\"\")","v":""}]
["i ORG. REP. LEGAL/ ADM.",{"$f":"IF(E101=0,0,B88)","v":0},{"$f":"IF(E101=0,0,C88)","v":0},"NOMBRE CARGO REP. LEGAL/ ADMINISTRACIÓN QUE OCUPA:"]
["j ORG. FISCALIZ.",{"$f":"IF(OR(E102=0,E102=\"PRESCINDE ART. 9 ACTO CONSTITUIVO\"),0,B88)","v":0},{"$f":"IF(OR(F102=0,E102=\"PRESCINDE ART.9 ACTO CONSTITUIVO\"),0,C88)","v":0},"NOMBRE CARGO FISCALIZACIÓN QUE OCUPA:"]
["l NO PROPIETARIO",{"$f":"IF(E103=0,0,B88)","v":0},{"$f":"IF(E103=0,0,C88)","v":0},"NOTA/OBSERVACIÓN -en mayúscula-:"]
["l NO PROPIETARIO",null,null,"DOC. IDENTIDAD –sin puntos-:"]
["l NO PROPIETARIO",{"$f":"B104","v":0},{"$f":"C104","v":0},"CUIT/CUIL –sin puntos ni barras-:"]
["l NO PROPIETARIO",{"$f":"B104","v":0},{"$f":"C104","v":0},"FECHA DE NACIMIENTO –dd/mm/aa-:"]
["l NO PROPIETARIO",{"$f":"B104","v":0},{"$f":"C104","v":0},"LUGAR DE NACIMIENTO:"]
["l NO PROPIETARIO",{"$f":"B104","v":0},{"$f":"C104","v":0},"NACIONALIDAD:"]
["l NO PROPIETARIO",{"$f":"B104","v":0},{"$f":"C104","v":0},"PROFESIÓN/OFICIO:"]
["l NO PROPIETARIO",{"$f":"B104","v":0},{"$f":"C104","v":0},"DOMICILIO REAL:"]
["l NO PROPIETARIO",{"$f":"B104","v":0},{"$f":"C104","v":0},"CEL/TEL :"]
["l NO PROPIETARIO",{"$f":"+IF(E112=0,0,B104)","v":0},{"$f":"+IF(E112=0,0,C104)","v":0},"EMAIL:"]
["l NO PROPIETARIO",{"$f":"B104","v":0},{"$f":"C104","v":0},"ESTADO CIVIL:"]
["l NO PROPIETARIO",{"$f":"IF($E113=\"CASADO/A\",B104,0)","v":0},{"$f":"IF($E113=\"CASADO/A\",C104,0)","v":0},{"$f":"IF(E113=\"CASADO/A\",\"APELLIDO/S CÓNYUGE:\",\"\")","v":""}]
["l NO PROPIETARIO",{"$f":"IF($E113=\"CASADO/A\",B104,0)","v":0},{"$f":"IF($E113=\"CASADO/A\",C104,0)","v":0},{"$f":"IF(E113=\"CASADO/A\",\"NOMBRE/S CÓNYUGE:\",\"\")","v":""}]
["l NO PROPIETARIO",{"$f":"IF($E113=\"CASADO/A\",B104,0)","v":0},{"$f":"IF($E113=\"CASADO/A\",C104,0)","v":0},{"$f":"IF(E113=\"CASADO/A\",\"DOC. IDENTIDAD (cónyuge) –sin puntos ni barras-:\",\"\")","v":""}]
["i ORG. REP. LEGAL/ ADM.",{"$f":"IF(E117=0,0,B104)","v":0},{"$f":"IF(E117=0,0,C104)","v":0},"NOMBRE CARGO REP. LEGAL/ ADMINISTRACIÓN QUE OCUPA:"]
["j ORG. FISCALIZ.",{"$f":"IF(OR(E118=0,E118=\"PRESCINDE ART. 9 ACTO CONSTITUIVO\"),0,B104)","v":0},{"$f":"IF(OR(F118=0,E118=\"PRESCINDE ART.9 ACTO CONSTITUIVO\"),0,C104)","v":0},"NOMBRE CARGO FISCALIZACIÓN QUE OCUPA:"]
["l NO PROPIETARIO",{"$f":"IF(E119=0,0,B104)","v":0},{"$f":"IF(E119=0,0,C104)","v":0},"NOTA/OBSERVACIÓN -en mayúscula-:"]
["l NO PROPIETARIO",null,null,"DOC. IDENTIDAD –sin puntos-:"]
["l NO PROPIETARIO",{"$f":"B120","v":0},{"$f":"C120","v":0},"CUIT/CUIL –sin puntos ni barras-:"]
["l NO PROPIETARIO",{"$f":"B120","v":0},{"$f":"C120","v":0},"FECHA DE NACIMIENTO –dd/mm/aa-:"]
["l NO PROPIETARIO",{"$f":"B120","v":0},{"$f":"C120","v":0},"LUGAR DE NACIMIENTO:"]
["l NO PROPIETARIO",{"$f":"B120","v":0},{"$f":"C120","v":0},"NACIONALIDAD:"]
["l NO PROPIETARIO",{"$f":"B120","v":0},{"$f":"C120","v":0},"PROFESIÓN/OFICIO:"]
["l NO PROPIETARIO",{"$f":"B120","v":0},{"$f":"C120","v":0},"DOMICILIO REAL:"]
["l NO PROPIETARIO",{"$f":"B120","v":0},{"$f":"C120","v":0},"CEL/TEL :"]
["l NO PROPIETARIO",{"$f":"+IF(E128=0,0,B120)","v":0},{"$f":"+IF(E128=0,0,C120)","v":0},"EMAIL:"]
["l NO PROPIETARIO",{"$f":"B120","v":0},{"$f":"C120","v":0},"ESTADO CIVIL:"]
["l NO PROPIETARIO",{"$f":"IF($E129=\"CASADO/A\",B120,0)","v":0},{"$f":"IF($E129=\"CASADO/A\",C120,0)","v":0},{"$f":"IF(E129=\"CASADO/A\",\"APELLIDO/S CÓNYUGE:\",\"\")","v":""}]
["l NO PROPIETARIO",{"$f":"IF($E129=\"CASADO/A\",B120,0)","v":0},{"$f":"IF($E129=\"CASADO/A\",C120,0)","v":0},{"$f":"IF(E129=\"CASADO/A\",\"NOMBRE/S CÓNYUGE:\",\"\")","v":""}]
["l NO PROPIETARIO",{"$f":"IF($E129=\"CASADO/A\",B120,0)","v":0},{"$f":"IF($E129=\"CASADO/A\",C120,0)","v":0},{"$f":"IF(E129=\"CASADO/A\",\"DOC. IDENTIDAD (cónyuge) –sin puntos ni barras-:\",\"\")","v":""}]
["i ORG. REP. LEGAL/ ADM.",{"$f":"IF(E133=0,0,B120)","v":0},{"$f":"IF(E133=0,0,C120)","v":0},"NOMBRE CARGO REP. LEGAL/ ADMINISTRACIÓN QUE OCUPA:"]
["j ORG. FISCALIZ.",{"$f":"IF(OR(E134=0,E134=\"PRESCINDE ART. 9 ACTO CONSTITUIVO\"),0,B120)","v":0},{"$f":"IF(OR(F134=0,E134=\"PRESCINDE ART.9 ACTO CONSTITUIVO\"),0,C120)","v":0},"NOMBRE CARGO FISCALIZACIÓN QUE OCUPA:"]
["l NO PROPIETARIO",{"$f":"IF(E135=0,0,B120)","v":0},{"$f":"IF(E135=0,0,C120)","v":0},"NOTA/OBSERVACIÓN -en mayúscula-:"]
["l NO PROPIETARIO",null,null,"DOC. IDENTIDAD –sin puntos-:"]
["l NO PROPIETARIO",{"$f":"B136","v":0},{"$f":"C136","v":0},"CUIT/CUIL –sin puntos ni barras-:"]
["l NO PROPIETARIO",{"$f":"B136","v":0},{"$f":"C136","v":0},"FECHA DE NACIMIENTO –dd/mm/aa-:"]
["l NO PROPIETARIO",{"$f":"B136","v":0},{"$f":"C136","v":0},"LUGAR DE NACIMIENTO:"]
["l NO PROPIETARIO",{"$f":"B136","v":0},{"$f":"C136","v":0},"NACIONALIDAD:"]
["l NO PROPIETARIO",{"$f":"B136","v":0},{"$f":"C136","v":0},"PROFESIÓN/OFICIO:"]
["l NO PROPIETARIO",{"$f":"B136","v":0},{"$f":"C136","v":0},"DOMICILIO REAL:"]
["l NO PROPIETARIO",{"$f":"B136","v":0},{"$f":"C136","v":0},"CEL/TEL :"]
["l NO PROPIETARIO",{"$f":"+IF(E144=0,0,B136)","v":0},{"$f":"+IF(E144=0,0,C136)","v":0},"EMAIL:"]
["l NO PROPIETARIO",{"$f":"B136","v":0},{"$f":"C136","v":0},"ESTADO CIVIL:"]
["l NO PROPIETARIO",{"$f":"IF($E145=\"CASADO/A\",B136,0)","v":0},{"$f":"IF($E145=\"CASADO/A\",C136,0)","v":0},{"$f":"IF(E145=\"CASADO/A\",\"APELLIDO/S CÓNYUGE:\",\"\")","v":""}]
["l NO PROPIETARIO",{"$f":"IF($E145=\"CASADO/A\",B136,0)","v":0},{"$f":"IF($E145=\"CASADO/A\",C136,0)","v":0},{"$f":"IF(E145=\"CASADO/A\",\"NOMBRE/S CÓNYUGE:\",\"\")","v":""}]
["l NO PROPIETARIO",{"$f":"IF($E145=\"CASADO/A\",B136,0)","v":0},{"$f":"IF($E145=\"CASADO/A\",C136,0)","v":0},{"$f":"IF(E145=\"CASADO/A\",\"DOC. IDENTIDAD (cónyuge) –sin puntos ni barras-:\",\"\")","v":""}]
["i ORG. REP. LEGAL/ ADM.",{"$f":"IF(E149=0,0,B136)","v":0},{"$f":"IF(E149=0,0,C136)","v":0},"NOMBRE CARGO REP. LEGAL/ ADMINISTRACIÓN QUE OCUPA:"]
["j ORG. FISCALIZ.",{"$f":"IF(OR(E150=0,E150=\"PRESCINDE ART. 9 ACTO CONSTITUIVO\"),0,B136)","v":0},{"$f":"IF(OR(F150=0,E150=\"PRESCINDE ART.9 ACTO CONSTITUIVO\"),0,C136)","v":0},"NOMBRE CARGO FISCALIZACIÓN QUE OCUPA:"]
["l NO PROPIETARIO",{"$f":"IF(E151=0,0,B136)","v":0},{"$f":"IF(E151=0,0,C136)","v":0},"NOTA/OBSERVACIÓN -en mayúscula-:"]
["l NO PROPIETARIO",null,null,"DOC. IDENTIDAD –sin puntos-:"]
["l NO PROPIETARIO",{"$f":"B152","v":0},{"$f":"C152","v":0},"CUIT/CUIL –sin puntos ni barras-:"]
["l NO PROPIETARIO",{"$f":"B152","v":0},{"$f":"C152","v":0},"FECHA DE NACIMIENTO –dd/mm/aa-:"]
["l NO PROPIETARIO",{"$f":"B152","v":0},{"$f":"C152","v":0},"LUGAR DE NACIMIENTO:"]
["l NO PROPIETARIO",{"$f":"B152","v":0},{"$f":"C152","v":0},"NACIONALIDAD:"]
["l NO PROPIETARIO",{"$f":"B152","v":0},{"$f":"C152","v":0},"PROFESIÓN/OFICIO:"]
["l NO PROPIETARIO",{"$f":"B152","v":0},{"$f":"C152","v":0},"DOMICILIO REAL:"]
["l NO PROPIETARIO",{"$f":"B152","v":0},{"$f":"C152","v":0},"CEL/TEL :"]
["l NO PROPIETARIO",{"$f":"+IF(E160=0,0,B152)","v":0},{"$f":"+IF(E160=0,0,C152)","v":0},"EMAIL:"]
["l NO PROPIETARIO",{"$f":"B152","v":0},{"$f":"C152","v":0},"ESTADO CIVIL:"]
["l NO PROPIETARIO",{"$f":"IF($E161=\"CASADO/A\",B152,0)","v":0},{"$f":"IF($E161=\"CASADO/A\",C152,0)","v":0},{"$f":"IF(E161=\"CASADO/A\",\"APELLIDO/S CÓNYUGE:\",\"\")","v":""}]
["l NO PROPIETARIO",{"$f":"IF($E161=\"CASADO/A\",B152,0)","v":0},{"$f":"IF($E161=\"CASADO/A\",C152,0)","v":0},{"$f":"IF(E161=\"CASADO/A\",\"NOMBRE/S CÓNYUGE:\",\"\")","v":""}]
["l NO PROPIETARIO",{"$f":"IF($E161=\"CASADO/A\",B152,0)","v":0},{"$f":"IF($E161=\"CASADO/A\",C152,0)","v":0},{"$f":"IF(E161=\"CASADO/A\",\"DOC. IDENTIDAD (cónyuge) –sin puntos ni barras-:\",\"\")","v":""}]
["i ORG. REP. LEGAL/ ADM.",{"$f":"IF(E165=0,0,B152)","v":0},{"$f":"IF(E165=0,0,C152)","v":0},"NOMBRE CARGO REP. LEGAL/ ADMINISTRACIÓN QUE OCUPA:"]
["j ORG. FISCALIZ.",{"$f":"IF(OR(E166=0,E166=\"PRESCINDE ART. 9 ACTO CONSTITUIVO\"),0,B152)","v":0},{"$f":"IF(OR(F166=0,E166=\"PRESCINDE ART.9 ACTO CONSTITUIVO\"),0,C152)","v":0},"NOMBRE CARGO FISCALIZACIÓN QUE OCUPA:"]
["l NO PROPIETARIO",{"$f":"IF(E167=0,0,B152)","v":0},{"$f":"IF(E167=0,0,C152)","v":0},"NOTA/OBSERVACIÓN -en mayúscula-:"]
["l NO PROPIETARIO",null,null,"DOC. IDENTIDAD –sin puntos-:"]
["l NO PROPIETARIO",{"$f":"B168","v":0},{"$f":"C168","v":0},"CUIT/CUIL –sin puntos ni barras-:"]
["l NO PROPIETARIO",{"$f":"B168","v":0},{"$f":"C168","v":0},"FECHA DE NACIMIENTO –dd/mm/aa-:"]
["l NO PROPIETARIO",{"$f":"B168","v":0},{"$f":"C168","v":0},"LUGAR DE NACIMIENTO:"]
["l NO PROPIETARIO",{"$f":"B168","v":0},{"$f":"C168","v":0},"NACIONALIDAD:"]
["l NO PROPIETARIO",{"$f":"B168","v":0},{"$f":"C168","v":0},"PROFESIÓN/OFICIO:"]
["l NO PROPIETARIO",{"$f":"B168","v":0},{"$f":"C168","v":0},"DOMICILIO REAL:"]
["l NO PROPIETARIO",{"$f":"B168","v":0},{"$f":"C168","v":0},"CEL/TEL :"]
["l NO PROPIETARIO",{"$f":"+IF(E176=0,0,B168)","v":0},{"$f":"+IF(E176=0,0,C168)","v":0},"EMAIL:"]
["l NO PROPIETARIO",{"$f":"B168","v":0},{"$f":"C168","v":0},"ESTADO CIVIL:"]
["l NO PROPIETARIO",{"$f":"IF($E177=\"CASADO/A\",B168,0)","v":0},{"$f":"IF($E177=\"CASADO/A\",C168,0)","v":0},{"$f":"IF(E177=\"CASADO/A\",\"APELLIDO/S CÓNYUGE:\",\"\")","v":""}]
["l NO PROPIETARIO",{"$f":"IF($E177=\"CASADO/A\",B168,0)","v":0},{"$f":"IF($E177=\"CASADO/A\",C168,0)","v":0},{"$f":"IF(E177=\"CASADO/A\",\"NOMBRE/S CÓNYUGE:\",\"\")","v":""}]
["l NO PROPIETARIO",{"$f":"IF($E177=\"CASADO/A\",B168,0)","v":0},{"$f":"IF($E177=\"CASADO/A\",C168,0)","v":0},{"$f":"IF(E177=\"CASADO/A\",\"DOC. IDENTIDAD (cónyuge) –sin puntos ni barras-:\",\"\")","v":""}]
["i ORG. REP. LEGAL/ ADM.",{"$f":"IF(E181=0,0,B168)","v":0},{"$f":"IF(E181=0,0,C168)","v":0},"NOMBRE CARGO REP. LEGAL/ ADMINISTRACIÓN QUE OCUPA:"]
["j ORG. FISCALIZ.",{"$f":"IF(OR(E182=0,E182=\"PRESCINDE ART. 9 ACTO CONSTITUIVO\"),0,B168)","v":0},{"$f":"IF(OR(F182=0,E182=\"PRESCINDE ART.9 ACTO CONSTITUIVO\"),0,C168)","v":0},"NOMBRE CARGO FISCALIZACIÓN QUE OCUPA:"]
["l NO PROPIETARIO",{"$f":"IF(E183=0,0,B168)","v":0},{"$f":"IF(E183=0,0,C168)","v":0},"NOTA/OBSERVACIÓN -en mayúscula-:"]
["l NO PROPIETARIO",null,null,"DOC. IDENTIDAD –sin puntos-:"]
["l NO PROPIETARIO",{"$f":"B184","v":0},{"$f":"C184","v":0},"CUIT/CUIL –sin puntos ni barras-:"]
["l NO PROPIETARIO",{"$f":"B184","v":0},{"$f":"C184","v":0},"FECHA DE NACIMIENTO –dd/mm/aa-:"]
["l NO PROPIETARIO",{"$f":"B184","v":0},{"$f":"C184","v":0},"LUGAR DE NACIMIENTO:"]
["l NO PROPIETARIO",{"$f":"B184","v":0},{"$f":"C184","v":0},"NACIONALIDAD:"]
["l NO PROPIETARIO",{"$f":"B184","v":0},{"$f":"C184","v":0},"PROFESIÓN/OFICIO:"]
["l NO PROPIETARIO",{"$f":"B184","v":0},{"$f":"C184","v":0},"DOMICILIO REAL:"]
["l NO PROPIETARIO",{"$f":"B184","v":0},{"$f":"C184","v":0},"CEL/TEL :"]
["l NO PROPIETARIO",{"$f":"+IF(E192=0,0,B184)","v":0},{"$f":"+IF(E192=0,0,C184)","v":0},"EMAIL:"]
["l NO PROPIETARIO",{"$f":"B184","v":0},{"$f":"C184","v":0},"ESTADO CIVIL:"]
["l NO PROPIETARIO",{"$f":"IF($E193=\"CASADO/A\",B184,0)","v":0},{"$f":"IF($E193=\"CASADO/A\",C184,0)","v":0},{"$f":"IF(E193=\"CASADO/A\",\"APELLIDO/S CÓNYUGE:\",\"\")","v":""}]
["l NO PROPIETARIO",{"$f":"IF($E193=\"CASADO/A\",B184,0)","v":0},{"$f":"IF($E193=\"CASADO/A\",C184,0)","v":0},{"$f":"IF(E193=\"CASADO/A\",\"NOMBRE/S CÓNYUGE:\",\"\")","v":""}]
["l NO PROPIETARIO",{"$f":"IF($E193=\"CASADO/A\",B184,0)","v":0},{"$f":"IF($E193=\"CASADO/A\",C184,0)","v":0},{"$f":"IF(E193=\"CASADO/A\",\"DOC. IDENTIDAD (cónyuge) –sin puntos ni barras-:\",\"\")","v":""}]
["i ORG. REP. LEGAL/ ADM.",{"$f":"IF(E197=0,0,B184)","v":0},{"$f":"IF(E197=0,0,C184)","v":0},"NOMBRE CARGO REP. LEGAL/ ADMINISTRACIÓN QUE OCUPA:"]
["j ORG. FISCALIZ.",{"$f":"IF(OR(E198=0,E198=\"PRESCINDE ART. 9 ACTO CONSTITUIVO\"),0,B184)","v":0},{"$f":"IF(OR(F198=0,E198=\"PRESCINDE ART.9 ACTO CONSTITUIVO\"),0,C184)","v":0},"NOMBRE CARGO FISCALIZACIÓN QUE OCUPA:"]
["l NO PROPIETARIO",{"$f":"IF(E199=0,0,B184)","v":0},{"$f":"IF(E199=0,0,C184)","v":0},"NOTA/OBSERVACIÓN -en mayúscula-:"]
["l NO PROPIETARIO",null,null,"DOC. IDENTIDAD –sin puntos-:"]
["l NO PROPIETARIO",{"$f":"B200","v":0},{"$f":"C200","v":0},"CUIT/CUIL –sin puntos ni barras-:"]
["l NO PROPIETARIO",{"$f":"B200","v":0},{"$f":"C200","v":0},"FECHA DE NACIMIENTO –dd/mm/aa-:"]
["l NO PROPIETARIO",{"$f":"B200","v":0},{"$f":"C200","v":0},"LUGAR DE NACIMIENTO:"]
["l NO PROPIETARIO",{"$f":"B200","v":0},{"$f":"C200","v":0},"NACIONALIDAD:"]
["l NO PROPIETARIO",{"$f":"B200","v":0},{"$f":"C200","v":0},"PROFESIÓN/OFICIO:"]
["l NO PROPIETARIO",{"$f":"B200","v":0},{"$f":"C200","v":0},"DOMICILIO REAL:"]
["l NO PROPIETARIO",{"$f":"B200","v":0},{"$f":"C200","v":0},"CEL/TEL :"]
["l NO PROPIETARIO",{"$f":"+IF(E208=0,0,B200)","v":0},{"$f":"+IF(E208=0,0,C200)","v":0},"EMAIL:"]
["l NO PROPIETARIO",{"$f":"B200","v":0},{"$f":"C200","v":0},"ESTADO CIVIL:"]
["l NO PROPIETARIO",{"$f":"IF($E209=\"CASADO/A\",B200,0)","v":0},{"$f":"IF($E209=\"CASADO/A\",C200,0)","v":0},{"$f":"IF(E209=\"CASADO/A\",\"APELLIDO/S CÓNYUGE:\",\"\")","v":""}]
["l NO PROPIETARIO",{"$f":"IF($E209=\"CASADO/A\",B200,0)","v":0},{"$f":"IF($E209=\"CASADO/A\",C200,0)","v":0},{"$f":"IF(E209=\"CASADO/A\",\"NOMBRE/S CÓNYUGE:\",\"\")","v":""}]
["l NO PROPIETARIO",{"$f":"IF($E209=\"CASADO/A\",B200,0)","v":0},{"$f":"IF($E209=\"CASADO/A\",C200,0)","v":0},{"$f":"IF(E209=\"CASADO/A\",\"DOC. IDENTIDAD (cónyuge) –sin puntos ni barras-:\",\"\")","v":""}]
["i ORG. REP. LEGAL/ ADM.",{"$f":"IF(E213=0,0,B200)","v":0},{"$f":"IF(E213=0,0,C200)","v":0},"NOMBRE CARGO REP. LEGAL/ ADMINISTRACIÓN QUE OCUPA:"]
["j ORG. FISCALIZ.",{"$f":"IF(OR(E214=0,E214=\"PRESCINDE ART. 9 ACTO CONSTITUIVO\"),0,B200)","v":0},{"$f":"IF(OR(F214=0,E214=\"PRESCINDE ART.9 ACTO CONSTITUIVO\"),0,C200)","v":0},"NOMBRE CARGO FISCALIZACIÓN QUE OCUPA:"]
["l NO PROPIETARIO",{"$f":"IF(E215=0,0,B200)","v":0},{"$f":"IF(E215=0,0,C200)","v":0},"NOTA/OBSERVACIÓN -en mayúscula-:"]
["l NO PROPIETARIO",null,null,"DOC. IDENTIDAD –sin puntos-:"]
["l NO PROPIETARIO",{"$f":"B216","v":0},{"$f":"C216","v":0},"CUIT/CUIL –sin puntos ni barras-:"]
["l NO PROPIETARIO",{"$f":"B216","v":0},{"$f":"C216","v":0},"FECHA DE NACIMIENTO –dd/mm/aa-:"]
["l NO PROPIETARIO",{"$f":"B216","v":0},{"$f":"C216","v":0},"LUGAR DE NACIMIENTO:"]
["l NO PROPIETARIO",{"$f":"B216","v":0},{"$f":"C216","v":0},"NACIONALIDAD:"]
["l NO PROPIETARIO",{"$f":"B216","v":0},{"$f":"C216","v":0},"PROFESIÓN/OFICIO:"]
["l NO PROPIETARIO",{"$f":"B216","v":0},{"$f":"C216","v":0},"DOMICILIO REAL:"]
["l NO PROPIETARIO",{"$f":"B216","v":0},{"$f":"C216","v":0},"CEL/TEL :"]
["l NO PROPIETARIO",{"$f":"+IF(E224=0,0,B216)","v":0},{"$f":"+IF(E224=0,0,C216)","v":0},"EMAIL:"]
["l NO PROPIETARIO",{"$f":"B216","v":0},{"$f":"C216","v":0},"ESTADO CIVIL:"]
["l NO PROPIETARIO",{"$f":"IF($E225=\"CASADO/A\",B216,0)","v":0},{"$f":"IF($E225=\"CASADO/A\",C216,0)","v":0},{"$f":"IF(E225=\"CASADO/A\",\"APELLIDO/S CÓNYUGE:\",\"\")","v":""}]
["l NO PROPIETARIO",{"$f":"IF($E225=\"CASADO/A\",B216,0)","v":0},{"$f":"IF($E225=\"CASADO/A\",C216,0)","v":0},{"$f":"IF(E225=\"CASADO/A\",\"NOMBRE/S CÓNYUGE:\",\"\")","v":""}]
["l NO PROPIETARIO",{"$f":"IF($E225=\"CASADO/A\",B216,0)","v":0},{"$f":"IF($E225=\"CASADO/A\",C216,0)","v":0},{"$f":"IF(E225=\"CASADO/A\",\"DOC. IDENTIDAD (cónyuge) –sin puntos ni barras-:\",\"\")","v":""}]
["i ORG. REP. LEGAL/ ADM.",{"$f":"IF(E229=0,0,B216)","v":0},{"$f":"IF(E229=0,0,C216)","v":0},"NOMBRE CARGO REP. LEGAL/ ADMINISTRACIÓN QUE OCUPA:"]
["j ORG. FISCALIZ.",{"$f":"IF(OR(E230=0,E230=\"PRESCINDE ART. 9 ACTO CONSTITUIVO\"),0,B216)","v":0},{"$f":"IF(OR(F230=0,E230=\"PRESCINDE ART.9 ACTO CONSTITUIVO\"),0,C216)","v":0},"NOMBRE CARGO FISCALIZACIÓN QUE OCUPA:"]
["l NO PROPIETARIO",{"$f":"IF(E231=0,0,B216)","v":0},{"$f":"IF(E231=0,0,C216)","v":0},"NOTA/OBSERVACIÓN -en mayúscula-:"]
["l NO PROPIETARIO",null,null,"DOC. IDENTIDAD –sin puntos-:"]
["l NO PROPIETARIO",{"$f":"B232","v":0},{"$f":"C232","v":0},"CUIT/CUIL –sin puntos ni barras-:"]
["l NO PROPIETARIO",{"$f":"B232","v":0},{"$f":"C232","v":0},"FECHA DE NACIMIENTO –dd/mm/aa-:"]
["l NO PROPIETARIO",{"$f":"B232","v":0},{"$f":"C232","v":0},"LUGAR DE NACIMIENTO:"]
["l NO PROPIETARIO",{"$f":"B232","v":0},{"$f":"C232","v":0},"NACIONALIDAD:"]
["l NO PROPIETARIO",{"$f":"B232","v":0},{"$f":"C232","v":0},"PROFESIÓN/OFICIO:"]
["l NO PROPIETARIO",{"$f":"B232","v":0},{"$f":"C232","v":0},"DOMICILIO REAL:"]
["l NO PROPIETARIO",{"$f":"B232","v":0},{"$f":"C232","v":0},"CEL/TEL :"]
["l NO PROPIETARIO",{"$f":"+IF(E240=0,0,B232)","v":0},{"$f":"+IF(E240=0,0,C232)","v":0},"EMAIL:"]
["l NO PROPIETARIO",{"$f":"B232","v":0},{"$f":"C232","v":0},"ESTADO CIVIL:"]
["l NO PROPIETARIO",{"$f":"IF($E241=\"CASADO/A\",B232,0)","v":0},{"$f":"IF($E241=\"CASADO/A\",C232,0)","v":0},{"$f":"IF(E241=\"CASADO/A\",\"APELLIDO/S CÓNYUGE:\",\"\")","v":""}]
["l NO PROPIETARIO",{"$f":"IF($E241=\"CASADO/A\",B232,0)","v":0},{"$f":"IF($E241=\"CASADO/A\",C232,0)","v":0},{"$f":"IF(E241=\"CASADO/A\",\"NOMBRE/S CÓNYUGE:\",\"\")","v":""}]
["l NO PROPIETARIO",{"$f":"IF($E241=\"CASADO/A\",B232,0)","v":0},{"$f":"IF($E241=\"CASADO/A\",C232,0)","v":0},{"$f":"IF(E241=\"CASADO/A\",\"DOC. IDENTIDAD (cónyuge) –sin puntos ni barras-:\",\"\")","v":""}]
["i ORG. REP. LEGAL/ ADM.",{"$f":"IF(E245=0,0,B232)","v":0},{"$f":"IF(E245=0,0,C232)","v":0},"NOMBRE CARGO REP. LEGAL/ ADMINISTRACIÓN QUE OCUPA:"]
["j ORG. FISCALIZ.",{"$f":"IF(OR(E246=0,E246=\"PRESCINDE ART. 9 ACTO CONSTITUIVO\"),0,B232)","v":0},{"$f":"IF(OR(F246=0,E246=\"PRESCINDE ART.9 ACTO CONSTITUIVO\"),0,C232)","v":0},"NOMBRE CARGO FISCALIZACIÓN QUE OCUPA:"]
["l NO PROPIETARIO",{"$f":"IF(E247=0,0,B232)","v":0},{"$f":"IF(E247=0,0,C232)","v":0},"NOTA/OBSERVACIÓN -en mayúscula-:"]

{"sheet":"ANTERIORES PROP","index":4,"n_rows":91,"n_cols":9,"rows_kept":91,"cut":false,"hidden":false,"merged":[[6,8,6,9],[1,0,1,4],[2,0,2,4],[3,0,3,2],[3,3,3,4],[5,0,5,4],[5,6,5,9]]}
[{"$f":"+'DATOS FC'!A1","v":"DATOS TRANSFERENCIA FONDO DE COMERCIO"}]
["(COMPLETAR CELDAS CON FONDO VERDE)"]
[{"$f":"+'DATOS FC'!A3:E3","v":"REGISTRO PÚBLICO DE COMERCIO, Juzgado Pcial. de 1era. Instancia en los Civil, Comercial, Laboral, Minería y Familia, con asiento en la localidad de LAS HERAS -Pcia. de Sta. Cruz, Simón Bolivar 482 (CP9017)-"}]
["NOMBRE DEL FONDO DE COMERCIO:",null,null,{"$f":"+'DATOS FC'!D4:E4","v":0}]
[null,"FECHA:",{"$f":"+'DATOS FC'!D5","v":"00:00:00"}]
["DATOS ANTERIORES PROPIETARIOS PERSONAS HUMANAS",null,null,null,null,null,"DATOS ANTERIORES PROPIETARIOS PERSONAS JURÍDICAS"]
["REFER.","APELLIDO/s DEL MIEMBRO","NOMBRE/s DEL MIEMBRO","DATOS",null,null,"REFER.","RAZON SOCIAL/DENOMINACIÓN MIEMBRO PERSONA JURÍDICA","DATOS"]
["c ANT. PROP PH",null,0,"DOC. IDENTIDAD –sin puntos-:",null,null,"a ANT. PROP PJ",null,"CUIT –sin puntos ni barras-:"]
["c ANT. PROP PH",{"$f":"+B8","v":0},{"$f":"+C8","v":0},"CUIT/CUIL –sin puntos ni barras-:",null,null,"a ANT. PROP PJ",{"$f":"H8","v":0},"TIPO DE PERSONA JCA -FONDO DE COMERCIO, asociación, mutual, etc-:"]
["c ANT. PROP PH",{"$f":"+B9","v":0},0,"FECHA DE NACIMIENTO –dd/mm/aa-:",null,null,"a ANT. PROP PJ",{"$f":"H8","v":0},"ORGANISMO /s DONDE SE INSCRIBIÓ CONSTITUCIÓN (INDICAR LOCALIDAD/PCIA DEL ORG) -si no se inscribió poner: NO INSCRIPTO/A:"]
["c ANT. PROP PH",0,0,"LUGAR DE NACIMIENTO:",null,null,"a ANT. PROP PJ",{"$f":"IF(I11=\"\",0,H8)","v":0},{"$f":"IF(OR(J10=\"NO INSCRIPTO/A\",J10=\"NO INSCR.\", J10=\"NO INSCR\",J10=\"N/I\", J10= \"NO INSCRIPTO\",J10=\"NO INSCRIPTA\"),\"\",\"DATOS DE RESOLUCIÓN Y FECHA DE INSCRIPCIÓN:\")","v":"DATOS DE RESOLUCIÓN Y FECHA DE INSCRIPCIÓN:"}]
["c ANT. PROP PH",0,0,"NACIONALIDAD:",null,null,"a ANT. PROP PJ",{"$f":"IF(I12=\"\",0,H8)","v":0},{"$f":"IF(I11=\"\",\"\",\"FECHA DE INSCRIPCION:\")","v":"FECHA DE INSCRIPCION:"}]
["c ANT. PROP PH",0,0,"PROFESIÓN/OFICIO:",null,null,"a ANT. PROP PJ",{"$f":"H8","v":0},"APELLIDO/S, NOMBRE/S,  DNI Y CARGO DE CADA MIEMBRO DE SU ADMINISTRACIÓN:"]
["c ANT. PROP PH",0,0,"DOMICILIO REAL:",null,null,"a ANT. PROP PJ",{"$f":"IF(AND(J15>0,J14=0),0,H8)","v":0},"DOMICILIO SOCIAL:"]
["c ANT. PROP PH",0,0,"CEL/TEL :",null,null,"a ANT. PROP PJ",{"$f":"IF(AND(J14>0,J15=0),0,H8)","v":0},"SEDE SOCIAL:"]
["c ANT. PROP PH",{"$f":"IF(E16=0,0,B8)","v":0},{"$f":"IF(E16=0,0,C8)","v":0},"EMAIL:",null,null,"a ANT. PROP PJ",{"$f":"H8","v":0},"CEL/TEL :"]
["c ANT. PROP PH",{"$f":"B8","v":0},{"$f":"C8","v":0},"ESTADO CIVIL:",null,null,"a ANT. PROP PJ",{"$f":"H8","v":0},"OBJETO PRINCIPAL (EN FORMA RESUMIDA):"]
["c ANT. PROP PH",{"$f":"IF($E17=\"CASADO/A\",B8,0)","v":0},{"$f":"IF($E17=\"CASADO/A\",C8,0)","v":0},{"$f":"IF(E17=\"CASADO/A\",\"APELLIDO/S CÓNYUGE:\",\"\")","v":""},null,null,"a ANT. PROP PJ",{"$f":"IF(J18=0,0,H8)","v":0},"NOTA/OBSERVACIÓN -en mayúscula-:"]
["c ANT. PROP PH",{"$f":"IF($E17=\"CASADO/A\",B8,0)","v":0},{"$f":"IF($E17=\"CASADO/A\",C8,0)","v":0},{"$f":"IF(E17=\"CASADO/A\",\"NOMBRE/S CÓNYUGE:\",\"\")","v":""},null,null,"a ANT. PROP PJ",null,"CUIT –sin puntos ni barras-:"]
["c ANT. PROP PH",{"$f":"IF($E17=\"CASADO/A\",B8,0)","v":0},{"$f":"IF($E17=\"CASADO/A\",C8,0)","v":0},{"$f":"IF(E17=\"CASADO/A\",\"DOC. IDENTIDAD (cónyuge) –sin puntos ni barras-:\",\"\")","v":""},null,null,"a ANT. PROP PJ",{"$f":"H19","v":0},"TIPO DE PERSONA JCA -FONDO DE COMERCIO, asociación, mutual, etc-:"]
["c ANT. PROP PH",{"$f":"IF(E21=0,0,B8)","v":0},{"$f":"IF(E21=0,0,C8)","v":0},"NOTA/OBSERVACIÓN -en mayúscula-:",null,null,"a ANT. PROP PJ",{"$f":"H19","v":0},"ORGANISMO /s DONDE SE INSCRIBIÓ CONSTITUCIÓN (INDICAR LOCALIDAD/PCIA DEL ORG) -si no se inscribió poner: NO INSCRIPTO/A:"]
["c ANT. PROP PH",null,0,"DOC. IDENTIDAD –sin puntos-:",null,null,"a ANT. PROP PJ",{"$f":"IF(I22=\"\",0,H19)","v":0},{"$f":"IF(OR(J21=\"NO INSCRIPTO/A\",J21=\"NO INSCR.\", J21=\"NO INSCR\",J21=\"N/I\", J21= \"NO INSCRIPTO\",J21=\"NO INSCRIPTA\"),\"\",\"DATOS DE RESOLUCIÓN Y FECHA DE INSCRIPCIÓN:\")","v":"DATOS DE RESOLUCIÓN Y FECHA DE INSCRIPCIÓN:"}]
["c ANT. PROP PH",{"$f":"+B22","v":0},{"$f":"+C22","v":0},"CUIT/CUIL –sin puntos ni barras-:",null,null,"a ANT. PROP PJ",{"$f":"IF(I23=\"\",0,H19)","v":0},{"$f":"IF(I22=\"\",\"\",\"FECHA DE INSCRIPCION:\")","v":"FECHA DE INSCRIPCION:"}]
["c ANT. PROP PH",{"$f":"+B23","v":0},0,"FECHA DE NACIMIENTO –dd/mm/aa-:",null,null,"a ANT. PROP PJ",{"$f":"H19","v":0},"APELLIDO/S, NOMBRE/S,  DNI Y CARGO DE CADA MIEMBRO DE SU ADMINISTRACIÓN:"]
["c ANT. PROP PH",{"$f":"+B24","v":0},0,"LUGAR DE NACIMIENTO:",null,null,"a ANT. PROP PJ",{"$f":"IF(AND(J26>0,J25=0),0,H19)","v":0},"DOMICILIO SOCIAL:"]
["c ANT. PROP PH",{"$f":"+B25","v":0},0,"NACIONALIDAD:",null,null,"a ANT. PROP PJ",{"$f":"IF(AND(J25>0,J26=0),0,H19)","v":0},"SEDE SOCIAL:"]
["c ANT. PROP PH",{"$f":"+B26","v":0},0,"PROFESIÓN/OFICIO:",null,null,"a ANT. PROP PJ",{"$f":"H19","v":0},"CEL/TEL :"]
["c ANT. PROP PH",{"$f":"+B27","v":0},0,"DOMICILIO REAL:",null,null,"a ANT. PROP PJ",{"$f":"H19","v":0},"OBJETO PRINCIPAL (EN FORMA RESUMIDA):"]
["c ANT. PROP PH",{"$f":"+B28","v":0},0,"CEL/TEL :",null,null,"a ANT. PROP PJ",{"$f":"IF(J29=0,0,H19)","v":0},"NOTA/OBSERVACIÓN -en mayúscula-:"]
["c ANT. PROP PH",{"$f":"IF(E30=0,0,B22)","v":0},{"$f":"IF(E30=0,0,C22)","v":0},"EMAIL:",null,null,"a ANT. PROP PJ",null,"CUIT –sin puntos ni barras-:"]
["c ANT. PROP PH",{"$f":"B22","v":0},{"$f":"C22","v":0},"ESTADO CIVIL:",null,null,"a ANT. PROP PJ",{"$f":"H30","v":0},"TIPO DE PERSONA JCA -FONDO DE COMERCIO, asociación, mutual, etc-:"]
["c ANT. PROP PH",{"$f":"IF($E31=\"CASADO/A\",B22,0)","v":0},{"$f":"IF($E31=\"CASADO/A\",C22,0)","v":0},{"$f":"IF(E31=\"CASADO/A\",\"APELLIDO/S CÓNYUGE:\",\"\")","v":""},null,null,"a ANT. PROP PJ",{"$f":"H30","v":0},"ORGANISMO /s DONDE SE INSCRIBIÓ CONSTITUCIÓN (INDICAR LOCALIDAD/PCIA DEL ORG) -si no se inscribió poner: NO INSCRIPTO/A:"]
["c ANT. PROP PH",{"$f":"IF($E31=\"CASADO/A\",B22,0)","v":0},{"$f":"IF($E31=\"CASADO/A\",C22,0)","v":0},{"$f":"IF(E31=\"CASADO/A\",\"NOMBRE/S CÓNYUGE:\",\"\")","v":""},null,null,"a ANT. PROP PJ",{"$f":"IF(I33=\"\",0,H30)","v":0},{"$f":"IF(OR(J32=\"NO INSCRIPTO/A\",J32=\"NO INSCR.\", J32=\"NO INSCR\",J32=\"N/I\", J32= \"NO INSCRIPTO\",J32=\"NO INSCRIPTA\"),\"\",\"DATOS DE RESOLUCIÓN Y FECHA DE INSCRIPCIÓN:\")","v":"DATOS DE RESOLUCIÓN Y FECHA DE INSCRIPCIÓN:"}]
["c ANT. PROP PH",{"$f":"IF($E31=\"CASADO/A\",B22,0)","v":0},{"$f":"IF($E31=\"CASADO/A\",C22,0)","v":0},{"$f":"IF(E31=\"CASADO/A\",\"DOC. IDENTIDAD (cónyuge) –sin puntos ni barras-:\",\"\")","v":""},null,null,"a ANT. PROP PJ",{"$f":"IF(I34=\"\",0,H30)","v":0},{"$f":"IF(I33=\"\",\"\",\"FECHA DE INSCRIPCION:\")","v":"FECHA DE INSCRIPCION:"}]
["c ANT. PROP PH",{"$f":"IF(E35=0,0,B22)","v":0},{"$f":"IF(E35=0,0,C22)","v":0},"NOTA/OBSERVACIÓN -en mayúscula-:",null,null,"a ANT. PROP PJ",{"$f":"H30","v":0},"APELLIDO/S, NOMBRE/S,  DNI Y CARGO DE CADA MIEMBRO DE SU ADMINISTRACIÓN:"]
["c ANT. PROP PH",null,0,"DOC. IDENTIDAD –sin puntos-:",null,null,"a ANT. PROP PJ",{"$f":"IF(AND(J37>0,J36=0),0,H30)","v":0},"DOMICILIO SOCIAL:"]
["c ANT. PROP PH",{"$f":"+B36","v":0},{"$f":"+C36","v":0},"CUIT/CUIL –sin puntos ni barras-:",null,null,"a ANT. PROP PJ",{"$f":"IF(AND(J36>0,J37=0),0,H30)","v":0},"SEDE SOCIAL:"]
["c ANT. PROP PH",{"$f":"+B37","v":0},0,"FECHA DE NACIMIENTO –dd/mm/aa-:",null,null,"a ANT. PROP PJ",{"$f":"H30","v":0},"CEL/TEL :"]
["c ANT. PROP PH",{"$f":"+B38","v":0},0,"LUGAR DE NACIMIENTO:",null,null,"a ANT. PROP PJ",{"$f":"H30","v":0},"OBJETO PRINCIPAL (EN FORMA RESUMIDA):"]
["c ANT. PROP PH",{"$f":"+B39","v":0},0,"NACIONALIDAD:",null,null,"a ANT. PROP PJ",{"$f":"IF(J40=0,0,H30)","v":0},"NOTA/OBSERVACIÓN -en mayúscula-:"]
["c ANT. PROP PH",{"$f":"+B40","v":0},0,"PROFESIÓN/OFICIO:",null,null,"a ANT. PROP PJ",null,"CUIT –sin puntos ni barras-:"]
["c ANT. PROP PH",{"$f":"+B41","v":0},0,"DOMICILIO REAL:",null,null,"a ANT. PROP PJ",{"$f":"H41","v":0},"TIPO DE PERSONA JCA -FONDO DE COMERCIO, asociación, mutual, etc-:"]
["c ANT. PROP PH",{"$f":"+B42","v":0},0,"CEL/TEL :",null,null,"a ANT. PROP PJ",{"$f":"H41","v":0},"ORGANISMO /s DONDE SE INSCRIBIÓ CONSTITUCIÓN (INDICAR LOCALIDAD/PCIA DEL ORG) -si no se inscribió poner: NO INSCRIPTO/A:"]
["c ANT. PROP PH",{"$f":"IF(E44=0,0,B36)","v":0},{"$f":"IF(E44=0,0,C36)","v":0},"EMAIL:",null,null,"a ANT. PROP PJ",{"$f":"IF(I44=\"\",0,H41)","v":0},{"$f":"IF(OR(J43=\"NO INSCRIPTO/A\",J43=\"NO INSCR.\", J43=\"NO INSCR\",J43=\"N/I\", J43= \"NO INSCRIPTO\",J43=\"NO INSCRIPTA\"),\"\",\"DATOS DE RESOLUCIÓN Y FECHA DE INSCRIPCIÓN:\")","v":"DATOS DE RESOLUCIÓN Y FECHA DE INSCRIPCIÓN:"}]
["c ANT. PROP PH",{"$f":"B36","v":0},{"$f":"C36","v":0},"ESTADO CIVIL:",null,null,"a ANT. PROP PJ",{"$f":"IF(I45=\"\",0,H41)","v":0},{"$f":"IF(I44=\"\",\"\",\"FECHA DE INSCRIPCION:\")","v":"FECHA DE INSCRIPCION:"}]
["c ANT. PROP PH",{"$f":"IF($E45=\"CASADO/A\",B36,0)","v":0},{"$f":"IF($E45=\"CASADO/A\",C36,0)","v":0},{"$f":"IF(E45=\"CASADO/A\",\"APELLIDO/S CÓNYUGE:\",\"\")","v":""},null,null,"a ANT. PROP PJ",{"$f":"H41","v":0},"APELLIDO/S, NOMBRE/S,  DNI Y CARGO DE CADA MIEMBRO DE SU ADMINISTRACIÓN:"]
["c ANT. PROP PH",{"$f":"IF($E45=\"CASADO/A\",B36,0)","v":0},{"$f":"IF($E45=\"CASADO/A\",C36,0)","v":0},{"$f":"IF(E45=\"CASADO/A\",\"NOMBRE/S CÓNYUGE:\",\"\")","v":""},null,null,"a ANT. PROP PJ",{"$f":"IF(AND(J48>0,J47=0),0,H41)","v":0},"DOMICILIO SOCIAL:"]
["c ANT. PROP PH",{"$f":"IF($E45=\"CASADO/A\",B36,0)","v":0},{"$f":"IF($E45=\"CASADO/A\",C36,0)","v":0},{"$f":"IF(E45=\"CASADO/A\",\"DOC. IDENTIDAD (cónyuge) –sin puntos ni barras-:\",\"\")","v":""},null,null,"a ANT. PROP PJ",{"$f":"IF(AND(J47>0,J48=0),0,H41)","v":0},"SEDE SOCIAL:"]
["c ANT. PROP PH",{"$f":"IF(E49=0,0,B36)","v":0},{"$f":"IF(E49=0,0,C36)","v":0},"NOTA/OBSERVACIÓN -en mayúscula-:",null,null,"a ANT. PROP PJ",{"$f":"H41","v":0},"CEL/TEL :"]
["c ANT. PROP PH",null,0,"DOC. IDENTIDAD –sin puntos-:",null,null,"a ANT. PROP PJ",{"$f":"H41","v":0},"OBJETO PRINCIPAL (EN FORMA RESUMIDA):"]
["c ANT. PROP PH",{"$f":"+B50","v":0},{"$f":"+C50","v":0},"CUIT/CUIL –sin puntos ni barras-:",null,null,"a ANT. PROP PJ",{"$f":"IF(J51=0,0,H41)","v":0},"NOTA/OBSERVACIÓN -en mayúscula-:"]
["c ANT. PROP PH",{"$f":"+B51","v":0},0,"FECHA DE NACIMIENTO –dd/mm/aa-:",null,null,"a ANT. PROP PJ",null,"CUIT –sin puntos ni barras-:"]
["c ANT. PROP PH",{"$f":"+B52","v":0},0,"LUGAR DE NACIMIENTO:",null,null,"a ANT. PROP PJ",{"$f":"H52","v":0},"TIPO DE PERSONA JCA -FONDO DE COMERCIO, asociación, mutual, etc-:"]
["c ANT. PROP PH",{"$f":"+B53","v":0},0,"NACIONALIDAD:",null,null,"a ANT. PROP PJ",{"$f":"H52","v":0},"ORGANISMO /s DONDE SE INSCRIBIÓ CONSTITUCIÓN (INDICAR LOCALIDAD/PCIA DEL ORG) -si no se inscribió poner: NO INSCRIPTO/A:"]
["c ANT. PROP PH",{"$f":"+B54","v":0},0,"PROFESIÓN/OFICIO:",null,null,"a ANT. PROP PJ",{"$f":"IF(I55=\"\",0,H52)","v":0},{"$f":"IF(OR(J54=\"NO INSCRIPTO/A\",J54=\"NO INSCR.\", J54=\"NO INSCR\",J54=\"N/I\", J54= \"NO INSCRIPTO\",J54=\"NO INSCRIPTA\"),\"\",\"DATOS DE RESOLUCIÓN Y FECHA DE INSCRIPCIÓN:\")","v":"DATOS DE RESOLUCIÓN Y FECHA DE INSCRIPCIÓN:"}]
["c ANT. PROP PH",{"$f":"+B55","v":0},0,"DOMICILIO REAL:",null,null,"a ANT. PROP PJ",{"$f":"IF(I56=\"\",0,H52)","v":0},{"$f":"IF(I55=\"\",\"\",\"FECHA DE INSCRIPCION:\")","v":"FECHA DE INSCRIPCION:"}]
["c ANT. PROP PH",{"$f":"+B56","v":0},0,"CEL/TEL :",null,null,"a ANT. PROP PJ",{"$f":"H52","v":0},"APELLIDO/S, NOMBRE/S,  DNI Y CARGO DE CADA MIEMBRO DE SU ADMINISTRACIÓN:"]
["c ANT. PROP PH",{"$f":"IF(E58=0,0,B50)","v":0},{"$f":"IF(E58=0,0,C50)","v":0},"EMAIL:",null,null,"a ANT. PROP PJ",{"$f":"IF(AND(J59>0,J58=0),0,H52)","v":0},"DOMICILIO SOCIAL:"]
["c ANT. PROP PH",{"$f":"B50","v":0},{"$f":"C50","v":0},"ESTADO CIVIL:",null,null,"a ANT. PROP PJ",{"$f":"IF(AND(J58>0,J59=0),0,H52)","v":0},"SEDE SOCIAL:"]
["c ANT. PROP PH",{"$f":"IF($E59=\"CASADO/A\",B50,0)","v":0},{"$f":"IF($E59=\"CASADO/A\",C50,0)","v":0},{"$f":"IF(E59=\"CASADO/A\",\"APELLIDO/S CÓNYUGE:\",\"\")","v":""},null,null,"a ANT. PROP PJ",{"$f":"H52","v":0},"CEL/TEL :"]
["c ANT. PROP PH",{"$f":"IF($E59=\"CASADO/A\",B50,0)","v":0},{"$f":"IF($E59=\"CASADO/A\",C50,0)","v":0},{"$f":"IF(E59=\"CASADO/A\",\"NOMBRE/S CÓNYUGE:\",\"\")","v":""},null,null,"a ANT. PROP PJ",{"$f":"H52","v":0},"OBJETO PRINCIPAL (EN FORMA RESUMIDA):"]
["c ANT. PROP PH",{"$f":"IF($E59=\"CASADO/A\",B50,0)","v":0},{"$f":"IF($E59=\"CASADO/A\",C50,0)","v":0},{"$f":"IF(E59=\"CASADO/A\",\"DOC. IDENTIDAD (cónyuge) –sin puntos ni barras-:\",\"\")","v":""},null,null,"a ANT. PROP PJ",{"$f":"IF(J62=0,0,H52)","v":0},"NOTA/OBSERVACIÓN -en mayúscula-:"]
["c ANT. PROP PH",{"$f":"IF(E63=0,0,B50)","v":0},{"$f":"IF(E63=0,0,C50)","v":0},"NOTA/OBSERVACIÓN -en mayúscula-:"]
["c ANT. PROP PH",null,0,"DOC. IDENTIDAD –sin puntos-:"]
["c ANT. PROP PH",{"$f":"+B64","v":0},{"$f":"+C64","v":0},"CUIT/CUIL –sin puntos ni barras-:"]
["c ANT. PROP PH",{"$f":"+B65","v":0},0,"FECHA DE NACIMIENTO –dd/mm/aa-:"]
["c ANT. PROP PH",{"$f":"+B66","v":0},0,"LUGAR DE NACIMIENTO:"]
["c ANT. PROP PH",{"$f":"+B67","v":0},0,"NACIONALIDAD:"]
["c ANT. PROP PH",{"$f":"+B68","v":0},0,"PROFESIÓN/OFICIO:"]
["c ANT. PROP PH",{"$f":"+B69","v":0},0,"DOMICILIO REAL:"]
["c ANT. PROP PH",{"$f":"+B70","v":0},0,"CEL/TEL :"]
["c ANT. PROP PH",{"$f":"IF(E72=0,0,B64)","v":0},{"$f":"IF(E72=0,0,C64)","v":0},"EMAIL:"]
["c ANT. PROP PH",{"$f":"B64","v":0},{"$f":"C64","v":0},"ESTADO CIVIL:"]
["c ANT. PROP PH",{"$f":"IF($E73=\"CASADO/A\",B64,0)","v":0},{"$f":"IF($E73=\"CASADO/A\",C64,0)","v":0},{"$f":"IF(E73=\"CASADO/A\",\"APELLIDO/S CÓNYUGE:\",\"\")","v":""}]
["c ANT. PROP PH",{"$f":"IF($E73=\"CASADO/A\",B64,0)","v":0},{"$f":"IF($E73=\"CASADO/A\",C64,0)","v":0},{"$f":"IF(E73=\"CASADO/A\",\"NOMBRE/S CÓNYUGE:\",\"\")","v":""}]
["c ANT. PROP PH",{"$f":"IF($E73=\"CASADO/A\",B64,0)","v":0},{"$f":"IF($E73=\"CASADO/A\",C64,0)","v":0},{"$f":"IF(E73=\"CASADO/A\",\"DOC. IDENTIDAD (cónyuge) –sin puntos ni barras-:\",\"\")","v":""}]
["c ANT. PROP PH",{"$f":"IF(E77=0,0,B64)","v":0},{"$f":"IF(E77=0,0,C64)","v":0},"NOTA/OBSERVACIÓN -en mayúscula-:"]
["c ANT. PROP PH",null,0,"DOC. IDENTIDAD –sin puntos-:"]
["c ANT. PROP PH",{"$f":"+B78","v":0},{"$f":"+C78","v":0},"CUIT/CUIL –sin puntos ni barras-:"]
["c ANT. PROP PH",{"$f":"+B79","v":0},0,"FECHA DE NACIMIENTO –dd/mm/aa-:"]
["c ANT. PROP PH",{"$f":"+B80","v":0},0,"LUGAR DE NACIMIENTO:"]
["c ANT. PROP PH",{"$f":"+B81","v":0},0,"NACIONALIDAD:"]
["c ANT. PROP PH",{"$f":"+B82","v":0},0,"PROFESIÓN/OFICIO:"]
["c ANT. PROP PH",{"$f":"+B83","v":0},0,"DOMICILIO REAL:"]
["c ANT. PROP PH",{"$f":"+B84","v":0},0,"CEL/TEL :"]
["c ANT. PROP PH",{"$f":"IF(E86=0,0,B78)","v":0},{"$f":"IF(E86=0,0,C78)","v":0},"EMAIL:"]
["c ANT. PROP PH",{"$f":"B78","v":0},{"$f":"C78","v":0},"ESTADO CIVIL:"]
["c ANT. PROP PH",{"$f":"IF($E87=\"CASADO/A\",B78,0)","v":0},{"$f":"IF($E87=\"CASADO/A\",C78,0)","v":0},{"$f":"IF(E87=\"CASADO/A\",\"APELLIDO/S CÓNYUGE:\",\"\")","v":""}]
["c ANT. PROP PH",{"$f":"IF($E87=\"CASADO/A\",B78,0)","v":0},{"$f":"IF($E87=\"CASADO/A\",C78,0)","v":0},{"$f":"IF(E87=\"CASADO/A\",\"NOMBRE/S CÓNYUGE:\",\"\")","v":""}]
["c ANT. PROP PH",{"$f":"IF($E87=\"CASADO/A\",B78,0)","v":0},{"$f":"IF($E87=\"CASADO/A\",C78,0)","v":0},{"$f":"IF(E87=\"CASADO/A\",\"DOC. IDENTIDAD (cónyuge) –sin puntos ni barras-:\",\"\")","v":""}]
["c ANT. PROP PH",{"$f":"IF(E91=0,0,B78)","v":0},{"$f":"IF(E91=0,0,C78)","v":0},"NOTA/OBSERVACIÓN -en mayúscula-:"]

{"sheet":"IMPRIMIR","index":5,"n_rows":666,"n_cols":6,"rows_kept":666,"cut":false,"hidden":false,"merged":[[0,0,0,3],[4,5,5,5],[4,0,5,0],[4,1,5,1],[4,2,5,2],[2,3,2,4],[1,0,1,4],[2,0,2,2]]}
[{"$f":"+'DATOS FC'!A1","v":"DATOS TRANSFERENCIA FONDO DE COMERCIO"},null,null,null,"HOJA Nº: …………"]
[{"$f":"+'DATOS FC'!A3:E3","v":"REGISTRO PÚBLICO DE COMERCIO, Juzgado Pcial. de 1era. Instancia en los Civil, Comercial, Laboral, Minería y Familia, con asiento en la localidad de LAS HERAS -Pcia. de Sta. Cruz, Simón Bolivar 482 (CP9017)-"}]
["NOMBRE DEL FONDO DE COMERCIO:",null,null,{"$f":"+'DATOS FC'!D4:E4","v":0}]
[null,"FECHA:",{"$f":"+'DATOS FC'!D5","v":"00:00:00"}]
["REFER.","VINCULADOS","VINCULADOS","DATOS",null,"FILA Nº"]
[null,null,null,"CONCEPTO","COMPLETAR -EN MAYUSCULA -"]
[{"$f":"+'DATOS FC'!A18","v":"aa GESTOR"},{"$f":"+'DATOS FC'!B18","v":0},{"$f":"+'DATOS FC'!C18","v":0},{"$f":"+'DATOS FC'!D18","v":"TRAMITE QUE SE INICIA:"},{"$f":"IF('DATOS FC'!E18=\"ELEGIR\",\"INCOMPLETO RECHAZAR\",'DATOS FC'!E18)","v":"INCOMPLETO RECHAZAR"},1]
[{"$f":"+'DATOS FC'!A19","v":"ab GESTOR"},{"$f":"+'DATOS FC'!B19","v":0},{"$f":"+'DATOS FC'!C19","v":0},{"$f":"+'DATOS FC'!D19","v":"DOMICILIO PROCESAL CONSTITUIDO -art.40 CPCC-:"},{"$f":"IF('DATOS FC'!E19>0,'DATOS FC'!E19,\"INCOMPLETO RECHAZAR\")","v":"INCOMPLETO RECHAZAR"},2]
[{"$f":"+'DATOS FC'!A20","v":"ac GESTOR"},{"$f":"+'DATOS FC'!B20","v":0},{"$f":"+'DATOS FC'!C20","v":0},{"$f":"+'DATOS FC'!D20","v":"CARÁCTER DEL GESTIONANTE:"},{"$f":"IF('DATOS FC'!E20=\"ELEGIR\",\"INCOMPLETO RECHAZAR\",'DATOS FC'!E20)","v":"INCOMPLETO RECHAZAR"},3]
[{"$f":"+'DATOS FC'!A21","v":"ad GESTOR"},{"$f":"+'DATOS FC'!B21","v":0},{"$f":"+'DATOS FC'!C21","v":0},{"$f":"+'DATOS FC'!D21","v":"LETRADO/A/S PATROCINANTE/S:"},{"$f":"IF('DATOS FC'!E21>0,'DATOS FC'!E21,\"INCOMPLETO RECHAZAR\")","v":"INCOMPLETO RECHAZAR"},4]
[{"$f":"+'DATOS FC'!A22","v":"ae GESTOR"},{"$f":"+'DATOS FC'!B22","v":0},{"$f":"+'DATOS FC'!C22","v":0},{"$f":"+'DATOS FC'!D22","v":"DOC. IDENTIDAD –sin puntos-:"},{"$f":"IF('DATOS FC'!E22>0,'DATOS FC'!E22,\"INCOMPLETO RECHAZAR\")","v":"INCOMPLETO RECHAZAR"},5]
[{"$f":"+'DATOS FC'!A23","v":"af GESTOR"},{"$f":"+'DATOS FC'!B23","v":0},{"$f":"+'DATOS FC'!C23","v":0},{"$f":"+'DATOS FC'!D23","v":"DOMICILIO REAL -indicar Ciudad/Pcia./País"},{"$f":"IF('DATOS FC'!E23>0,'DATOS FC'!E23,\"INCOMPLETO RECHAZAR\")","v":"INCOMPLETO RECHAZAR"},6]
[{"$f":"+'DATOS FC'!A24","v":"ag GESTOR"},{"$f":"+'DATOS FC'!B24","v":0},{"$f":"+'DATOS FC'!C24","v":0},{"$f":"+'DATOS FC'!D24","v":"CEL/TEL -c/código de área, sin puntos o barras-:"},{"$f":"IF('DATOS FC'!E24>0,'DATOS FC'!E24,\"INCOMPLETO RECHAZAR\")","v":"INCOMPLETO RECHAZAR"},7]
[{"$f":"+'DATOS FC'!A25","v":"ah GESTOR"},{"$f":"+'DATOS FC'!B25","v":0},{"$f":"+'DATOS FC'!C25","v":0},{"$f":"+'DATOS FC'!D25","v":"EMAIL -OBLIGATORIO-:"},{"$f":"IF('DATOS FC'!E25>0,'DATOS FC'!E25,\"INCOMPLETO RECHAZAR\")","v":"INCOMPLETO RECHAZAR"},8]
[{"$f":"+'DATOS FC'!A34","v":"b FONDO DE COMERCIO"},{"$f":"UPPER('DATOS FC'!B34)","v":"0"},{"$f":"UPPER('DATOS FC'!C34)","v":"0"},{"$f":"+'DATOS FC'!D34","v":"CEL/TEL (de administración) -en su caso indicar que no posee-:"},{"$f":"IF('DATOS FC'!E34>0,'DATOS FC'!E34,\"INCOMPLETO RECHAZAR\")","v":"INCOMPLETO RECHAZAR"},9]
[{"$f":"+'DATOS FC'!A35","v":"b FONDO DE COMERCIO"},{"$f":"UPPER('DATOS FC'!B35)","v":"0"},{"$f":"UPPER('DATOS FC'!C35)","v":"0"},{"$f":"+'DATOS FC'!D35","v":"EMAIL (de administración)  -en su caso indicar que no posee-:"},{"$f":"IF('DATOS FC'!E35>0,'DATOS FC'!E35,\"INCOMPLETO RECHAZAR\")","v":"INCOMPLETO RECHAZAR"},10]
[{"$f":"+'DATOS FC'!A30","v":"ba FONDO DE COMERCIO"},{"$f":"UPPER('DATOS FC'!B30)","v":"0"},{"$f":"UPPER('DATOS FC'!C30)","v":"0"},{"$f":"+'DATOS FC'!D30","v":"DIRECCION domicilio legal:"},{"$f":"IF('DATOS FC'!E30>0,'DATOS FC'!E30,\"INCOMPLETO RECHAZAR\")","v":"INCOMPLETO RECHAZAR"},11]
[{"$f":"+'DATOS FC'!A31","v":"bb FONDO DE COMERCIO"},{"$f":"UPPER('DATOS FC'!B31)","v":"0"},{"$f":"UPPER('DATOS FC'!C31)","v":"0"},{"$f":"+'DATOS FC'!D31","v":"CUIT –sin puntos ni barras-:"},{"$f":"IF('DATOS FC'!E31>0,'DATOS FC'!E31,\"INCOMPLETO RECHAZAR\")","v":"INCOMPLETO RECHAZAR"},12]
[{"$f":"+'PROPIETARIO actuales'!A23","v":"c PROP PH"},{"$f":"+'PROPIETARIO actuales'!B23","v":0},{"$f":"+'PROPIETARIO actuales'!C23","v":0},{"$f":"+'PROPIETARIO actuales'!D23","v":"CEL/TEL :"},{"$f":"IF('PROPIETARIO actuales'!E23>0,'PROPIETARIO actuales'!E23,\"INCOMPLETO RECHAZAR\")","v":"INCOMPLETO RECHAZAR"},14]
[{"$f":"+'PROPIETARIO actuales'!A17","v":"c PROP PH"},{"$f":"+'PROPIETARIO actuales'!B17","v":0},{"$f":"+'PROPIETARIO actuales'!C17","v":0},{"$f":"+'PROPIETARIO actuales'!D17","v":"CUIT/CUIL –sin puntos ni barras-:"},{"$f":"IF('PROPIETARIO actuales'!E17>0,'PROPIETARIO actuales'!E17,\"INCOMPLETO RECHAZAR\")","v":"INCOMPLETO RECHAZAR"},15]
[{"$f":"+'PROPIETARIO actuales'!A28","v":"c PROP PH"},{"$f":"+'PROPIETARIO actuales'!B28","v":0},{"$f":"+'PROPIETARIO actuales'!C28","v":0},{"$f":"+'PROPIETARIO actuales'!D28","v":""},{"$f":"IF('PROPIETARIO actuales'!E28>0,'PROPIETARIO actuales'!E28,\"INCOMPLETO RECHAZAR\")","v":"INCOMPLETO RECHAZAR"},16]
[{"$f":"+'PROPIETARIO actuales'!A16","v":"c PROP PH"},{"$f":"+'PROPIETARIO actuales'!B16","v":0},{"$f":"+'PROPIETARIO actuales'!C16","v":0},{"$f":"+'PROPIETARIO actuales'!D16","v":"DOC. IDENTIDAD –sin puntos-:"},{"$f":"IF('PROPIETARIO actuales'!E16>0,'PROPIETARIO actuales'!E16,\"INCOMPLETO RECHAZAR\")","v":"INCOMPLETO RECHAZAR"},17]
[{"$f":"+'PROPIETARIO actuales'!A22","v":"c PROP PH"},{"$f":"+'PROPIETARIO actuales'!B22","v":0},{"$f":"+'PROPIETARIO actuales'!C22","v":0},{"$f":"+'PROPIETARIO actuales'!D22","v":"DOMICILIO REAL:"},{"$f":"IF('PROPIETARIO actuales'!E22>0,'PROPIETARIO actuales'!E22,\"INCOMPLETO RECHAZAR\")","v":"INCOMPLETO RECHAZAR"},18]
[{"$f":"+'PROPIETARIO actuales'!A24","v":"c PROP PH"},{"$f":"+'PROPIETARIO actuales'!B24","v":0},{"$f":"+'PROPIETARIO actuales'!C24","v":0},{"$f":"+'PROPIETARIO actuales'!D24","v":"EMAIL:"},{"$f":"IF('PROPIETARIO actuales'!E24>0,'PROPIETARIO actuales'!E24,\"INCOMPLETO RECHAZAR\")","v":"INCOMPLETO RECHAZAR"},19]
[{"$f":"+'PROPIETARIO actuales'!A25","v":"c PROP PH"},{"$f":"+'PROPIETARIO actuales'!B25","v":0},{"$f":"+'PROPIETARIO actuales'!C25","v":0},{"$f":"+'PROPIETARIO actuales'!D25","v":"ESTADO CIVIL:"},{"$f":"IF('PROPIETARIO actuales'!E25>0,'PROPIETARIO actuales'!E25,\"INCOMPLETO RECHAZAR\")","v":"INCOMPLETO RECHAZAR"},20]
[{"$f":"+'PROPIETARIO actuales'!A18","v":"c PROP PH"},{"$f":"+'PROPIETARIO actuales'!B18","v":0},{"$f":"+'PROPIETARIO actuales'!C18","v":0},{"$f":"+'PROPIETARIO actuales'!D18","v":"FECHA DE NACIMIENTO –dd/mm/aa-:"},{"$f":"IF('PROPIETARIO actuales'!E18>0,'PROPIETARIO actuales'!E18,\"INCOMPLETO RECHAZAR\")","v":"INCOMPLETO RECHAZAR"},21]
[{"$f":"+'PROPIETARIO actuales'!A19","v":"c PROP PH"},{"$f":"+'PROPIETARIO actuales'!B19","v":0},{"$f":"+'PROPIETARIO actuales'!C19","v":0},{"$f":"+'PROPIETARIO actuales'!D19","v":"LUGAR DE NACIMIENTO:"},{"$f":"IF('PROPIETARIO actuales'!E19>0,'PROPIETARIO actuales'!E19,\"INCOMPLETO RECHAZAR\")","v":"INCOMPLETO RECHAZAR"},22]
[{"$f":"+'PROPIETARIO actuales'!A20","v":"c PROP PH"},{"$f":"+'PROPIETARIO actuales'!B20","v":0},{"$f":"+'PROPIETARIO actuales'!C20","v":0},{"$f":"+'PROPIETARIO actuales'!D20","v":"NACIONALIDAD:"},{"$f":"IF('PROPIETARIO actuales'!E20>0,'PROPIETARIO actuales'!E20,\"INCOMPLETO RECHAZAR\")","v":"INCOMPLETO RECHAZAR"},23]
[{"$f":"+'PROPIETARIO actuales'!A27","v":"c PROP PH"},{"$f":"+'PROPIETARIO actuales'!B27","v":0},{"$f":"+'PROPIETARIO actuales'!C27","v":0},{"$f":"+'PROPIETARIO actuales'!D27","v":""},{"$f":"IF('PROPIETARIO actuales'!E27>0,'PROPIETARIO actuales'!E27,\"INCOMPLETO RECHAZAR\")","v":"INCOMPLETO RECHAZAR"},24]
[{"$f":"+'PROPIETARIO actuales'!A31","v":"c PROP PH"},{"$f":"+'PROPIETARIO actuales'!B31","v":0},{"$f":"+'PROPIETARIO actuales'!C31","v":0},{"$f":"+'PROPIETARIO actuales'!D31","v":"NOTA/OBSERVACIÓN -en mayúscula-:"},{"$f":"IF('PROPIETARIO actuales'!E31>0,'PROPIETARIO actuales'!E31,\"INCOMPLETO RECHAZAR\")","v":"INCOMPLETO RECHAZAR"},25]
[{"$f":"+'PROPIETARIO actuales'!A21","v":"c PROP PH"},{"$f":"+'PROPIETARIO actuales'!B21","v":0},{"$f":"+'PROPIETARIO actuales'!C21","v":0},{"$f":"+'PROPIETARIO actuales'!D21","v":"PROFESIÓN/OFICIO:"},{"$f":"IF('PROPIETARIO actuales'!E21>0,'PROPIETARIO actuales'!E21,\"INCOMPLETO RECHAZAR\")","v":"INCOMPLETO RECHAZAR"},26]
[{"$f":"+'PROPIETARIO actuales'!A42","v":"c PROP PH"},{"$f":"+'PROPIETARIO actuales'!B42","v":0},{"$f":"+'PROPIETARIO actuales'!C42","v":0},{"$f":"+'PROPIETARIO actuales'!D42","v":""},{"$f":"IF('PROPIETARIO actuales'!E42>0,'PROPIETARIO actuales'!E42,\"INCOMPLETO RECHAZAR\")","v":"INCOMPLETO RECHAZAR"},27]
[{"$f":"+'PROPIETARIO actuales'!A39","v":"c PROP PH"},{"$f":"+'PROPIETARIO actuales'!B39","v":0},{"$f":"+'PROPIETARIO actuales'!C39","v":0},{"$f":"+'PROPIETARIO actuales'!D39","v":"CEL/TEL :"},{"$f":"IF('PROPIETARIO actuales'!E39>0,'PROPIETARIO actuales'!E39,\"INCOMPLETO RECHAZAR\")","v":"INCOMPLETO RECHAZAR"},28]
[{"$f":"+'PROPIETARIO actuales'!A33","v":"c PROP PH"},{"$f":"+'PROPIETARIO actuales'!B33","v":0},{"$f":"+'PROPIETARIO actuales'!C33","v":0},{"$f":"+'PROPIETARIO actuales'!D33","v":"CUIT/CUIL –sin puntos ni barras-:"},{"$f":"IF('PROPIETARIO actuales'!E33>0,'PROPIETARIO actuales'!E33,\"INCOMPLETO RECHAZAR\")","v":"INCOMPLETO RECHAZAR"},29]
[{"$f":"+'PROPIETARIO actuales'!A44","v":"c PROP PH"},{"$f":"+'PROPIETARIO actuales'!B44","v":0},{"$f":"+'PROPIETARIO actuales'!C44","v":0},{"$f":"+'PROPIETARIO actuales'!D44","v":""},{"$f":"IF('PROPIETARIO actuales'!E44>0,'PROPIETARIO actuales'!E44,\"INCOMPLETO RECHAZAR\")","v":"INCOMPLETO RECHAZAR"},30]
[{"$f":"+'PROPIETARIO actuales'!A32","v":"c PROP PH"},{"$f":"+'PROPIETARIO actuales'!B32","v":0},{"$f":"+'PROPIETARIO actuales'!C32","v":0},{"$f":"+'PROPIETARIO actuales'!D32","v":"DOC. IDENTIDAD –sin puntos-:"},{"$f":"IF('PROPIETARIO actuales'!E32>0,'PROPIETARIO actuales'!E32,\"INCOMPLETO RECHAZAR\")","v":"INCOMPLETO RECHAZAR"},31]
[{"$f":"+'PROPIETARIO actuales'!A38","v":"c PROP PH"},{"$f":"+'PROPIETARIO actuales'!B38","v":0},{"$f":"+'PROPIETARIO actuales'!C38","v":0},{"$f":"+'PROPIETARIO actuales'!D38","v":"DOMICILIO REAL:"},{"$f":"IF('PROPIETARIO actuales'!E38>0,'PROPIETARIO actuales'!E38,\"INCOMPLETO RECHAZAR\")","v":"INCOMPLETO RECHAZAR"},32]
[{"$f":"+'PROPIETARIO actuales'!A40","v":"c PROP PH"},{"$f":"+'PROPIETARIO actuales'!B40","v":0},{"$f":"+'PROPIETARIO actuales'!C40","v":0},{"$f":"+'PROPIETARIO actuales'!D40","v":"EMAIL:"},{"$f":"IF('PROPIETARIO actuales'!E40>0,'PROPIETARIO actuales'!E40,\"INCOMPLETO RECHAZAR\")","v":"INCOMPLETO RECHAZAR"},33]
[{"$f":"+'PROPIETARIO actuales'!A41","v":"c PROP PH"},{"$f":"+'PROPIETARIO actuales'!B41","v":0},{"$f":"+'PROPIETARIO actuales'!C41","v":0},{"$f":"+'PROPIETARIO actuales'!D41","v":"ESTADO CIVIL:"},{"$f":"IF('PROPIETARIO actuales'!E41>0,'PROPIETARIO actuales'!E41,\"INCOMPLETO RECHAZAR\")","v":"INCOMPLETO RECHAZAR"},34]
[{"$f":"+'PROPIETARIO actuales'!A34","v":"c PROP PH"},{"$f":"+'PROPIETARIO actuales'!B34","v":0},{"$f":"+'PROPIETARIO actuales'!C34","v":0},{"$f":"+'PROPIETARIO actuales'!D34","v":"FECHA DE NACIMIENTO –dd/mm/aa-:"},{"$f":"IF('PROPIETARIO actuales'!E34>0,'PROPIETARIO actuales'!E34,\"INCOMPLETO RECHAZAR\")","v":"INCOMPLETO RECHAZAR"},35]
[{"$f":"+'PROPIETARIO actuales'!A35","v":"c PROP PH"},{"$f":"+'PROPIETARIO actuales'!B35","v":0},{"$f":"+'PROPIETARIO actuales'!C35","v":0},{"$f":"+'PROPIETARIO actuales'!D35","v":"LUGAR DE NACIMIENTO:"},{"$f":"IF('PROPIETARIO actuales'!E35>0,'PROPIETARIO actuales'!E35,\"INCOMPLETO RECHAZAR\")","v":"INCOMPLETO RECHAZAR"},36]
[{"$f":"+'PROPIETARIO actuales'!A36","v":"c PROP PH"},{"$f":"+'PROPIETARIO actuales'!B36","v":0},{"$f":"+'PROPIETARIO actuales'!C36","v":0},{"$f":"+'PROPIETARIO actuales'!D36","v":"NACIONALIDAD:"},{"$f":"IF('PROPIETARIO actuales'!E36>0,'PROPIETARIO actuales'!E36,\"INCOMPLETO RECHAZAR\")","v":"INCOMPLETO RECHAZAR"},37]
[{"$f":"+'PROPIETARIO actuales'!A43","v":"c PROP PH"},{"$f":"+'PROPIETARIO actuales'!B43","v":0},{"$f":"+'PROPIETARIO actuales'!C43","v":0},{"$f":"+'PROPIETARIO actuales'!D43","v":""},{"$f":"IF('PROPIETARIO actuales'!E43>0,'PROPIETARIO actuales'!E43,\"INCOMPLETO RECHAZAR\")","v":"INCOMPLETO RECHAZAR"},38]
[{"$f":"+'PROPIETARIO actuales'!A51","v":"c PROP PH"},{"$f":"+'PROPIETARIO actuales'!B51","v":0},{"$f":"+'PROPIETARIO actuales'!C51","v":0},{"$f":"+'PROPIETARIO actuales'!D51","v":"LUGAR DE NACIMIENTO:"},{"$f":"IF('PROPIETARIO actuales'!E51>0,'PROPIETARIO actuales'!E51,\"INCOMPLETO RECHAZAR\")","v":"INCOMPLETO RECHAZAR"},39]
[{"$f":"+'PROPIETARIO actuales'!A37","v":"c PROP PH"},{"$f":"+'PROPIETARIO actuales'!B37","v":0},{"$f":"+'PROPIETARIO actuales'!C37","v":0},{"$f":"+'PROPIETARIO actuales'!D37","v":"PROFESIÓN/OFICIO:"},{"$f":"IF('PROPIETARIO actuales'!E37>0,'PROPIETARIO actuales'!E37,\"INCOMPLETO RECHAZAR\")","v":"INCOMPLETO RECHAZAR"},40]
[{"$f":"+'PROPIETARIO actuales'!A59","v":"c PROP PH"},{"$f":"+'PROPIETARIO actuales'!B59","v":0},{"$f":"+'PROPIETARIO actuales'!C59","v":0},{"$f":"+'PROPIETARIO actuales'!D59","v":""},{"$f":"IF('PROPIETARIO actuales'!E59>0,'PROPIETARIO actuales'!E59,\"INCOMPLETO RECHAZAR\")","v":"INCOMPLETO RECHAZAR"},42]
[{"$f":"+'PROPIETARIO actuales'!A53","v":"c PROP PH"},{"$f":"+'PROPIETARIO actuales'!B53","v":0},{"$f":"+'PROPIETARIO actuales'!C53","v":0},{"$f":"+'PROPIETARIO actuales'!D53","v":"PROFESIÓN/OFICIO:"},{"$f":"IF('PROPIETARIO actuales'!E53>0,'PROPIETARIO actuales'!E53,\"INCOMPLETO RECHAZAR\")","v":"INCOMPLETO RECHAZAR"},43]
[{"$f":"+'PROPIETARIO actuales'!A62","v":"j ORG. FISCALIZ."},{"$f":"+'PROPIETARIO actuales'!B62","v":0},{"$f":"+'PROPIETARIO actuales'!C62","v":0},{"$f":"+'PROPIETARIO actuales'!D62","v":"NOMBRE CARGO FISCALIZACIÓN QUE OCUPA:"},{"$f":"IF('PROPIETARIO actuales'!E62>0,'PROPIETARIO actuales'!E62,\"INCOMPLETO RECHAZAR\")","v":"INCOMPLETO RECHAZAR"},44]
[{"$f":"+'PROPIETARIO actuales'!A52","v":"c PROP PH"},{"$f":"+'PROPIETARIO actuales'!B52","v":0},{"$f":"+'PROPIETARIO actuales'!C52","v":0},{"$f":"+'PROPIETARIO actuales'!D52","v":"NACIONALIDAD:"},{"$f":"IF('PROPIETARIO actuales'!E52>0,'PROPIETARIO actuales'!E52,\"INCOMPLETO RECHAZAR\")","v":"INCOMPLETO RECHAZAR"},45]
[{"$f":"+'PROPIETARIO actuales'!A58","v":"c PROP PH"},{"$f":"+'PROPIETARIO actuales'!B58","v":0},{"$f":"+'PROPIETARIO actuales'!C58","v":0},{"$f":"+'PROPIETARIO actuales'!D58","v":""},{"$f":"IF('PROPIETARIO actuales'!E58>0,'PROPIETARIO actuales'!E58,\"INCOMPLETO RECHAZAR\")","v":"INCOMPLETO RECHAZAR"},46]
[{"$f":"+'PROPIETARIO actuales'!A60","v":"c PROP PH"},{"$f":"+'PROPIETARIO actuales'!B60","v":0},{"$f":"+'PROPIETARIO actuales'!C60","v":0},{"$f":"+'PROPIETARIO actuales'!D60","v":""},{"$f":"IF('PROPIETARIO actuales'!E60>0,'PROPIETARIO actuales'!E60,\"INCOMPLETO RECHAZAR\")","v":"INCOMPLETO RECHAZAR"},47]
[{"$f":"+'PROPIETARIO actuales'!A54","v":"c PROP PH"},{"$f":"+'PROPIETARIO actuales'!B54","v":0},{"$f":"+'PROPIETARIO actuales'!C54","v":0},{"$f":"+'PROPIETARIO actuales'!D54","v":"DOMICILIO REAL:"},{"$f":"IF('PROPIETARIO actuales'!E54>0,'PROPIETARIO actuales'!E54,\"INCOMPLETO RECHAZAR\")","v":"INCOMPLETO RECHAZAR"},49]
[{"$f":"+'PROPIETARIO actuales'!A55","v":"c PROP PH"},{"$f":"+'PROPIETARIO actuales'!B55","v":0},{"$f":"+'PROPIETARIO actuales'!C55","v":0},{"$f":"+'PROPIETARIO actuales'!D55","v":"CEL/TEL :"},{"$f":"IF('PROPIETARIO actuales'!E55>0,'PROPIETARIO actuales'!E55,\"INCOMPLETO RECHAZAR\")","v":"INCOMPLETO RECHAZAR"},50]
[{"$f":"+'PROPIETARIO actuales'!A56","v":"c PROP PH"},{"$f":"+'PROPIETARIO actuales'!B56","v":0},{"$f":"+'PROPIETARIO actuales'!C56","v":0},{"$f":"+'PROPIETARIO actuales'!D56","v":"EMAIL:"},{"$f":"IF('PROPIETARIO actuales'!E56>0,'PROPIETARIO actuales'!E56,\"INCOMPLETO RECHAZAR\")","v":"INCOMPLETO RECHAZAR"},51]
[{"$f":"+'PROPIETARIO actuales'!A61","v":"i ORG. REP. LEGAL/ ADM."},{"$f":"+'PROPIETARIO actuales'!B61","v":0},{"$f":"+'PROPIETARIO actuales'!C61","v":0},{"$f":"+'PROPIETARIO actuales'!D61","v":"NOMBRE CARGO REP. LEGAL/ ADMINISTRACIÓN QUE OCUPA:"},{"$f":"IF('PROPIETARIO actuales'!E61>0,'PROPIETARIO actuales'!E61,\"INCOMPLETO RECHAZAR\")","v":"INCOMPLETO RECHAZAR"},52]
[{"$f":"+'PROPIETARIO actuales'!A71","v":"c PROP PH"},{"$f":"+'PROPIETARIO actuales'!B71","v":0},{"$f":"+'PROPIETARIO actuales'!C71","v":0},{"$f":"+'PROPIETARIO actuales'!D71","v":"CEL/TEL :"},{"$f":"IF('PROPIETARIO actuales'!E71>0,'PROPIETARIO actuales'!E71,\"INCOMPLETO RECHAZAR\")","v":"INCOMPLETO RECHAZAR"},53]
[{"$f":"+'PROPIETARIO actuales'!A57","v":"c PROP PH"},{"$f":"+'PROPIETARIO actuales'!B57","v":0},{"$f":"+'PROPIETARIO actuales'!C57","v":0},{"$f":"+'PROPIETARIO actuales'!D57","v":"ESTADO CIVIL:"},{"$f":"IF('PROPIETARIO actuales'!E57>0,'PROPIETARIO actuales'!E57,\"INCOMPLETO RECHAZAR\")","v":"INCOMPLETO RECHAZAR"},54]
[{"$f":"+'PROPIETARIO actuales'!A80","v":"c PROP PH"},{"$f":"+'PROPIETARIO actuales'!B80","v":0},{"$f":"+'PROPIETARIO actuales'!C80","v":0},{"$f":"+'PROPIETARIO actuales'!D80","v":"DOC. IDENTIDAD –sin puntos-:"},{"$f":"IF('PROPIETARIO actuales'!E80>0,'PROPIETARIO actuales'!E80,\"INCOMPLETO RECHAZAR\")","v":"INCOMPLETO RECHAZAR"},55]
[{"$f":"+'PROPIETARIO actuales'!A77","v":"i ORG. REP. LEGAL/ ADM."},{"$f":"+'PROPIETARIO actuales'!B77","v":0},{"$f":"+'PROPIETARIO actuales'!C77","v":0},{"$f":"+'PROPIETARIO actuales'!D77","v":"NOMBRE CARGO REP. LEGAL/ ADMINISTRACIÓN QUE OCUPA:"},{"$f":"IF('PROPIETARIO actuales'!E77>0,'PROPIETARIO actuales'!E77,\"INCOMPLETO RECHAZAR\")","v":"INCOMPLETO RECHAZAR"},56]
[{"$f":"+'PROPIETARIO actuales'!A73","v":"c PROP PH"},{"$f":"+'PROPIETARIO actuales'!B73","v":0},{"$f":"+'PROPIETARIO actuales'!C73","v":0},{"$f":"+'PROPIETARIO actuales'!D73","v":"ESTADO CIVIL:"},{"$f":"IF('PROPIETARIO actuales'!E73>0,'PROPIETARIO actuales'!E73,\"INCOMPLETO RECHAZAR\")","v":"INCOMPLETO RECHAZAR"},57]
[{"$f":"+'PROPIETARIO actuales'!A82","v":"c PROP PH"},{"$f":"+'PROPIETARIO actuales'!B82","v":0},{"$f":"+'PROPIETARIO actuales'!C82","v":0},{"$f":"+'PROPIETARIO actuales'!D82","v":"FECHA DE NACIMIENTO –dd/mm/aa-:"},{"$f":"IF('PROPIETARIO actuales'!E82>0,'PROPIETARIO actuales'!E82,\"INCOMPLETO RECHAZAR\")","v":"INCOMPLETO RECHAZAR"},58]
[{"$f":"+'PROPIETARIO actuales'!A72","v":"c PROP PH"},{"$f":"+'PROPIETARIO actuales'!B72","v":0},{"$f":"+'PROPIETARIO actuales'!C72","v":0},{"$f":"+'PROPIETARIO actuales'!D72","v":"EMAIL:"},{"$f":"IF('PROPIETARIO actuales'!E72>0,'PROPIETARIO actuales'!E72,\"INCOMPLETO RECHAZAR\")","v":"INCOMPLETO RECHAZAR"},59]
[{"$f":"+'PROPIETARIO actuales'!A78","v":"j ORG. FISCALIZ."},{"$f":"+'PROPIETARIO actuales'!B78","v":0},{"$f":"+'PROPIETARIO actuales'!C78","v":0},{"$f":"+'PROPIETARIO actuales'!D78","v":"NOMBRE CARGO FISCALIZACIÓN QUE OCUPA:"},{"$f":"IF('PROPIETARIO actuales'!E78>0,'PROPIETARIO actuales'!E78,\"INCOMPLETO RECHAZAR\")","v":"INCOMPLETO RECHAZAR"},61]
[{"$f":"+'PROPIETARIO actuales'!A79","v":"c PROP PH"},{"$f":"+'PROPIETARIO actuales'!B79","v":0},{"$f":"+'PROPIETARIO actuales'!C79","v":0},{"$f":"+'PROPIETARIO actuales'!D79","v":"NOTA/OBSERVACIÓN -en mayúscula-:"},{"$f":"IF('PROPIETARIO actuales'!E79>0,'PROPIETARIO actuales'!E79,\"INCOMPLETO RECHAZAR\")","v":"INCOMPLETO RECHAZAR"},62]
[{"$f":"+'PROPIETARIO actuales'!A74","v":"c PROP PH"},{"$f":"+'PROPIETARIO actuales'!B74","v":0},{"$f":"+'PROPIETARIO actuales'!C74","v":0},{"$f":"+'PROPIETARIO actuales'!D74","v":""},{"$f":"IF('PROPIETARIO actuales'!E74>0,'PROPIETARIO actuales'!E74,\"INCOMPLETO RECHAZAR\")","v":"INCOMPLETO RECHAZAR"},63]
[{"$f":"+'PROPIETARIO actuales'!A75","v":"c PROP PH"},{"$f":"+'PROPIETARIO actuales'!B75","v":0},{"$f":"+'PROPIETARIO actuales'!C75","v":0},{"$f":"+'PROPIETARIO actuales'!D75","v":""},{"$f":"IF('PROPIETARIO actuales'!E75>0,'PROPIETARIO actuales'!E75,\"INCOMPLETO RECHAZAR\")","v":"INCOMPLETO RECHAZAR"},64]
[{"$f":"+'PROPIETARIO actuales'!A76","v":"c PROP PH"},{"$f":"+'PROPIETARIO actuales'!B76","v":0},{"$f":"+'PROPIETARIO actuales'!C76","v":0},{"$f":"+'PROPIETARIO actuales'!D76","v":""},{"$f":"IF('PROPIETARIO actuales'!E76>0,'PROPIETARIO actuales'!E76,\"INCOMPLETO RECHAZAR\")","v":"INCOMPLETO RECHAZAR"},65]
[{"$f":"+'PROPIETARIO actuales'!A81","v":"c PROP PH"},{"$f":"+'PROPIETARIO actuales'!B81","v":0},{"$f":"+'PROPIETARIO actuales'!C81","v":0},{"$f":"+'PROPIETARIO actuales'!D81","v":"CUIT/CUIL –sin puntos ni barras-:"},{"$f":"IF('PROPIETARIO actuales'!E81>0,'PROPIETARIO actuales'!E81,\"INCOMPLETO RECHAZAR\")","v":"INCOMPLETO RECHAZAR"},66]
[{"$f":"+'PROPIETARIO actuales'!A91","v":"c PROP PH"},{"$f":"+'PROPIETARIO actuales'!B91","v":0},{"$f":"+'PROPIETARIO actuales'!C91","v":0},{"$f":"+'PROPIETARIO actuales'!D91","v":""},{"$f":"IF('PROPIETARIO actuales'!E91>0,'PROPIETARIO actuales'!E91,\"INCOMPLETO RECHAZAR\")","v":"INCOMPLETO RECHAZAR"},67]
[{"$f":"+'PROPIETARIO actuales'!A100","v":"c PROP PH"},{"$f":"+'PROPIETARIO actuales'!B100","v":0},{"$f":"+'PROPIETARIO actuales'!C100","v":0},{"$f":"+'PROPIETARIO actuales'!D100","v":"NACIONALIDAD:"},{"$f":"IF('PROPIETARIO actuales'!E100>0,'PROPIETARIO actuales'!E100,\"INCOMPLETO RECHAZAR\")","v":"INCOMPLETO RECHAZAR"},69]
[{"$f":"+'PROPIETARIO actuales'!A97","v":"c PROP PH"},{"$f":"+'PROPIETARIO actuales'!B97","v":0},{"$f":"+'PROPIETARIO actuales'!C97","v":0},{"$f":"+'PROPIETARIO actuales'!D97","v":"CUIT/CUIL –sin puntos ni barras-:"},{"$f":"IF('PROPIETARIO actuales'!E97>0,'PROPIETARIO actuales'!E97,\"INCOMPLETO RECHAZAR\")","v":"INCOMPLETO RECHAZAR"},70]
[{"$f":"+'PROPIETARIO actuales'!A102","v":"c PROP PH"},{"$f":"+'PROPIETARIO actuales'!B102","v":0},{"$f":"+'PROPIETARIO actuales'!C102","v":0},{"$f":"+'PROPIETARIO actuales'!D102","v":"DOMICILIO REAL:"},{"$f":"IF('PROPIETARIO actuales'!E102>0,'PROPIETARIO actuales'!E102,\"INCOMPLETO RECHAZAR\")","v":"INCOMPLETO RECHAZAR"},72]
[{"$f":"+'PROPIETARIO actuales'!A92","v":"c PROP PH"},{"$f":"+'PROPIETARIO actuales'!B92","v":0},{"$f":"+'PROPIETARIO actuales'!C92","v":0},{"$f":"+'PROPIETARIO actuales'!D92","v":""},{"$f":"IF('PROPIETARIO actuales'!E92>0,'PROPIETARIO actuales'!E92,\"INCOMPLETO RECHAZAR\")","v":"INCOMPLETO RECHAZAR"},73]
[{"$f":"+'PROPIETARIO actuales'!A96","v":"c PROP PH"},{"$f":"+'PROPIETARIO actuales'!B96","v":0},{"$f":"+'PROPIETARIO actuales'!C96","v":0},{"$f":"+'PROPIETARIO actuales'!D96","v":"DOC. IDENTIDAD –sin puntos-:"},{"$f":"IF('PROPIETARIO actuales'!E96>0,'PROPIETARIO actuales'!E96,\"INCOMPLETO RECHAZAR\")","v":"INCOMPLETO RECHAZAR"},74]
[{"$f":"+'PROPIETARIO actuales'!A98","v":"c PROP PH"},{"$f":"+'PROPIETARIO actuales'!B98","v":0},{"$f":"+'PROPIETARIO actuales'!C98","v":0},{"$f":"+'PROPIETARIO actuales'!D98","v":"FECHA DE NACIMIENTO –dd/mm/aa-:"},{"$f":"IF('PROPIETARIO actuales'!E98>0,'PROPIETARIO actuales'!E98,\"INCOMPLETO RECHAZAR\")","v":"INCOMPLETO RECHAZAR"},75]
[{"$f":"+'PROPIETARIO actuales'!A99","v":"c PROP PH"},{"$f":"+'PROPIETARIO actuales'!B99","v":0},{"$f":"+'PROPIETARIO actuales'!C99","v":0},{"$f":"+'PROPIETARIO actuales'!D99","v":"LUGAR DE NACIMIENTO:"},{"$f":"IF('PROPIETARIO actuales'!E99>0,'PROPIETARIO actuales'!E99,\"INCOMPLETO RECHAZAR\")","v":"INCOMPLETO RECHAZAR"},76]
[{"$f":"+'PROPIETARIO actuales'!A93","v":"i ORG. REP. LEGAL/ ADM."},{"$f":"+'PROPIETARIO actuales'!B93","v":0},{"$f":"+'PROPIETARIO actuales'!C93","v":0},{"$f":"+'PROPIETARIO actuales'!D93","v":"NOMBRE CARGO REP. LEGAL/ ADMINISTRACIÓN QUE OCUPA:"},{"$f":"IF('PROPIETARIO actuales'!E93>0,'PROPIETARIO actuales'!E93,\"INCOMPLETO RECHAZAR\")","v":"INCOMPLETO RECHAZAR"},78]
[{"$f":"+'PROPIETARIO actuales'!A94","v":"j ORG. FISCALIZ."},{"$f":"+'PROPIETARIO actuales'!B94","v":0},{"$f":"+'PROPIETARIO actuales'!C94","v":0},{"$f":"+'PROPIETARIO actuales'!D94","v":"NOMBRE CARGO FISCALIZACIÓN QUE OCUPA:"},{"$f":"IF('PROPIETARIO actuales'!E94>0,'PROPIETARIO actuales'!E94,\"INCOMPLETO RECHAZAR\")","v":"INCOMPLETO RECHAZAR"},79]
[{"$f":"+'PROPIETARIO actuales'!A101","v":"c PROP PH"},{"$f":"+'PROPIETARIO actuales'!B101","v":0},{"$f":"+'PROPIETARIO actuales'!C101","v":0},{"$f":"+'PROPIETARIO actuales'!D101","v":"PROFESIÓN/OFICIO:"},{"$f":"IF('PROPIETARIO actuales'!E101>0,'PROPIETARIO actuales'!E101,\"INCOMPLETO RECHAZAR\")","v":"INCOMPLETO RECHAZAR"},80]
[{"$f":"+'PROPIETARIO actuales'!A109","v":"i ORG. REP. LEGAL/ ADM."},{"$f":"+'PROPIETARIO actuales'!B109","v":0},{"$f":"+'PROPIETARIO actuales'!C109","v":0},{"$f":"+'PROPIETARIO actuales'!D109","v":"NOMBRE CARGO REP. LEGAL/ ADMINISTRACIÓN QUE OCUPA:"},{"$f":"IF('PROPIETARIO actuales'!E109>0,'PROPIETARIO actuales'!E109,\"INCOMPLETO RECHAZAR\")","v":"INCOMPLETO RECHAZAR"},81]
[{"$f":"+'PROPIETARIO actuales'!A95","v":"c PROP PH"},{"$f":"+'PROPIETARIO actuales'!B95","v":0},{"$f":"+'PROPIETARIO actuales'!C95","v":0},{"$f":"+'PROPIETARIO actuales'!D95","v":"NOTA/OBSERVACIÓN -en mayúscula-:"},{"$f":"IF('PROPIETARIO actuales'!E95>0,'PROPIETARIO actuales'!E95,\"INCOMPLETO RECHAZAR\")","v":"INCOMPLETO RECHAZAR"},82]
[{"$f":"+'PROPIETARIO actuales'!A120","v":"c PROP PH"},{"$f":"+'PROPIETARIO actuales'!B120","v":0},{"$f":"+'PROPIETARIO actuales'!C120","v":0},{"$f":"+'PROPIETARIO actuales'!D120","v":"EMAIL:"},{"$f":"IF('PROPIETARIO actuales'!E120>0,'PROPIETARIO actuales'!E120,\"INCOMPLETO RECHAZAR\")","v":"INCOMPLETO RECHAZAR"},83]
[{"$f":"+'PROPIETARIO actuales'!A117","v":"c PROP PH"},{"$f":"+'PROPIETARIO actuales'!B117","v":0},{"$f":"+'PROPIETARIO actuales'!C117","v":0},{"$f":"+'PROPIETARIO actuales'!D117","v":"PROFESIÓN/OFICIO:"},{"$f":"IF('PROPIETARIO actuales'!E117>0,'PROPIETARIO actuales'!E117,\"INCOMPLETO RECHAZAR\")","v":"INCOMPLETO RECHAZAR"},84]
[{"$f":"+'PROPIETARIO actuales'!A111","v":"c PROP PH"},{"$f":"+'PROPIETARIO actuales'!B111","v":0},{"$f":"+'PROPIETARIO actuales'!C111","v":0},{"$f":"+'PROPIETARIO actuales'!D111","v":"NOTA/OBSERVACIÓN -en mayúscula-:"},{"$f":"IF('PROPIETARIO actuales'!E111>0,'PROPIETARIO actuales'!E111,\"INCOMPLETO RECHAZAR\")","v":"INCOMPLETO RECHAZAR"},85]
[{"$f":"+'PROPIETARIO actuales'!A122","v":"c PROP PH"},{"$f":"+'PROPIETARIO actuales'!B122","v":0},{"$f":"+'PROPIETARIO actuales'!C122","v":0},{"$f":"+'PROPIETARIO actuales'!D122","v":""},{"$f":"IF('PROPIETARIO actuales'!E122>0,'PROPIETARIO actuales'!E122,\"INCOMPLETO RECHAZAR\")","v":"INCOMPLETO RECHAZAR"},86]
[{"$f":"+'PROPIETARIO actuales'!A110","v":"j ORG. FISCALIZ."},{"$f":"+'PROPIETARIO actuales'!B110","v":0},{"$f":"+'PROPIETARIO actuales'!C110","v":0},{"$f":"+'PROPIETARIO actuales'!D110","v":"NOMBRE CARGO FISCALIZACIÓN QUE OCUPA:"},{"$f":"IF('PROPIETARIO actuales'!E110>0,'PROPIETARIO actuales'!E110,\"INCOMPLETO RECHAZAR\")","v":"INCOMPLETO RECHAZAR"},87]
[{"$f":"+'PROPIETARIO actuales'!A116","v":"c PROP PH"},{"$f":"+'PROPIETARIO actuales'!B116","v":0},{"$f":"+'PROPIETARIO actuales'!C116","v":0},{"$f":"+'PROPIETARIO actuales'!D116","v":"NACIONALIDAD:"},{"$f":"IF('PROPIETARIO actuales'!E116>0,'PROPIETARIO actuales'!E116,\"INCOMPLETO RECHAZAR\")","v":"INCOMPLETO RECHAZAR"},88]
[{"$f":"+'PROPIETARIO actuales'!A118","v":"c PROP PH"},{"$f":"+'PROPIETARIO actuales'!B118","v":0},{"$f":"+'PROPIETARIO actuales'!C118","v":0},{"$f":"+'PROPIETARIO actuales'!D118","v":"DOMICILIO REAL:"},{"$f":"IF('PROPIETARIO actuales'!E118>0,'PROPIETARIO actuales'!E118,\"INCOMPLETO RECHAZAR\")","v":"INCOMPLETO RECHAZAR"},89]
[{"$f":"+'PROPIETARIO actuales'!A119","v":"c PROP PH"},{"$f":"+'PROPIETARIO actuales'!B119","v":0},{"$f":"+'PROPIETARIO actuales'!C119","v":0},{"$f":"+'PROPIETARIO actuales'!D119","v":"CEL/TEL :"},{"$f":"IF('PROPIETARIO actuales'!E119>0,'PROPIETARIO actuales'!E119,\"INCOMPLETO RECHAZAR\")","v":"INCOMPLETO RECHAZAR"},90]
[{"$f":"+'PROPIETARIO actuales'!A112","v":"c PROP PH"},{"$f":"+'PROPIETARIO actuales'!B112","v":0},{"$f":"+'PROPIETARIO actuales'!C112","v":0},{"$f":"+'PROPIETARIO actuales'!D112","v":"DOC. IDENTIDAD –sin puntos-:"},{"$f":"IF('PROPIETARIO actuales'!E112>0,'PROPIETARIO actuales'!E112,\"INCOMPLETO RECHAZAR\")","v":"INCOMPLETO RECHAZAR"},91]
[{"$f":"+'PROPIETARIO actuales'!A113","v":"c PROP PH"},{"$f":"+'PROPIETARIO actuales'!B113","v":0},{"$f":"+'PROPIETARIO actuales'!C113","v":0},{"$f":"+'PROPIETARIO actuales'!D113","v":"CUIT/CUIL –sin puntos ni barras-:"},{"$f":"IF('PROPIETARIO actuales'!E113>0,'PROPIETARIO actuales'!E113,\"INCOMPLETO RECHAZAR\")","v":"INCOMPLETO RECHAZAR"},92]
[{"$f":"+'PROPIETARIO actuales'!A114","v":"c PROP PH"},{"$f":"+'PROPIETARIO actuales'!B114","v":0},{"$f":"+'PROPIETARIO actuales'!C114","v":0},{"$f":"+'PROPIETARIO actuales'!D114","v":"FECHA DE NACIMIENTO –dd/mm/aa-:"},{"$f":"IF('PROPIETARIO actuales'!E114>0,'PROPIETARIO actuales'!E114,\"INCOMPLETO RECHAZAR\")","v":"INCOMPLETO RECHAZAR"},93]
[{"$f":"+'PROPIETARIO actuales'!A121","v":"c PROP PH"},{"$f":"+'PROPIETARIO actuales'!B121","v":0},{"$f":"+'PROPIETARIO actuales'!C121","v":0},{"$f":"+'PROPIETARIO actuales'!D121","v":"ESTADO CIVIL:"},{"$f":"IF('PROPIETARIO actuales'!E121>0,'PROPIETARIO actuales'!E121,\"INCOMPLETO RECHAZAR\")","v":"INCOMPLETO RECHAZAR"},94]
[{"$f":"+'PROPIETARIO actuales'!A129","v":"c PROP PH"},{"$f":"+'PROPIETARIO actuales'!B129","v":0},{"$f":"+'PROPIETARIO actuales'!C129","v":0},{"$f":"+'PROPIETARIO actuales'!D129","v":"CUIT/CUIL –sin puntos ni barras-:"},{"$f":"IF('PROPIETARIO actuales'!E129>0,'PROPIETARIO actuales'!E129,\"INCOMPLETO RECHAZAR\")","v":"INCOMPLETO RECHAZAR"},95]
[{"$f":"+'PROPIETARIO actuales'!A115","v":"c PROP PH"},{"$f":"+'PROPIETARIO actuales'!B115","v":0},{"$f":"+'PROPIETARIO actuales'!C115","v":0},{"$f":"+'PROPIETARIO actuales'!D115","v":"LUGAR DE NACIMIENTO:"},{"$f":"IF('PROPIETARIO actuales'!E115>0,'PROPIETARIO actuales'!E115,\"INCOMPLETO RECHAZAR\")","v":"INCOMPLETO RECHAZAR"},96]
[{"$f":"+'PROPIETARIO actuales'!A140","v":"c PROP PH"},{"$f":"+'PROPIETARIO actuales'!B140","v":0},{"$f":"+'PROPIETARIO actuales'!C140","v":0},{"$f":"+'PROPIETARIO actuales'!D140","v":""},{"$f":"IF('PROPIETARIO actuales'!E140>0,'PROPIETARIO actuales'!E140,\"INCOMPLETO RECHAZAR\")","v":"INCOMPLETO RECHAZAR"},97]
[{"$f":"+'PROPIETARIO actuales'!A137","v":"c PROP PH"},{"$f":"+'PROPIETARIO actuales'!B137","v":0},{"$f":"+'PROPIETARIO actuales'!C137","v":0},{"$f":"+'PROPIETARIO actuales'!D137","v":"ESTADO CIVIL:"},{"$f":"IF('PROPIETARIO actuales'!E137>0,'PROPIETARIO actuales'!E137,\"INCOMPLETO RECHAZAR\")","v":"INCOMPLETO RECHAZAR"},98]
[{"$f":"+'PROPIETARIO actuales'!A131","v":"c PROP PH"},{"$f":"+'PROPIETARIO actuales'!B131","v":0},{"$f":"+'PROPIETARIO actuales'!C131","v":0},{"$f":"+'PROPIETARIO actuales'!D131","v":"LUGAR DE NACIMIENTO:"},{"$f":"IF('PROPIETARIO actuales'!E131>0,'PROPIETARIO actuales'!E131,\"INCOMPLETO RECHAZAR\")","v":"INCOMPLETO RECHAZAR"},99]
[{"$f":"+'PROPIETARIO actuales'!A130","v":"c PROP PH"},{"$f":"+'PROPIETARIO actuales'!B130","v":0},{"$f":"+'PROPIETARIO actuales'!C130","v":0},{"$f":"+'PROPIETARIO actuales'!D130","v":"FECHA DE NACIMIENTO –dd/mm/aa-:"},{"$f":"IF('PROPIETARIO actuales'!E130>0,'PROPIETARIO actuales'!E130,\"INCOMPLETO RECHAZAR\")","v":"INCOMPLETO RECHAZAR"},101]
[{"$f":"+'PROPIETARIO actuales'!A136","v":"c PROP PH"},{"$f":"+'PROPIETARIO actuales'!B136","v":0},{"$f":"+'PROPIETARIO actuales'!C136","v":0},{"$f":"+'PROPIETARIO actuales'!D136","v":"EMAIL:"},{"$f":"IF('PROPIETARIO actuales'!E136>0,'PROPIETARIO actuales'!E136,\"INCOMPLETO RECHAZAR\")","v":"INCOMPLETO RECHAZAR"},102]
[{"$f":"+'PROPIETARIO actuales'!A138","v":"c PROP PH"},{"$f":"+'PROPIETARIO actuales'!B138","v":0},{"$f":"+'PROPIETARIO actuales'!C138","v":0},{"$f":"+'PROPIETARIO actuales'!D138","v":""},{"$f":"IF('PROPIETARIO actuales'!E138>0,'PROPIETARIO actuales'!E138,\"INCOMPLETO RECHAZAR\")","v":"INCOMPLETO RECHAZAR"},103]
[{"$f":"+'PROPIETARIO actuales'!A139","v":"c PROP PH"},{"$f":"+'PROPIETARIO actuales'!B139","v":0},{"$f":"+'PROPIETARIO actuales'!C139","v":0},{"$f":"+'PROPIETARIO actuales'!D139","v":""},{"$f":"IF('PROPIETARIO actuales'!E139>0,'PROPIETARIO actuales'!E139,\"INCOMPLETO RECHAZAR\")","v":"INCOMPLETO RECHAZAR"},104]
[{"$f":"+'PROPIETARIO actuales'!A132","v":"c PROP PH"},{"$f":"+'PROPIETARIO actuales'!B132","v":0},{"$f":"+'PROPIETARIO actuales'!C132","v":0},{"$f":"+'PROPIETARIO actuales'!D132","v":"NACIONALIDAD:"},{"$f":"IF('PROPIETARIO actuales'!E132>0,'PROPIETARIO actuales'!E132,\"INCOMPLETO RECHAZAR\")","v":"INCOMPLETO RECHAZAR"},105]
[{"$f":"+'PROPIETARIO actuales'!A133","v":"c PROP PH"},{"$f":"+'PROPIETARIO actuales'!B133","v":0},{"$f":"+'PROPIETARIO actuales'!C133","v":0},{"$f":"+'PROPIETARIO actuales'!D133","v":"PROFESIÓN/OFICIO:"},{"$f":"IF('PROPIETARIO actuales'!E133>0,'PROPIETARIO actuales'!E133,\"INCOMPLETO RECHAZAR\")","v":"INCOMPLETO RECHAZAR"},106]
[{"$f":"+'PROPIETARIO actuales'!A134","v":"c PROP PH"},{"$f":"+'PROPIETARIO actuales'!B134","v":0},{"$f":"+'PROPIETARIO actuales'!C134","v":0},{"$f":"+'PROPIETARIO actuales'!D134","v":"DOMICILIO REAL:"},{"$f":"IF('PROPIETARIO actuales'!E134>0,'PROPIETARIO actuales'!E134,\"INCOMPLETO RECHAZAR\")","v":"INCOMPLETO RECHAZAR"},107]
[{"$f":"+'PROPIETARIO actuales'!A149","v":"c PROP PH"},{"$f":"+'PROPIETARIO actuales'!B149","v":0},{"$f":"+'PROPIETARIO actuales'!C149","v":0},{"$f":"+'PROPIETARIO actuales'!D149","v":"PROFESIÓN/OFICIO:"},{"$f":"IF('PROPIETARIO actuales'!E149>0,'PROPIETARIO actuales'!E149,\"INCOMPLETO RECHAZAR\")","v":"INCOMPLETO RECHAZAR"},109]
[{"$f":"+'PROPIETARIO actuales'!A135","v":"c PROP PH"},{"$f":"+'PROPIETARIO actuales'!B135","v":0},{"$f":"+'PROPIETARIO actuales'!C135","v":0},{"$f":"+'PROPIETARIO actuales'!D135","v":"CEL/TEL :"},{"$f":"IF('PROPIETARIO actuales'!E135>0,'PROPIETARIO actuales'!E135,\"INCOMPLETO RECHAZAR\")","v":"INCOMPLETO RECHAZAR"},110]
[{"$f":"+'PROPIETARIO actuales'!A158","v":"j ORG. FISCALIZ."},{"$f":"+'PROPIETARIO actuales'!B158","v":0},{"$f":"+'PROPIETARIO actuales'!C158","v":0},{"$f":"+'PROPIETARIO actuales'!D158","v":"NOMBRE CARGO FISCALIZACIÓN QUE OCUPA:"},{"$f":"IF('PROPIETARIO actuales'!E158>0,'PROPIETARIO actuales'!E158,\"INCOMPLETO RECHAZAR\")","v":"INCOMPLETO RECHAZAR"},111]
[{"$f":"+'PROPIETARIO actuales'!A151","v":"c PROP PH"},{"$f":"+'PROPIETARIO actuales'!B151","v":0},{"$f":"+'PROPIETARIO actuales'!C151","v":0},{"$f":"+'PROPIETARIO actuales'!D151","v":"CEL/TEL :"},{"$f":"IF('PROPIETARIO actuales'!E151>0,'PROPIETARIO actuales'!E151,\"INCOMPLETO RECHAZAR\")","v":"INCOMPLETO RECHAZAR"},113]
[{"$f":"+'PROPIETARIO actuales'!A160","v":"c PROP PH"},{"$f":"+'PROPIETARIO actuales'!B160","v":0},{"$f":"+'PROPIETARIO actuales'!C160","v":0},{"$f":"+'PROPIETARIO actuales'!D160","v":"DOC. IDENTIDAD –sin puntos-:"},{"$f":"IF('PROPIETARIO actuales'!E160>0,'PROPIETARIO actuales'!E160,\"INCOMPLETO RECHAZAR\")","v":"INCOMPLETO RECHAZAR"},114]
[{"$f":"+'PROPIETARIO actuales'!A150","v":"c PROP PH"},{"$f":"+'PROPIETARIO actuales'!B150","v":0},{"$f":"+'PROPIETARIO actuales'!C150","v":0},{"$f":"+'PROPIETARIO actuales'!D150","v":"DOMICILIO REAL:"},{"$f":"IF('PROPIETARIO actuales'!E150>0,'PROPIETARIO actuales'!E150,\"INCOMPLETO RECHAZAR\")","v":"INCOMPLETO RECHAZAR"},115]
[{"$f":"+'PROPIETARIO actuales'!A156","v":"c PROP PH"},{"$f":"+'PROPIETARIO actuales'!B156","v":0},{"$f":"+'PROPIETARIO actuales'!C156","v":0},{"$f":"+'PROPIETARIO actuales'!D156","v":""},{"$f":"IF('PROPIETARIO actuales'!E156>0,'PROPIETARIO actuales'!E156,\"INCOMPLETO RECHAZAR\")","v":"INCOMPLETO RECHAZAR"},116]
[{"$f":"+'PROPIETARIO actuales'!A157","v":"i ORG. REP. LEGAL/ ADM."},{"$f":"+'PROPIETARIO actuales'!B157","v":0},{"$f":"+'PROPIETARIO actuales'!C157","v":0},{"$f":"+'PROPIETARIO actuales'!D157","v":"NOMBRE CARGO REP. LEGAL/ ADMINISTRACIÓN QUE OCUPA:"},{"$f":"IF('PROPIETARIO actuales'!E157>0,'PROPIETARIO actuales'!E157,\"INCOMPLETO RECHAZAR\")","v":"INCOMPLETO RECHAZAR"},118]
[{"$f":"+'PROPIETARIO actuales'!A152","v":"c PROP PH"},{"$f":"+'PROPIETARIO actuales'!B152","v":0},{"$f":"+'PROPIETARIO actuales'!C152","v":0},{"$f":"+'PROPIETARIO actuales'!D152","v":"EMAIL:"},{"$f":"IF('PROPIETARIO actuales'!E152>0,'PROPIETARIO actuales'!E152,\"INCOMPLETO RECHAZAR\")","v":"INCOMPLETO RECHAZAR"},119]
[{"$f":"+'PROPIETARIO actuales'!A153","v":"c PROP PH"},{"$f":"+'PROPIETARIO actuales'!B153","v":0},{"$f":"+'PROPIETARIO actuales'!C153","v":0},{"$f":"+'PROPIETARIO actuales'!D153","v":"ESTADO CIVIL:"},{"$f":"IF('PROPIETARIO actuales'!E153>0,'PROPIETARIO actuales'!E153,\"INCOMPLETO RECHAZAR\")","v":"INCOMPLETO RECHAZAR"},120]
[{"$f":"+'PROPIETARIO actuales'!A154","v":"c PROP PH"},{"$f":"+'PROPIETARIO actuales'!B154","v":0},{"$f":"+'PROPIETARIO actuales'!C154","v":0},{"$f":"+'PROPIETARIO actuales'!D154","v":""},{"$f":"IF('PROPIETARIO actuales'!E154>0,'PROPIETARIO actuales'!E154,\"INCOMPLETO RECHAZAR\")","v":"INCOMPLETO RECHAZAR"},121]
[{"$f":"+'PROPIETARIO actuales'!A159","v":"c PROP PH"},{"$f":"+'PROPIETARIO actuales'!B159","v":0},{"$f":"+'PROPIETARIO actuales'!C159","v":0},{"$f":"+'PROPIETARIO actuales'!D159","v":"NOTA/OBSERVACIÓN -en mayúscula-:"},{"$f":"IF('PROPIETARIO actuales'!E159>0,'PROPIETARIO actuales'!E159,\"INCOMPLETO RECHAZAR\")","v":"INCOMPLETO RECHAZAR"},122]
[{"$f":"+'PROPIETARIO actuales'!A169","v":"c PROP PH"},{"$f":"+'PROPIETARIO actuales'!B169","v":0},{"$f":"+'PROPIETARIO actuales'!C169","v":0},{"$f":"+'PROPIETARIO actuales'!D169","v":"ESTADO CIVIL:"},{"$f":"IF('PROPIETARIO actuales'!E169>0,'PROPIETARIO actuales'!E169,\"INCOMPLETO RECHAZAR\")","v":"INCOMPLETO RECHAZAR"},123]
[{"$f":"+'PROPIETARIO actuales'!A155","v":"c PROP PH"},{"$f":"+'PROPIETARIO actuales'!B155","v":0},{"$f":"+'PROPIETARIO actuales'!C155","v":0},{"$f":"+'PROPIETARIO actuales'!D155","v":""},{"$f":"IF('PROPIETARIO actuales'!E155>0,'PROPIETARIO actuales'!E155,\"INCOMPLETO RECHAZAR\")","v":"INCOMPLETO RECHAZAR"},124]
[{"$f":"+'PROPIETARIO actuales'!A175","v":"c PROP PH"},{"$f":"+'PROPIETARIO actuales'!B175","v":0},{"$f":"+'PROPIETARIO actuales'!C175","v":0},{"$f":"+'PROPIETARIO actuales'!D175","v":"NOTA/OBSERVACIÓN -en mayúscula-:"},{"$f":"IF('PROPIETARIO actuales'!E175>0,'PROPIETARIO actuales'!E175,\"INCOMPLETO RECHAZAR\")","v":"INCOMPLETO RECHAZAR"},126]
[{"$f":"+'PROPIETARIO actuales'!A171","v":"c PROP PH"},{"$f":"+'PROPIETARIO actuales'!B171","v":0},{"$f":"+'PROPIETARIO actuales'!C171","v":0},{"$f":"+'PROPIETARIO actuales'!D171","v":""},{"$f":"IF('PROPIETARIO actuales'!E171>0,'PROPIETARIO actuales'!E171,\"INCOMPLETO RECHAZAR\")","v":"INCOMPLETO RECHAZAR"},127]
[{"$f":"+'PROPIETARIO actuales'!A170","v":"c PROP PH"},{"$f":"+'PROPIETARIO actuales'!B170","v":0},{"$f":"+'PROPIETARIO actuales'!C170","v":0},{"$f":"+'PROPIETARIO actuales'!D170","v":""},{"$f":"IF('PROPIETARIO actuales'!E170>0,'PROPIETARIO actuales'!E170,\"INCOMPLETO RECHAZAR\")","v":"INCOMPLETO RECHAZAR"},129]
[{"$f":"+'PROPIETARIO actuales'!A174","v":"j ORG. FISCALIZ."},{"$f":"+'PROPIETARIO actuales'!B174","v":0},{"$f":"+'PROPIETARIO actuales'!C174","v":0},{"$f":"+'PROPIETARIO actuales'!D174","v":"NOMBRE CARGO FISCALIZACIÓN QUE OCUPA:"},{"$f":"IF('PROPIETARIO actuales'!E174>0,'PROPIETARIO actuales'!E174,\"INCOMPLETO RECHAZAR\")","v":"INCOMPLETO RECHAZAR"},130]
[{"$f":"+'PROPIETARIO actuales'!A172","v":"c PROP PH"},{"$f":"+'PROPIETARIO actuales'!B172","v":0},{"$f":"+'PROPIETARIO actuales'!C172","v":0},{"$f":"+'PROPIETARIO actuales'!D172","v":""},{"$f":"IF('PROPIETARIO actuales'!E172>0,'PROPIETARIO actuales'!E172,\"INCOMPLETO RECHAZAR\")","v":"INCOMPLETO RECHAZAR"},133]
[{"$f":"+'PROPIETARIO actuales'!A173","v":"i ORG. REP. LEGAL/ ADM."},{"$f":"+'PROPIETARIO actuales'!B173","v":0},{"$f":"+'PROPIETARIO actuales'!C173","v":0},{"$f":"+'PROPIETARIO actuales'!D173","v":"NOMBRE CARGO REP. LEGAL/ ADMINISTRACIÓN QUE OCUPA:"},{"$f":"IF('PROPIETARIO actuales'!E173>0,'PROPIETARIO actuales'!E173,\"INCOMPLETO RECHAZAR\")","v":"INCOMPLETO RECHAZAR"},138]
[{"$f":"+'PROPIETARIO actuales'!G21","v":"c PROP PJ"},{"$f":"+'PROPIETARIO actuales'!H21","v":0},{"$f":"+'PROPIETARIO actuales'!H21","v":0},{"$f":"+'PROPIETARIO actuales'!I21","v":"APELLIDO/S, NOMBRE/S,  DNI Y CARGO DE CADA MIEMBRO DE SU ADMINISTRACIÓN:"},{"$f":"IF('PROPIETARIO actuales'!J21>0,'PROPIETARIO actuales'!J21,\"INCOMPLETO RECHAZAR\")","v":"INCOMPLETO RECHAZAR"},209]
[{"$f":"+'PROPIETARIO actuales'!G24","v":"c PROP PJ"},{"$f":"+'PROPIETARIO actuales'!H24","v":0},{"$f":"+'PROPIETARIO actuales'!H24","v":0},{"$f":"+'PROPIETARIO actuales'!I24","v":"CEL/TEL :"},{"$f":"IF('PROPIETARIO actuales'!J24>0,'PROPIETARIO actuales'!J24,\"INCOMPLETO RECHAZAR\")","v":"INCOMPLETO RECHAZAR"},210]
[{"$f":"+'PROPIETARIO actuales'!G16","v":"c PROP PJ"},{"$f":"+'PROPIETARIO actuales'!H16","v":0},{"$f":"+'PROPIETARIO actuales'!H16","v":0},{"$f":"+'PROPIETARIO actuales'!I16","v":"CUIT –sin puntos ni barras-:"},{"$f":"IF('PROPIETARIO actuales'!J16>0,'PROPIETARIO actuales'!J16,\"INCOMPLETO RECHAZAR\")","v":"INCOMPLETO RECHAZAR"},211]
[{"$f":"+'PROPIETARIO actuales'!G19","v":"c PROP PJ"},{"$f":"+'PROPIETARIO actuales'!H19","v":0},{"$f":"+'PROPIETARIO actuales'!H19","v":0},{"$f":"+'PROPIETARIO actuales'!I19","v":"DATOS DE RESOLUCIÓN Y FECHA DE INSCRIPCIÓN:"},{"$f":"IF('PROPIETARIO actuales'!J19>0,'PROPIETARIO actuales'!J19,\"INCOMPLETO RECHAZAR\")","v":"INCOMPLETO RECHAZAR"},212]
[{"$f":"+'PROPIETARIO actuales'!G22","v":"c PROP PJ"},{"$f":"+'PROPIETARIO actuales'!H22","v":0},{"$f":"+'PROPIETARIO actuales'!H22","v":0},{"$f":"+'PROPIETARIO actuales'!I22","v":"DOMICILIO SOCIAL:"},{"$f":"IF('PROPIETARIO actuales'!J22>0,'PROPIETARIO actuales'!J22,\"INCOMPLETO RECHAZAR\")","v":"INCOMPLETO RECHAZAR"},213]
[{"$f":"+'PROPIETARIO actuales'!G20","v":"c PROP PJ"},{"$f":"+'PROPIETARIO actuales'!H20","v":0},{"$f":"+'PROPIETARIO actuales'!H20","v":0},{"$f":"+'PROPIETARIO actuales'!I20","v":"FECHA DE INSCRIPCION:"},{"$f":"IF('PROPIETARIO actuales'!J20>0,'PROPIETARIO actuales'!J20,\"INCOMPLETO RECHAZAR\")","v":"INCOMPLETO RECHAZAR"},214]
[{"$f":"+'PROPIETARIO actuales'!G26","v":"c PROP PJ"},{"$f":"+'PROPIETARIO actuales'!H26","v":0},{"$f":"+'PROPIETARIO actuales'!H26","v":0},{"$f":"+'PROPIETARIO actuales'!I26","v":"NOTA/OBSERVACIÓN -en mayúscula-:"},{"$f":"IF('PROPIETARIO actuales'!J26>0,'PROPIETARIO actuales'!J26,\"INCOMPLETO RECHAZAR\")","v":"INCOMPLETO RECHAZAR"},215]
[{"$f":"+'PROPIETARIO actuales'!G25","v":"c PROP PJ"},{"$f":"+'PROPIETARIO actuales'!H25","v":0},{"$f":"+'PROPIETARIO actuales'!H25","v":0},{"$f":"+'PROPIETARIO actuales'!I25","v":"OBJETO PRINCIPAL (EN FORMA RESUMIDA):"},{"$f":"IF('PROPIETARIO actuales'!J25>0,'PROPIETARIO actuales'!J25,\"INCOMPLETO RECHAZAR\")","v":"INCOMPLETO RECHAZAR"},216]
[{"$f":"+'PROPIETARIO actuales'!G18","v":"c PROP PJ"},{"$f":"+'PROPIETARIO actuales'!H18","v":0},{"$f":"+'PROPIETARIO actuales'!H18","v":0},{"$f":"+'PROPIETARIO actuales'!I18","v":"ORGANISMO /s DONDE SE INSCRIBIÓ CONSTITUCIÓN (INDICAR LOCALIDAD/PCIA DEL ORG) -si no se inscribió poner: NO INSCRIPTO/A:"},{"$f":"IF('PROPIETARIO actuales'!J18>0,'PROPIETARIO actuales'!J18,\"INCOMPLETO RECHAZAR\")","v":"INCOMPLETO RECHAZAR"},217]
[{"$f":"+'PROPIETARIO actuales'!G23","v":"c PROP PJ"},{"$f":"+'PROPIETARIO actuales'!H23","v":0},{"$f":"+'PROPIETARIO actuales'!H23","v":0},{"$f":"+'PROPIETARIO actuales'!I23","v":"SEDE SOCIAL:"},{"$f":"IF('PROPIETARIO actuales'!J23>0,'PROPIETARIO actuales'!J23,\"INCOMPLETO RECHAZAR\")","v":"INCOMPLETO RECHAZAR"},218]
[{"$f":"+'PROPIETARIO actuales'!G17","v":"c PROP PJ"},{"$f":"+'PROPIETARIO actuales'!H17","v":0},{"$f":"+'PROPIETARIO actuales'!H17","v":0},{"$f":"+'PROPIETARIO actuales'!I17","v":"TIPO DE PERSONA JCA -FONDO DE COMERCIO, asociación, mutual, etc-:"},{"$f":"IF('PROPIETARIO actuales'!J17>0,'PROPIETARIO actuales'!J17,\"INCOMPLETO RECHAZAR\")","v":"INCOMPLETO RECHAZAR"},219]
[{"$f":"+'PROPIETARIO actuales'!G32","v":"c PROP PJ"},{"$f":"+'PROPIETARIO actuales'!H32","v":0},{"$f":"+'PROPIETARIO actuales'!H32","v":0},{"$f":"+'PROPIETARIO actuales'!I32","v":"APELLIDO/S, NOMBRE/S,  DNI Y CARGO DE CADA MIEMBRO DE SU ADMINISTRACIÓN:"},{"$f":"IF('PROPIETARIO actuales'!J32>0,'PROPIETARIO actuales'!J32,\"INCOMPLETO RECHAZAR\")","v":"INCOMPLETO RECHAZAR"},220]
[{"$f":"+'PROPIETARIO actuales'!G35","v":"c PROP PJ"},{"$f":"+'PROPIETARIO actuales'!H35","v":0},{"$f":"+'PROPIETARIO actuales'!H35","v":0},{"$f":"+'PROPIETARIO actuales'!I35","v":"CEL/TEL :"},{"$f":"IF('PROPIETARIO actuales'!J35>0,'PROPIETARIO actuales'!J35,\"INCOMPLETO RECHAZAR\")","v":"INCOMPLETO RECHAZAR"},221]
[{"$f":"+'PROPIETARIO actuales'!G27","v":"c PROP PJ"},{"$f":"+'PROPIETARIO actuales'!H27","v":0},{"$f":"+'PROPIETARIO actuales'!H27","v":0},{"$f":"+'PROPIETARIO actuales'!I27","v":"CUIT –sin puntos ni barras-:"},{"$f":"IF('PROPIETARIO actuales'!J27>0,'PROPIETARIO actuales'!J27,\"INCOMPLETO RECHAZAR\")","v":"INCOMPLETO RECHAZAR"},222]
[{"$f":"+'PROPIETARIO actuales'!G30","v":"c PROP PJ"},{"$f":"+'PROPIETARIO actuales'!H30","v":0},{"$f":"+'PROPIETARIO actuales'!H30","v":0},{"$f":"+'PROPIETARIO actuales'!I30","v":"DATOS DE RESOLUCIÓN Y FECHA DE INSCRIPCIÓN:"},{"$f":"IF('PROPIETARIO actuales'!J30>0,'PROPIETARIO actuales'!J30,\"INCOMPLETO RECHAZAR\")","v":"INCOMPLETO RECHAZAR"},223]
[{"$f":"+'PROPIETARIO actuales'!G33","v":"c PROP PJ"},{"$f":"+'PROPIETARIO actuales'!H33","v":0},{"$f":"+'PROPIETARIO actuales'!H33","v":0},{"$f":"+'PROPIETARIO actuales'!I33","v":"DOMICILIO SOCIAL:"},{"$f":"IF('PROPIETARIO actuales'!J33>0,'PROPIETARIO actuales'!J33,\"INCOMPLETO RECHAZAR\")","v":"INCOMPLETO RECHAZAR"},224]
[{"$f":"+'PROPIETARIO actuales'!G31","v":"c PROP PJ"},{"$f":"+'PROPIETARIO actuales'!H31","v":0},{"$f":"+'PROPIETARIO actuales'!H31","v":0},{"$f":"+'PROPIETARIO actuales'!I31","v":"FECHA DE INSCRIPCION:"},{"$f":"IF('PROPIETARIO actuales'!J31>0,'PROPIETARIO actuales'!J31,\"INCOMPLETO RECHAZAR\")","v":"INCOMPLETO RECHAZAR"},225]
[{"$f":"+'PROPIETARIO actuales'!G41","v":"c PROP PJ"},{"$f":"+'PROPIETARIO actuales'!H41","v":0},{"$f":"+'PROPIETARIO actuales'!H41","v":0},{"$f":"+'PROPIETARIO actuales'!I41","v":"DATOS DE RESOLUCIÓN Y FECHA DE INSCRIPCIÓN:"},{"$f":"IF('PROPIETARIO actuales'!J41>0,'PROPIETARIO actuales'!J41,\"INCOMPLETO RECHAZAR\")","v":"INCOMPLETO RECHAZAR"},226]
[{"$f":"+'PROPIETARIO actuales'!G36","v":"c PROP PJ"},{"$f":"+'PROPIETARIO actuales'!H36","v":0},{"$f":"+'PROPIETARIO actuales'!H36","v":0},{"$f":"+'PROPIETARIO actuales'!I36","v":"OBJETO PRINCIPAL (EN FORMA RESUMIDA):"},{"$f":"IF('PROPIETARIO actuales'!J36>0,'PROPIETARIO actuales'!J36,\"INCOMPLETO RECHAZAR\")","v":"INCOMPLETO RECHAZAR"},227]
[{"$f":"+'PROPIETARIO actuales'!G29","v":"c PROP PJ"},{"$f":"+'PROPIETARIO actuales'!H29","v":0},{"$f":"+'PROPIETARIO actuales'!H29","v":0},{"$f":"+'PROPIETARIO actuales'!I29","v":"ORGANISMO /s DONDE SE INSCRIBIÓ CONSTITUCIÓN (INDICAR LOCALIDAD/PCIA DEL ORG) -si no se inscribió poner: NO INSCRIPTO/A:"},{"$f":"IF('PROPIETARIO actuales'!J29>0,'PROPIETARIO actuales'!J29,\"INCOMPLETO RECHAZAR\")","v":"INCOMPLETO RECHAZAR"},228]
[{"$f":"+'PROPIETARIO actuales'!G34","v":"c PROP PJ"},{"$f":"+'PROPIETARIO actuales'!H34","v":0},{"$f":"+'PROPIETARIO actuales'!H34","v":0},{"$f":"+'PROPIETARIO actuales'!I34","v":"SEDE SOCIAL:"},{"$f":"IF('PROPIETARIO actuales'!J34>0,'PROPIETARIO actuales'!J34,\"INCOMPLETO RECHAZAR\")","v":"INCOMPLETO RECHAZAR"},229]
[{"$f":"+'PROPIETARIO actuales'!G28","v":"c PROP PJ"},{"$f":"+'PROPIETARIO actuales'!H28","v":0},{"$f":"+'PROPIETARIO actuales'!H28","v":0},{"$f":"+'PROPIETARIO actuales'!I28","v":"TIPO DE PERSONA JCA -FONDO DE COMERCIO, asociación, mutual, etc-:"},{"$f":"IF('PROPIETARIO actuales'!J28>0,'PROPIETARIO actuales'!J28,\"INCOMPLETO RECHAZAR\")","v":"INCOMPLETO RECHAZAR"},230]
[{"$f":"+'PROPIETARIO actuales'!G47","v":"c PROP PJ"},{"$f":"+'PROPIETARIO actuales'!H47","v":0},{"$f":"+'PROPIETARIO actuales'!H47","v":0},{"$f":"+'PROPIETARIO actuales'!I47","v":"OBJETO PRINCIPAL (EN FORMA RESUMIDA):"},{"$f":"IF('PROPIETARIO actuales'!J47>0,'PROPIETARIO actuales'!J47,\"INCOMPLETO RECHAZAR\")","v":"INCOMPLETO RECHAZAR"},231]
[{"$f":"+'PROPIETARIO actuales'!G50","v":"c PROP PJ"},{"$f":"+'PROPIETARIO actuales'!H50","v":0},{"$f":"+'PROPIETARIO actuales'!H50","v":0},{"$f":"+'PROPIETARIO actuales'!I50","v":"TIPO DE PERSONA JCA -FONDO DE COMERCIO, asociación, mutual, etc-:"},{"$f":"IF('PROPIETARIO actuales'!J50>0,'PROPIETARIO actuales'!J50,\"INCOMPLETO RECHAZAR\")","v":"INCOMPLETO RECHAZAR"},232]
[{"$f":"+'PROPIETARIO actuales'!G42","v":"c PROP PJ"},{"$f":"+'PROPIETARIO actuales'!H42","v":0},{"$f":"+'PROPIETARIO actuales'!H42","v":0},{"$f":"+'PROPIETARIO actuales'!I42","v":"FECHA DE INSCRIPCION:"},{"$f":"IF('PROPIETARIO actuales'!J42>0,'PROPIETARIO actuales'!J42,\"INCOMPLETO RECHAZAR\")","v":"INCOMPLETO RECHAZAR"},233]
[{"$f":"+'PROPIETARIO actuales'!G45","v":"c PROP PJ"},{"$f":"+'PROPIETARIO actuales'!H45","v":0},{"$f":"+'PROPIETARIO actuales'!H45","v":0},{"$f":"+'PROPIETARIO actuales'!I45","v":"SEDE SOCIAL:"},{"$f":"IF('PROPIETARIO actuales'!J45>0,'PROPIETARIO actuales'!J45,\"INCOMPLETO RECHAZAR\")","v":"INCOMPLETO RECHAZAR"},234]
[{"$f":"+'PROPIETARIO actuales'!G48","v":"c PROP PJ"},{"$f":"+'PROPIETARIO actuales'!H48","v":0},{"$f":"+'PROPIETARIO actuales'!H48","v":0},{"$f":"+'PROPIETARIO actuales'!I48","v":"NOTA/OBSERVACIÓN -en mayúscula-:"},{"$f":"IF('PROPIETARIO actuales'!J48>0,'PROPIETARIO actuales'!J48,\"INCOMPLETO RECHAZAR\")","v":"INCOMPLETO RECHAZAR"},235]
[{"$f":"+'PROPIETARIO actuales'!G46","v":"c PROP PJ"},{"$f":"+'PROPIETARIO actuales'!H46","v":0},{"$f":"+'PROPIETARIO actuales'!H46","v":0},{"$f":"+'PROPIETARIO actuales'!I46","v":"CEL/TEL :"},{"$f":"IF('PROPIETARIO actuales'!J46>0,'PROPIETARIO actuales'!J46,\"INCOMPLETO RECHAZAR\")","v":"INCOMPLETO RECHAZAR"},236]
[{"$f":"+'PROPIETARIO actuales'!G58","v":"c PROP PJ"},{"$f":"+'PROPIETARIO actuales'!H58","v":0},{"$f":"+'PROPIETARIO actuales'!H58","v":0},{"$f":"+'PROPIETARIO actuales'!I58","v":"OBJETO PRINCIPAL (EN FORMA RESUMIDA):"},{"$f":"IF('PROPIETARIO actuales'!J58>0,'PROPIETARIO actuales'!J58,\"INCOMPLETO RECHAZAR\")","v":"INCOMPLETO RECHAZAR"},237]
[{"$f":"+'PROPIETARIO actuales'!G51","v":"c PROP PJ"},{"$f":"+'PROPIETARIO actuales'!H51","v":0},{"$f":"+'PROPIETARIO actuales'!H51","v":0},{"$f":"+'PROPIETARIO actuales'!I51","v":"ORGANISMO /s DONDE SE INSCRIBIÓ CONSTITUCIÓN (INDICAR LOCALIDAD/PCIA DEL ORG) -si no se inscribió poner: NO INSCRIPTO/A:"},{"$f":"IF('PROPIETARIO actuales'!J51>0,'PROPIETARIO actuales'!J51,\"INCOMPLETO RECHAZAR\")","v":"INCOMPLETO RECHAZAR"},238]
[{"$f":"+'PROPIETARIO actuales'!G44","v":"c PROP PJ"},{"$f":"+'PROPIETARIO actuales'!H44","v":0},{"$f":"+'PROPIETARIO actuales'!H44","v":0},{"$f":"+'PROPIETARIO actuales'!I44","v":"DOMICILIO SOCIAL:"},{"$f":"IF('PROPIETARIO actuales'!J44>0,'PROPIETARIO actuales'!J44,\"INCOMPLETO RECHAZAR\")","v":"INCOMPLETO RECHAZAR"},239]
[{"$f":"+'PROPIETARIO actuales'!G49","v":"c PROP PJ"},{"$f":"+'PROPIETARIO actuales'!H49","v":0},{"$f":"+'PROPIETARIO actuales'!H49","v":0},{"$f":"+'PROPIETARIO actuales'!I49","v":"CUIT –sin puntos ni barras-:"},{"$f":"IF('PROPIETARIO actuales'!J49>0,'PROPIETARIO actuales'!J49,\"INCOMPLETO RECHAZAR\")","v":"INCOMPLETO RECHAZAR"},240]
[{"$f":"+'PROPIETARIO actuales'!G43","v":"c PROP PJ"},{"$f":"+'PROPIETARIO actuales'!H43","v":0},{"$f":"+'PROPIETARIO actuales'!H43","v":0},{"$f":"+'PROPIETARIO actuales'!I43","v":"APELLIDO/S, NOMBRE/S,  DNI Y CARGO DE CADA MIEMBRO DE SU ADMINISTRACIÓN:"},{"$f":"IF('PROPIETARIO actuales'!J43>0,'PROPIETARIO actuales'!J43,\"INCOMPLETO RECHAZAR\")","v":"INCOMPLETO RECHAZAR"},241]
[{"$f":"+'PROPIETARIO actuales'!G64","v":"c PROP PJ"},{"$f":"+'PROPIETARIO actuales'!H64","v":0},{"$f":"+'PROPIETARIO actuales'!H64","v":0},{"$f":"+'PROPIETARIO actuales'!I64","v":"FECHA DE INSCRIPCION:"},{"$f":"IF('PROPIETARIO actuales'!J64>0,'PROPIETARIO actuales'!J64,\"INCOMPLETO RECHAZAR\")","v":"INCOMPLETO RECHAZAR"},242]
[{"$f":"+'PROPIETARIO actuales'!G67","v":"c PROP PJ"},{"$f":"+'PROPIETARIO actuales'!H67","v":0},{"$f":"+'PROPIETARIO actuales'!H67","v":0},{"$f":"+'PROPIETARIO actuales'!I67","v":"SEDE SOCIAL:"},{"$f":"IF('PROPIETARIO actuales'!J67>0,'PROPIETARIO actuales'!J67,\"INCOMPLETO RECHAZAR\")","v":"INCOMPLETO RECHAZAR"},243]
[{"$f":"+'PROPIETARIO actuales'!G59","v":"c PROP PJ"},{"$f":"+'PROPIETARIO actuales'!H59","v":0},{"$f":"+'PROPIETARIO actuales'!H59","v":0},{"$f":"+'PROPIETARIO actuales'!I59","v":"NOTA/OBSERVACIÓN -en mayúscula-:"},{"$f":"IF('PROPIETARIO actuales'!J59>0,'PROPIETARIO actuales'!J59,\"INCOMPLETO RECHAZAR\")","v":"INCOMPLETO RECHAZAR"},244]
[{"$f":"+'PROPIETARIO actuales'!G62","v":"c PROP PJ"},{"$f":"+'PROPIETARIO actuales'!H62","v":0},{"$f":"+'PROPIETARIO actuales'!H62","v":0},{"$f":"+'PROPIETARIO actuales'!I62","v":"ORGANISMO /s DONDE SE INSCRIBIÓ CONSTITUCIÓN (INDICAR LOCALIDAD/PCIA DEL ORG) -si no se inscribió poner: NO INSCRIPTO/A:"},{"$f":"IF('PROPIETARIO actuales'!J62>0,'PROPIETARIO actuales'!J62,\"INCOMPLETO RECHAZAR\")","v":"INCOMPLETO RECHAZAR"},245]
[{"$f":"+'PROPIETARIO actuales'!G65","v":"c PROP PJ"},{"$f":"+'PROPIETARIO actuales'!H65","v":0},{"$f":"+'PROPIETARIO actuales'!H65","v":0},{"$f":"+'PROPIETARIO actuales'!I65","v":"APELLIDO/S, NOMBRE/S,  DNI Y CARGO DE CADA MIEMBRO DE SU ADMINISTRACIÓN:"},{"$f":"IF('PROPIETARIO actuales'!J65>0,'PROPIETARIO actuales'!J65,\"INCOMPLETO RECHAZAR\")","v":"INCOMPLETO RECHAZAR"},246]
[{"$f":"+'PROPIETARIO actuales'!G63","v":"c PROP PJ"},{"$f":"+'PROPIETARIO actuales'!H63","v":0},{"$f":"+'PROPIETARIO actuales'!H63","v":0},{"$f":"+'PROPIETARIO actuales'!I63","v":"DATOS DE RESOLUCIÓN Y FECHA DE INSCRIPCIÓN:"},{"$f":"IF('PROPIETARIO actuales'!J63>0,'PROPIETARIO actuales'!J63,\"INCOMPLETO RECHAZAR\")","v":"INCOMPLETO RECHAZAR"},247]
[{"$f":"+'PROPIETARIO actuales'!G75","v":"c PROP PJ"},{"$f":"+'PROPIETARIO actuales'!H75","v":0},{"$f":"+'PROPIETARIO actuales'!H75","v":0},{"$f":"+'PROPIETARIO actuales'!I75","v":"FECHA DE INSCRIPCION:"},{"$f":"IF('PROPIETARIO actuales'!J75>0,'PROPIETARIO actuales'!J75,\"INCOMPLETO RECHAZAR\")","v":"INCOMPLETO RECHAZAR"},248]
[{"$f":"+'PROPIETARIO actuales'!G68","v":"c PROP PJ"},{"$f":"+'PROPIETARIO actuales'!H68","v":0},{"$f":"+'PROPIETARIO actuales'!H68","v":0},{"$f":"+'PROPIETARIO actuales'!I68","v":"CEL/TEL :"},{"$f":"IF('PROPIETARIO actuales'!J68>0,'PROPIETARIO actuales'!J68,\"INCOMPLETO RECHAZAR\")","v":"INCOMPLETO RECHAZAR"},249]
[{"$f":"+'PROPIETARIO actuales'!G61","v":"c PROP PJ"},{"$f":"+'PROPIETARIO actuales'!H61","v":0},{"$f":"+'PROPIETARIO actuales'!H61","v":0},{"$f":"+'PROPIETARIO actuales'!I61","v":"TIPO DE PERSONA JCA -FONDO DE COMERCIO, asociación, mutual, etc-:"},{"$f":"IF('PROPIETARIO actuales'!J61>0,'PROPIETARIO actuales'!J61,\"INCOMPLETO RECHAZAR\")","v":"INCOMPLETO RECHAZAR"},250]
[{"$f":"+'PROPIETARIO actuales'!G66","v":"c PROP PJ"},{"$f":"+'PROPIETARIO actuales'!H66","v":0},{"$f":"+'PROPIETARIO actuales'!H66","v":0},{"$f":"+'PROPIETARIO actuales'!I66","v":"DOMICILIO SOCIAL:"},{"$f":"IF('PROPIETARIO actuales'!J66>0,'PROPIETARIO actuales'!J66,\"INCOMPLETO RECHAZAR\")","v":"INCOMPLETO RECHAZAR"},251]
[{"$f":"+'PROPIETARIO actuales'!G60","v":"c PROP PJ"},{"$f":"+'PROPIETARIO actuales'!H60","v":0},{"$f":"+'PROPIETARIO actuales'!H60","v":0},{"$f":"+'PROPIETARIO actuales'!I60","v":"CUIT –sin puntos ni barras-:"},{"$f":"IF('PROPIETARIO actuales'!J60>0,'PROPIETARIO actuales'!J60,\"INCOMPLETO RECHAZAR\")","v":"INCOMPLETO RECHAZAR"},252]
[{"$f":"+'PROPIETARIO actuales'!G81","v":"c PROP PJ"},{"$f":"+'PROPIETARIO actuales'!H81","v":0},{"$f":"+'PROPIETARIO actuales'!H81","v":0},{"$f":"+'PROPIETARIO actuales'!I81","v":"NOTA/OBSERVACIÓN -en mayúscula-:"},{"$f":"IF('PROPIETARIO actuales'!J81>0,'PROPIETARIO actuales'!J81,\"INCOMPLETO RECHAZAR\")","v":"INCOMPLETO RECHAZAR"},253]
[{"$f":"+'PROPIETARIO actuales'!G84","v":"c PROP PJ"},{"$f":"+'PROPIETARIO actuales'!H84","v":0},{"$f":"+'PROPIETARIO actuales'!H84","v":0},{"$f":"+'PROPIETARIO actuales'!I84","v":"ORGANISMO /s DONDE SE INSCRIBIÓ CONSTITUCIÓN (INDICAR LOCALIDAD/PCIA DEL ORG) -si no se inscribió poner: NO INSCRIPTO/A:"},{"$f":"IF('PROPIETARIO actuales'!J84>0,'PROPIETARIO actuales'!J84,\"INCOMPLETO RECHAZAR\")","v":"INCOMPLETO RECHAZAR"},254]
[{"$f":"+'PROPIETARIO actuales'!G76","v":"c PROP PJ"},{"$f":"+'PROPIETARIO actuales'!H76","v":0},{"$f":"+'PROPIETARIO actuales'!H76","v":0},{"$f":"+'PROPIETARIO actuales'!I76","v":"APELLIDO/S, NOMBRE/S,  DNI Y CARGO DE CADA MIEMBRO DE SU ADMINISTRACIÓN:"},{"$f":"IF('PROPIETARIO actuales'!J76>0,'PROPIETARIO actuales'!J76,\"INCOMPLETO RECHAZAR\")","v":"INCOMPLETO RECHAZAR"},255]
[{"$f":"+'PROPIETARIO actuales'!G79","v":"c PROP PJ"},{"$f":"+'PROPIETARIO actuales'!H79","v":0},{"$f":"+'PROPIETARIO actuales'!H79","v":0},{"$f":"+'PROPIETARIO actuales'!I79","v":"CEL/TEL :"},{"$f":"IF('PROPIETARIO actuales'!J79>0,'PROPIETARIO actuales'!J79,\"INCOMPLETO RECHAZAR\")","v":"INCOMPLETO RECHAZAR"},256]
[{"$f":"+'PROPIETARIO actuales'!G82","v":"c PROP PJ"},{"$f":"+'PROPIETARIO actuales'!H82","v":0},{"$f":"+'PROPIETARIO actuales'!H82","v":0},{"$f":"+'PROPIETARIO actuales'!I82","v":"CUIT –sin puntos ni barras-:"},{"$f":"IF('PROPIETARIO actuales'!J82>0,'PROPIETARIO actuales'!J82,\"INCOMPLETO RECHAZAR\")","v":"INCOMPLETO RECHAZAR"},257]
[{"$f":"+'PROPIETARIO actuales'!G80","v":"c PROP PJ"},{"$f":"+'PROPIETARIO actuales'!H80","v":0},{"$f":"+'PROPIETARIO actuales'!H80","v":0},{"$f":"+'PROPIETARIO actuales'!I80","v":"OBJETO PRINCIPAL (EN FORMA RESUMIDA):"},{"$f":"IF('PROPIETARIO actuales'!J80>0,'PROPIETARIO actuales'!J80,\"INCOMPLETO RECHAZAR\")","v":"INCOMPLETO RECHAZAR"},258]
[{"$f":"+'PROPIETARIO actuales'!G92","v":"c PROP PJ"},{"$f":"+'PROPIETARIO actuales'!H92","v":0},{"$f":"+'PROPIETARIO actuales'!H92","v":0},{"$f":"+'PROPIETARIO actuales'!I92","v":"NOTA/OBSERVACIÓN -en mayúscula-:"},{"$f":"IF('PROPIETARIO actuales'!J92>0,'PROPIETARIO actuales'!J92,\"INCOMPLETO RECHAZAR\")","v":"INCOMPLETO RECHAZAR"},259]
[{"$f":"+'PROPIETARIO actuales'!G85","v":"c PROP PJ"},{"$f":"+'PROPIETARIO actuales'!H85","v":0},{"$f":"+'PROPIETARIO actuales'!H85","v":0},{"$f":"+'PROPIETARIO actuales'!I85","v":"DATOS DE RESOLUCIÓN Y FECHA DE INSCRIPCIÓN:"},{"$f":"IF('PROPIETARIO actuales'!J85>0,'PROPIETARIO actuales'!J85,\"INCOMPLETO RECHAZAR\")","v":"INCOMPLETO RECHAZAR"},260]
[{"$f":"+'PROPIETARIO actuales'!G78","v":"c PROP PJ"},{"$f":"+'PROPIETARIO actuales'!H78","v":0},{"$f":"+'PROPIETARIO actuales'!H78","v":0},{"$f":"+'PROPIETARIO actuales'!I78","v":"SEDE SOCIAL:"},{"$f":"IF('PROPIETARIO actuales'!J78>0,'PROPIETARIO actuales'!J78,\"INCOMPLETO RECHAZAR\")","v":"INCOMPLETO RECHAZAR"},261]
[{"$f":"+'PROPIETARIO actuales'!G83","v":"c PROP PJ"},{"$f":"+'PROPIETARIO actuales'!H83","v":0},{"$f":"+'PROPIETARIO actuales'!H83","v":0},{"$f":"+'PROPIETARIO actuales'!I83","v":"TIPO DE PERSONA JCA -FONDO DE COMERCIO, asociación, mutual, etc-:"},{"$f":"IF('PROPIETARIO actuales'!J83>0,'PROPIETARIO actuales'!J83,\"INCOMPLETO RECHAZAR\")","v":"INCOMPLETO RECHAZAR"},262]
[{"$f":"+'PROPIETARIO actuales'!G77","v":"c PROP PJ"},{"$f":"+'PROPIETARIO actuales'!H77","v":0},{"$f":"+'PROPIETARIO actuales'!H77","v":0},{"$f":"+'PROPIETARIO actuales'!I77","v":"DOMICILIO SOCIAL:"},{"$f":"IF('PROPIETARIO actuales'!J77>0,'PROPIETARIO actuales'!J77,\"INCOMPLETO RECHAZAR\")","v":"INCOMPLETO RECHAZAR"},263]
[{"$f":"+'PROPIETARIO actuales'!G98","v":"c PROP PJ"},{"$f":"+'PROPIETARIO actuales'!H98","v":0},{"$f":"+'PROPIETARIO actuales'!H98","v":0},{"$f":"+'PROPIETARIO actuales'!I98","v":"APELLIDO/S, NOMBRE/S,  DNI Y CARGO DE CADA MIEMBRO DE SU ADMINISTRACIÓN:"},{"$f":"IF('PROPIETARIO actuales'!J98>0,'PROPIETARIO actuales'!J98,\"INCOMPLETO RECHAZAR\")","v":"INCOMPLETO RECHAZAR"},264]
[{"$f":"+'PROPIETARIO actuales'!G101","v":"c PROP PJ"},{"$f":"+'PROPIETARIO actuales'!H101","v":0},{"$f":"+'PROPIETARIO actuales'!H101","v":0},{"$f":"+'PROPIETARIO actuales'!I101","v":"CEL/TEL :"},{"$f":"IF('PROPIETARIO actuales'!J101>0,'PROPIETARIO actuales'!J101,\"INCOMPLETO RECHAZAR\")","v":"INCOMPLETO RECHAZAR"},265]
[{"$f":"+'PROPIETARIO actuales'!G93","v":"c PROP PJ"},{"$f":"+'PROPIETARIO actuales'!H93","v":0},{"$f":"+'PROPIETARIO actuales'!H93","v":0},{"$f":"+'PROPIETARIO actuales'!I93","v":"CUIT –sin puntos ni barras-:"},{"$f":"IF('PROPIETARIO actuales'!J93>0,'PROPIETARIO actuales'!J93,\"INCOMPLETO RECHAZAR\")","v":"INCOMPLETO RECHAZAR"},266]
[{"$f":"+'PROPIETARIO actuales'!G96","v":"c PROP PJ"},{"$f":"+'PROPIETARIO actuales'!H96","v":0},{"$f":"+'PROPIETARIO actuales'!H96","v":0},{"$f":"+'PROPIETARIO actuales'!I96","v":"DATOS DE RESOLUCIÓN Y FECHA DE INSCRIPCIÓN:"},{"$f":"IF('PROPIETARIO actuales'!J96>0,'PROPIETARIO actuales'!J96,\"INCOMPLETO RECHAZAR\")","v":"INCOMPLETO RECHAZAR"},267]
[{"$f":"+'PROPIETARIO actuales'!G99","v":"c PROP PJ"},{"$f":"+'PROPIETARIO actuales'!H99","v":0},{"$f":"+'PROPIETARIO actuales'!H99","v":0},{"$f":"+'PROPIETARIO actuales'!I99","v":"DOMICILIO SOCIAL:"},{"$f":"IF('PROPIETARIO actuales'!J99>0,'PROPIETARIO actuales'!J99,\"INCOMPLETO RECHAZAR\")","v":"INCOMPLETO RECHAZAR"},268]
[{"$f":"+'PROPIETARIO actuales'!G97","v":"c PROP PJ"},{"$f":"+'PROPIETARIO actuales'!H97","v":0},{"$f":"+'PROPIETARIO actuales'!H97","v":0},{"$f":"+'PROPIETARIO actuales'!I97","v":"FECHA DE INSCRIPCION:"},{"$f":"IF('PROPIETARIO actuales'!J97>0,'PROPIETARIO actuales'!J97,\"INCOMPLETO RECHAZAR\")","v":"INCOMPLETO RECHAZAR"},269]
[{"$f":"+'PROPIETARIO actuales'!G109","v":"c PROP PJ"},{"$f":"+'PROPIETARIO actuales'!H109","v":0},{"$f":"+'PROPIETARIO actuales'!H109","v":0},{"$f":"+'PROPIETARIO actuales'!I109","v":"APELLIDO/S, NOMBRE/S,  DNI Y CARGO DE CADA MIEMBRO DE SU ADMINISTRACIÓN:"},{"$f":"IF('PROPIETARIO actuales'!J109>0,'PROPIETARIO actuales'!J109,\"INCOMPLETO RECHAZAR\")","v":"INCOMPLETO RECHAZAR"},270]
[{"$f":"+'PROPIETARIO actuales'!G102","v":"c PROP PJ"},{"$f":"+'PROPIETARIO actuales'!H102","v":0},{"$f":"+'PROPIETARIO actuales'!H102","v":0},{"$f":"+'PROPIETARIO actuales'!I102","v":"OBJETO PRINCIPAL (EN FORMA RESUMIDA):"},{"$f":"IF('PROPIETARIO actuales'!J102>0,'PROPIETARIO actuales'!J102,\"INCOMPLETO RECHAZAR\")","v":"INCOMPLETO RECHAZAR"},271]
[{"$f":"+'PROPIETARIO actuales'!G95","v":"c PROP PJ"},{"$f":"+'PROPIETARIO actuales'!H95","v":0},{"$f":"+'PROPIETARIO actuales'!H95","v":0},{"$f":"+'PROPIETARIO actuales'!I95","v":"ORGANISMO /s DONDE SE INSCRIBIÓ CONSTITUCIÓN (INDICAR LOCALIDAD/PCIA DEL ORG) -si no se inscribió poner: NO INSCRIPTO/A:"},{"$f":"IF('PROPIETARIO actuales'!J95>0,'PROPIETARIO actuales'!J95,\"INCOMPLETO RECHAZAR\")","v":"INCOMPLETO RECHAZAR"},272]
[{"$f":"+'PROPIETARIO actuales'!G100","v":"c PROP PJ"},{"$f":"+'PROPIETARIO actuales'!H100","v":0},{"$f":"+'PROPIETARIO actuales'!H100","v":0},{"$f":"+'PROPIETARIO actuales'!I100","v":"SEDE SOCIAL:"},{"$f":"IF('PROPIETARIO actuales'!J100>0,'PROPIETARIO actuales'!J100,\"INCOMPLETO RECHAZAR\")","v":"INCOMPLETO RECHAZAR"},273]
[{"$f":"+'PROPIETARIO actuales'!G94","v":"c PROP PJ"},{"$f":"+'PROPIETARIO actuales'!H94","v":0},{"$f":"+'PROPIETARIO actuales'!H94","v":0},{"$f":"+'PROPIETARIO actuales'!I94","v":"TIPO DE PERSONA JCA -FONDO DE COMERCIO, asociación, mutual, etc-:"},{"$f":"IF('PROPIETARIO actuales'!J94>0,'PROPIETARIO actuales'!J94,\"INCOMPLETO RECHAZAR\")","v":"INCOMPLETO RECHAZAR"},274]
[{"$f":"+'PROPIETARIO actuales'!G115","v":"c PROP PJ"},{"$f":"+'PROPIETARIO actuales'!H115","v":0},{"$f":"+'PROPIETARIO actuales'!H115","v":0},{"$f":"+'PROPIETARIO actuales'!I115","v":"CUIT –sin puntos ni barras-:"},{"$f":"IF('PROPIETARIO actuales'!J115>0,'PROPIETARIO actuales'!J115,\"INCOMPLETO RECHAZAR\")","v":"INCOMPLETO RECHAZAR"},275]
[{"$f":"+'PROPIETARIO actuales'!G118","v":"c PROP PJ"},{"$f":"+'PROPIETARIO actuales'!H118","v":0},{"$f":"+'PROPIETARIO actuales'!H118","v":0},{"$f":"+'PROPIETARIO actuales'!I118","v":"DATOS DE RESOLUCIÓN Y FECHA DE INSCRIPCIÓN:"},{"$f":"IF('PROPIETARIO actuales'!J118>0,'PROPIETARIO actuales'!J118,\"INCOMPLETO RECHAZAR\")","v":"INCOMPLETO RECHAZAR"},276]
[{"$f":"+'PROPIETARIO actuales'!G110","v":"c PROP PJ"},{"$f":"+'PROPIETARIO actuales'!H110","v":0},{"$f":"+'PROPIETARIO actuales'!H110","v":0},{"$f":"+'PROPIETARIO actuales'!I110","v":"DOMICILIO SOCIAL:"},{"$f":"IF('PROPIETARIO actuales'!J110>0,'PROPIETARIO actuales'!J110,\"INCOMPLETO RECHAZAR\")","v":"INCOMPLETO RECHAZAR"},277]
[{"$f":"+'PROPIETARIO actuales'!G113","v":"c PROP PJ"},{"$f":"+'PROPIETARIO actuales'!H113","v":0},{"$f":"+'PROPIETARIO actuales'!H113","v":0},{"$f":"+'PROPIETARIO actuales'!I113","v":"OBJETO PRINCIPAL (EN FORMA RESUMIDA):"},{"$f":"IF('PROPIETARIO actuales'!J113>0,'PROPIETARIO actuales'!J113,\"INCOMPLETO RECHAZAR\")","v":"INCOMPLETO RECHAZAR"},278]
[{"$f":"+'PROPIETARIO actuales'!G116","v":"c PROP PJ"},{"$f":"+'PROPIETARIO actuales'!H116","v":0},{"$f":"+'PROPIETARIO actuales'!H116","v":0},{"$f":"+'PROPIETARIO actuales'!I116","v":"TIPO DE PERSONA JCA -FONDO DE COMERCIO, asociación, mutual, etc-:"},{"$f":"IF('PROPIETARIO actuales'!J116>0,'PROPIETARIO actuales'!J116,\"INCOMPLETO RECHAZAR\")","v":"INCOMPLETO RECHAZAR"},279]
[{"$f":"+'PROPIETARIO actuales'!G114","v":"c PROP PJ"},{"$f":"+'PROPIETARIO actuales'!H114","v":0},{"$f":"+'PROPIETARIO actuales'!H114","v":0},{"$f":"+'PROPIETARIO actuales'!I114","v":"NOTA/OBSERVACIÓN -en mayúscula-:"},{"$f":"IF('PROPIETARIO actuales'!J114>0,'PROPIETARIO actuales'!J114,\"INCOMPLETO RECHAZAR\")","v":"INCOMPLETO RECHAZAR"},280]
[{"$f":"+'PROPIETARIO actuales'!G119","v":"c PROP PJ"},{"$f":"+'PROPIETARIO actuales'!H119","v":0},{"$f":"+'PROPIETARIO actuales'!H119","v":0},{"$f":"+'PROPIETARIO actuales'!I119","v":"FECHA DE INSCRIPCION:"},{"$f":"IF('PROPIETARIO actuales'!J119>0,'PROPIETARIO actuales'!J119,\"INCOMPLETO RECHAZAR\")","v":"INCOMPLETO RECHAZAR"},282]
[{"$f":"+'PROPIETARIO actuales'!G112","v":"c PROP PJ"},{"$f":"+'PROPIETARIO actuales'!H112","v":0},{"$f":"+'PROPIETARIO actuales'!H112","v":0},{"$f":"+'PROPIETARIO actuales'!I112","v":"CEL/TEL :"},{"$f":"IF('PROPIETARIO actuales'!J112>0,'PROPIETARIO actuales'!J112,\"INCOMPLETO RECHAZAR\")","v":"INCOMPLETO RECHAZAR"},283]
[{"$f":"+'PROPIETARIO actuales'!G117","v":"c PROP PJ"},{"$f":"+'PROPIETARIO actuales'!H117","v":0},{"$f":"+'PROPIETARIO actuales'!H117","v":0},{"$f":"+'PROPIETARIO actuales'!I117","v":"ORGANISMO /s DONDE SE INSCRIBIÓ CONSTITUCIÓN (INDICAR LOCALIDAD/PCIA DEL ORG) -si no se inscribió poner: NO INSCRIPTO/A:"},{"$f":"IF('PROPIETARIO actuales'!J117>0,'PROPIETARIO actuales'!J117,\"INCOMPLETO RECHAZAR\")","v":"INCOMPLETO RECHAZAR"},284]
[{"$f":"+'PROPIETARIO actuales'!G111","v":"c PROP PJ"},{"$f":"+'PROPIETARIO actuales'!H111","v":0},{"$f":"+'PROPIETARIO actuales'!H111","v":0},{"$f":"+'PROPIETARIO actuales'!I111","v":"SEDE SOCIAL:"},{"$f":"IF('PROPIETARIO actuales'!J111>0,'PROPIETARIO actuales'!J111,\"INCOMPLETO RECHAZAR\")","v":"INCOMPLETO RECHAZAR"},285]
[{"$f":"+'PROPIETARIO actuales'!A63","v":"c PROP PH"},{"$f":"+'PROPIETARIO actuales'!B63","v":0},{"$f":"+'PROPIETARIO actuales'!C63","v":0},{"$f":"+'PROPIETARIO actuales'!D63","v":"NOTA/OBSERVACIÓN -en mayúscula-:"},{"$f":"IF('PROPIETARIO actuales'!E63>0,'PROPIETARIO actuales'!E63,\"INCOMPLETO RECHAZAR\")","v":"INCOMPLETO RECHAZAR"},321]
[{"$f":"+'PROPIETARIO actuales'!A83","v":"c PROP PH"},{"$f":"+'PROPIETARIO actuales'!B83","v":0},{"$f":"+'PROPIETARIO actuales'!C83","v":0},{"$f":"+'PROPIETARIO actuales'!D83","v":"LUGAR DE NACIMIENTO:"},{"$f":"IF('PROPIETARIO actuales'!E83>0,'PROPIETARIO actuales'!E83,\"INCOMPLETO RECHAZAR\")","v":"INCOMPLETO RECHAZAR"},322]
[{"$f":"+'PROPIETARIO actuales'!A103","v":"c PROP PH"},{"$f":"+'PROPIETARIO actuales'!B103","v":0},{"$f":"+'PROPIETARIO actuales'!C103","v":0},{"$f":"+'PROPIETARIO actuales'!D103","v":"CEL/TEL :"},{"$f":"IF('PROPIETARIO actuales'!E103>0,'PROPIETARIO actuales'!E103,\"INCOMPLETO RECHAZAR\")","v":"INCOMPLETO RECHAZAR"},323]
[{"$f":"+'PROPIETARIO actuales'!A123","v":"c PROP PH"},{"$f":"+'PROPIETARIO actuales'!B123","v":0},{"$f":"+'PROPIETARIO actuales'!C123","v":0},{"$f":"+'PROPIETARIO actuales'!D123","v":""},{"$f":"IF('PROPIETARIO actuales'!E123>0,'PROPIETARIO actuales'!E123,\"INCOMPLETO RECHAZAR\")","v":"INCOMPLETO RECHAZAR"},324]
[{"$f":"+'PROPIETARIO actuales'!A141","v":"i ORG. REP. LEGAL/ ADM."},{"$f":"+'PROPIETARIO actuales'!B141","v":0},{"$f":"+'PROPIETARIO actuales'!C141","v":0},{"$f":"+'PROPIETARIO actuales'!D141","v":"NOMBRE CARGO REP. LEGAL/ ADMINISTRACIÓN QUE OCUPA:"},{"$f":"IF('PROPIETARIO actuales'!E141>0,'PROPIETARIO actuales'!E141,\"INCOMPLETO RECHAZAR\")","v":"INCOMPLETO RECHAZAR"},325]
[{"$f":"+'PROPIETARIO actuales'!A161","v":"c PROP PH"},{"$f":"+'PROPIETARIO actuales'!B161","v":0},{"$f":"+'PROPIETARIO actuales'!C161","v":0},{"$f":"+'PROPIETARIO actuales'!D161","v":"CUIT/CUIL –sin puntos ni barras-:"},{"$f":"IF('PROPIETARIO actuales'!E161>0,'PROPIETARIO actuales'!E161,\"INCOMPLETO RECHAZAR\")","v":"INCOMPLETO RECHAZAR"},326]
[{"$f":"+'PROPIETARIO actuales'!G52","v":"c PROP PJ"},{"$f":"+'PROPIETARIO actuales'!H52","v":0},{"$f":"+'PROPIETARIO actuales'!H52","v":0},{"$f":"+'PROPIETARIO actuales'!I52","v":"DATOS DE RESOLUCIÓN Y FECHA DE INSCRIPCIÓN:"},{"$f":"IF('PROPIETARIO actuales'!J52>0,'PROPIETARIO actuales'!J52,\"INCOMPLETO RECHAZAR\")","v":"INCOMPLETO RECHAZAR"},335]
[{"$f":"+'PROPIETARIO actuales'!G69","v":"c PROP PJ"},{"$f":"+'PROPIETARIO actuales'!H69","v":0},{"$f":"+'PROPIETARIO actuales'!H69","v":0},{"$f":"+'PROPIETARIO actuales'!I69","v":"OBJETO PRINCIPAL (EN FORMA RESUMIDA):"},{"$f":"IF('PROPIETARIO actuales'!J69>0,'PROPIETARIO actuales'!J69,\"INCOMPLETO RECHAZAR\")","v":"INCOMPLETO RECHAZAR"},336]
[{"$f":"+'PROPIETARIO actuales'!G86","v":"c PROP PJ"},{"$f":"+'PROPIETARIO actuales'!H86","v":0},{"$f":"+'PROPIETARIO actuales'!H86","v":0},{"$f":"+'PROPIETARIO actuales'!I86","v":"FECHA DE INSCRIPCION:"},{"$f":"IF('PROPIETARIO actuales'!J86>0,'PROPIETARIO actuales'!J86,\"INCOMPLETO RECHAZAR\")","v":"INCOMPLETO RECHAZAR"},337]
[{"$f":"+'PROPIETARIO actuales'!G103","v":"c PROP PJ"},{"$f":"+'PROPIETARIO actuales'!H103","v":0},{"$f":"+'PROPIETARIO actuales'!H103","v":0},{"$f":"+'PROPIETARIO actuales'!I103","v":"NOTA/OBSERVACIÓN -en mayúscula-:"},{"$f":"IF('PROPIETARIO actuales'!J103>0,'PROPIETARIO actuales'!J103,\"INCOMPLETO RECHAZAR\")","v":"INCOMPLETO RECHAZAR"},338]
[{"$f":"+'PROPIETARIO actuales'!G120","v":"c PROP PJ"},{"$f":"+'PROPIETARIO actuales'!H120","v":0},{"$f":"+'PROPIETARIO actuales'!H120","v":0},{"$f":"+'PROPIETARIO actuales'!I120","v":"APELLIDO/S, NOMBRE/S,  DNI Y CARGO DE CADA MIEMBRO DE SU ADMINISTRACIÓN:"},{"$f":"IF('PROPIETARIO actuales'!J120>0,'PROPIETARIO actuales'!J120,\"INCOMPLETO RECHAZAR\")","v":"INCOMPLETO RECHAZAR"},339]
[{"$f":"+'PROPIETARIO actuales'!A46","v":"j ORG. FISCALIZ."},{"$f":"+'PROPIETARIO actuales'!B46","v":0},{"$f":"+'PROPIETARIO actuales'!C46","v":0},{"$f":"+'PROPIETARIO actuales'!D46","v":"NOMBRE CARGO FISCALIZACIÓN QUE OCUPA:"},{"$f":"IF('PROPIETARIO actuales'!E46>0,'PROPIETARIO actuales'!E46,\"INCOMPLETO RECHAZAR\")","v":"INCOMPLETO RECHAZAR"},345]
[{"$f":"+'PROPIETARIO actuales'!A66","v":"c PROP PH"},{"$f":"+'PROPIETARIO actuales'!B66","v":0},{"$f":"+'PROPIETARIO actuales'!C66","v":0},{"$f":"+'PROPIETARIO actuales'!D66","v":"FECHA DE NACIMIENTO –dd/mm/aa-:"},{"$f":"IF('PROPIETARIO actuales'!E66>0,'PROPIETARIO actuales'!E66,\"INCOMPLETO RECHAZAR\")","v":"INCOMPLETO RECHAZAR"},346]
[{"$f":"+'PROPIETARIO actuales'!A86","v":"c PROP PH"},{"$f":"+'PROPIETARIO actuales'!B86","v":0},{"$f":"+'PROPIETARIO actuales'!C86","v":0},{"$f":"+'PROPIETARIO actuales'!D86","v":"DOMICILIO REAL:"},{"$f":"IF('PROPIETARIO actuales'!E86>0,'PROPIETARIO actuales'!E86,\"INCOMPLETO RECHAZAR\")","v":"INCOMPLETO RECHAZAR"},347]
[{"$f":"+'PROPIETARIO actuales'!A106","v":"c PROP PH"},{"$f":"+'PROPIETARIO actuales'!B106","v":0},{"$f":"+'PROPIETARIO actuales'!C106","v":0},{"$f":"+'PROPIETARIO actuales'!D106","v":""},{"$f":"IF('PROPIETARIO actuales'!E106>0,'PROPIETARIO actuales'!E106,\"INCOMPLETO RECHAZAR\")","v":"INCOMPLETO RECHAZAR"},348]
[{"$f":"+'PROPIETARIO actuales'!A144","v":"c PROP PH"},{"$f":"+'PROPIETARIO actuales'!B144","v":0},{"$f":"+'PROPIETARIO actuales'!C144","v":0},{"$f":"+'PROPIETARIO actuales'!D144","v":"DOC. IDENTIDAD –sin puntos-:"},{"$f":"IF('PROPIETARIO actuales'!E144>0,'PROPIETARIO actuales'!E144,\"INCOMPLETO RECHAZAR\")","v":"INCOMPLETO RECHAZAR"},350]
[{"$f":"+'PROPIETARIO actuales'!A164","v":"c PROP PH"},{"$f":"+'PROPIETARIO actuales'!B164","v":0},{"$f":"+'PROPIETARIO actuales'!C164","v":0},{"$f":"+'PROPIETARIO actuales'!D164","v":"NACIONALIDAD:"},{"$f":"IF('PROPIETARIO actuales'!E164>0,'PROPIETARIO actuales'!E164,\"INCOMPLETO RECHAZAR\")","v":"INCOMPLETO RECHAZAR"},351]
[{"$f":"+'PROPIETARIO actuales'!G38","v":"c PROP PJ"},{"$f":"+'PROPIETARIO actuales'!H38","v":0},{"$f":"+'PROPIETARIO actuales'!H38","v":0},{"$f":"+'PROPIETARIO actuales'!I38","v":"CUIT –sin puntos ni barras-:"},{"$f":"IF('PROPIETARIO actuales'!J38>0,'PROPIETARIO actuales'!J38,\"INCOMPLETO RECHAZAR\")","v":"INCOMPLETO RECHAZAR"},359]
[{"$f":"+'PROPIETARIO actuales'!G55","v":"c PROP PJ"},{"$f":"+'PROPIETARIO actuales'!H55","v":0},{"$f":"+'PROPIETARIO actuales'!H55","v":0},{"$f":"+'PROPIETARIO actuales'!I55","v":"DOMICILIO SOCIAL:"},{"$f":"IF('PROPIETARIO actuales'!J55>0,'PROPIETARIO actuales'!J55,\"INCOMPLETO RECHAZAR\")","v":"INCOMPLETO RECHAZAR"},360]
[{"$f":"+'PROPIETARIO actuales'!G72","v":"c PROP PJ"},{"$f":"+'PROPIETARIO actuales'!H72","v":0},{"$f":"+'PROPIETARIO actuales'!H72","v":0},{"$f":"+'PROPIETARIO actuales'!I72","v":"TIPO DE PERSONA JCA -FONDO DE COMERCIO, asociación, mutual, etc-:"},{"$f":"IF('PROPIETARIO actuales'!J72>0,'PROPIETARIO actuales'!J72,\"INCOMPLETO RECHAZAR\")","v":"INCOMPLETO RECHAZAR"},361]
[{"$f":"+'PROPIETARIO actuales'!G89","v":"c PROP PJ"},{"$f":"+'PROPIETARIO actuales'!H89","v":0},{"$f":"+'PROPIETARIO actuales'!H89","v":0},{"$f":"+'PROPIETARIO actuales'!I89","v":"SEDE SOCIAL:"},{"$f":"IF('PROPIETARIO actuales'!J89>0,'PROPIETARIO actuales'!J89,\"INCOMPLETO RECHAZAR\")","v":"INCOMPLETO RECHAZAR"},362]
[{"$f":"+'PROPIETARIO actuales'!G106","v":"c PROP PJ"},{"$f":"+'PROPIETARIO actuales'!H106","v":0},{"$f":"+'PROPIETARIO actuales'!H106","v":0},{"$f":"+'PROPIETARIO actuales'!I106","v":"ORGANISMO /s DONDE SE INSCRIBIÓ CONSTITUCIÓN (INDICAR LOCALIDAD/PCIA DEL ORG) -si no se inscribió poner: NO INSCRIPTO/A:"},{"$f":"IF('PROPIETARIO actuales'!J106>0,'PROPIETARIO actuales'!J106,\"INCOMPLETO RECHAZAR\")","v":"INCOMPLETO RECHAZAR"},363]
[{"$f":"+'PROPIETARIO actuales'!G123","v":"c PROP PJ"},{"$f":"+'PROPIETARIO actuales'!H123","v":0},{"$f":"+'PROPIETARIO actuales'!H123","v":0},{"$f":"+'PROPIETARIO actuales'!I123","v":"CEL/TEL :"},{"$f":"IF('PROPIETARIO actuales'!J123>0,'PROPIETARIO actuales'!J123,\"INCOMPLETO RECHAZAR\")","v":"INCOMPLETO RECHAZAR"},364]
[{"$f":"+'PROPIETARIO actuales'!A48","v":"c PROP PH"},{"$f":"+'PROPIETARIO actuales'!B48","v":0},{"$f":"+'PROPIETARIO actuales'!C48","v":0},{"$f":"+'PROPIETARIO actuales'!D48","v":"DOC. IDENTIDAD –sin puntos-:"},{"$f":"IF('PROPIETARIO actuales'!E48>0,'PROPIETARIO actuales'!E48,\"INCOMPLETO RECHAZAR\")","v":"INCOMPLETO RECHAZAR"},370]
[{"$f":"+'PROPIETARIO actuales'!A68","v":"c PROP PH"},{"$f":"+'PROPIETARIO actuales'!B68","v":0},{"$f":"+'PROPIETARIO actuales'!C68","v":0},{"$f":"+'PROPIETARIO actuales'!D68","v":"NACIONALIDAD:"},{"$f":"IF('PROPIETARIO actuales'!E68>0,'PROPIETARIO actuales'!E68,\"INCOMPLETO RECHAZAR\")","v":"INCOMPLETO RECHAZAR"},371]
[{"$f":"+'PROPIETARIO actuales'!A88","v":"c PROP PH"},{"$f":"+'PROPIETARIO actuales'!B88","v":0},{"$f":"+'PROPIETARIO actuales'!C88","v":0},{"$f":"+'PROPIETARIO actuales'!D88","v":"EMAIL:"},{"$f":"IF('PROPIETARIO actuales'!E88>0,'PROPIETARIO actuales'!E88,\"INCOMPLETO RECHAZAR\")","v":"INCOMPLETO RECHAZAR"},372]
[{"$f":"+'PROPIETARIO actuales'!A108","v":"c PROP PH"},{"$f":"+'PROPIETARIO actuales'!B108","v":0},{"$f":"+'PROPIETARIO actuales'!C108","v":0},{"$f":"+'PROPIETARIO actuales'!D108","v":""},{"$f":"IF('PROPIETARIO actuales'!E108>0,'PROPIETARIO actuales'!E108,\"INCOMPLETO RECHAZAR\")","v":"INCOMPLETO RECHAZAR"},373]
[{"$f":"+'PROPIETARIO actuales'!A126","v":"j ORG. FISCALIZ."},{"$f":"+'PROPIETARIO actuales'!B126","v":0},{"$f":"+'PROPIETARIO actuales'!C126","v":0},{"$f":"+'PROPIETARIO actuales'!D126","v":"NOMBRE CARGO FISCALIZACIÓN QUE OCUPA:"},{"$f":"IF('PROPIETARIO actuales'!E126>0,'PROPIETARIO actuales'!E126,\"INCOMPLETO RECHAZAR\")","v":"INCOMPLETO RECHAZAR"},374]
[{"$f":"+'PROPIETARIO actuales'!A146","v":"c PROP PH"},{"$f":"+'PROPIETARIO actuales'!B146","v":0},{"$f":"+'PROPIETARIO actuales'!C146","v":0},{"$f":"+'PROPIETARIO actuales'!D146","v":"FECHA DE NACIMIENTO –dd/mm/aa-:"},{"$f":"IF('PROPIETARIO actuales'!E146>0,'PROPIETARIO actuales'!E146,\"INCOMPLETO RECHAZAR\")","v":"INCOMPLETO RECHAZAR"},375]
[{"$f":"+'PROPIETARIO actuales'!A166","v":"c PROP PH"},{"$f":"+'PROPIETARIO actuales'!B166","v":0},{"$f":"+'PROPIETARIO actuales'!C166","v":0},{"$f":"+'PROPIETARIO actuales'!D166","v":"DOMICILIO REAL:"},{"$f":"IF('PROPIETARIO actuales'!E166>0,'PROPIETARIO actuales'!E166,\"INCOMPLETO RECHAZAR\")","v":"INCOMPLETO RECHAZAR"},376]
[{"$f":"+'PROPIETARIO actuales'!G40","v":"c PROP PJ"},{"$f":"+'PROPIETARIO actuales'!H40","v":0},{"$f":"+'PROPIETARIO actuales'!H40","v":0},{"$f":"+'PROPIETARIO actuales'!I40","v":"ORGANISMO /s DONDE SE INSCRIBIÓ CONSTITUCIÓN (INDICAR LOCALIDAD/PCIA DEL ORG) -si no se inscribió poner: NO INSCRIPTO/A:"},{"$f":"IF('PROPIETARIO actuales'!J40>0,'PROPIETARIO actuales'!J40,\"INCOMPLETO RECHAZAR\")","v":"INCOMPLETO RECHAZAR"},384]
[{"$f":"+'PROPIETARIO actuales'!G57","v":"c PROP PJ"},{"$f":"+'PROPIETARIO actuales'!H57","v":0},{"$f":"+'PROPIETARIO actuales'!H57","v":0},{"$f":"+'PROPIETARIO actuales'!I57","v":"CEL/TEL :"},{"$f":"IF('PROPIETARIO actuales'!J57>0,'PROPIETARIO actuales'!J57,\"INCOMPLETO RECHAZAR\")","v":"INCOMPLETO RECHAZAR"},385]
[{"$f":"+'PROPIETARIO actuales'!G74","v":"c PROP PJ"},{"$f":"+'PROPIETARIO actuales'!H74","v":0},{"$f":"+'PROPIETARIO actuales'!H74","v":0},{"$f":"+'PROPIETARIO actuales'!I74","v":"DATOS DE RESOLUCIÓN Y FECHA DE INSCRIPCIÓN:"},{"$f":"IF('PROPIETARIO actuales'!J74>0,'PROPIETARIO actuales'!J74,\"INCOMPLETO RECHAZAR\")","v":"INCOMPLETO RECHAZAR"},386]
[{"$f":"+'PROPIETARIO actuales'!G91","v":"c PROP PJ"},{"$f":"+'PROPIETARIO actuales'!H91","v":0},{"$f":"+'PROPIETARIO actuales'!H91","v":0},{"$f":"+'PROPIETARIO actuales'!I91","v":"OBJETO PRINCIPAL (EN FORMA RESUMIDA):"},{"$f":"IF('PROPIETARIO actuales'!J91>0,'PROPIETARIO actuales'!J91,\"INCOMPLETO RECHAZAR\")","v":"INCOMPLETO RECHAZAR"},387]
[{"$f":"+'PROPIETARIO actuales'!G108","v":"c PROP PJ"},{"$f":"+'PROPIETARIO actuales'!H108","v":0},{"$f":"+'PROPIETARIO actuales'!H108","v":0},{"$f":"+'PROPIETARIO actuales'!I108","v":"FECHA DE INSCRIPCION:"},{"$f":"IF('PROPIETARIO actuales'!J108>0,'PROPIETARIO actuales'!J108,\"INCOMPLETO RECHAZAR\")","v":"INCOMPLETO RECHAZAR"},388]
[{"$f":"+'PROPIETARIO actuales'!G125","v":"c PROP PJ"},{"$f":"+'PROPIETARIO actuales'!H125","v":0},{"$f":"+'PROPIETARIO actuales'!H125","v":0},{"$f":"+'PROPIETARIO actuales'!I125","v":"NOTA/OBSERVACIÓN -en mayúscula-:"},{"$f":"IF('PROPIETARIO actuales'!J125>0,'PROPIETARIO actuales'!J125,\"INCOMPLETO RECHAZAR\")","v":"INCOMPLETO RECHAZAR"},389]
[{"$f":"+'PROPIETARIO actuales'!G53","v":"c PROP PJ"},{"$f":"+'PROPIETARIO actuales'!H53","v":0},{"$f":"+'PROPIETARIO actuales'!H53","v":0},{"$f":"+'PROPIETARIO actuales'!I53","v":"FECHA DE INSCRIPCION:"},{"$f":"IF('PROPIETARIO actuales'!J53>0,'PROPIETARIO actuales'!J53,\"INCOMPLETO RECHAZAR\")","v":"INCOMPLETO RECHAZAR"},395]
[{"$f":"+'PROPIETARIO actuales'!G70","v":"c PROP PJ"},{"$f":"+'PROPIETARIO actuales'!H70","v":0},{"$f":"+'PROPIETARIO actuales'!H70","v":0},{"$f":"+'PROPIETARIO actuales'!I70","v":"NOTA/OBSERVACIÓN -en mayúscula-:"},{"$f":"IF('PROPIETARIO actuales'!J70>0,'PROPIETARIO actuales'!J70,\"INCOMPLETO RECHAZAR\")","v":"INCOMPLETO RECHAZAR"},396]
[{"$f":"+'PROPIETARIO actuales'!G87","v":"c PROP PJ"},{"$f":"+'PROPIETARIO actuales'!H87","v":0},{"$f":"+'PROPIETARIO actuales'!H87","v":0},{"$f":"+'PROPIETARIO actuales'!I87","v":"APELLIDO/S, NOMBRE/S,  DNI Y CARGO DE CADA MIEMBRO DE SU ADMINISTRACIÓN:"},{"$f":"IF('PROPIETARIO actuales'!J87>0,'PROPIETARIO actuales'!J87,\"INCOMPLETO RECHAZAR\")","v":"INCOMPLETO RECHAZAR"},397]
[{"$f":"+'PROPIETARIO actuales'!G104","v":"c PROP PJ"},{"$f":"+'PROPIETARIO actuales'!H104","v":0},{"$f":"+'PROPIETARIO actuales'!H104","v":0},{"$f":"+'PROPIETARIO actuales'!I104","v":"CUIT –sin puntos ni barras-:"},{"$f":"IF('PROPIETARIO actuales'!J104>0,'PROPIETARIO actuales'!J104,\"INCOMPLETO RECHAZAR\")","v":"INCOMPLETO RECHAZAR"},398]
[{"$f":"+'PROPIETARIO actuales'!G121","v":"c PROP PJ"},{"$f":"+'PROPIETARIO actuales'!H121","v":0},{"$f":"+'PROPIETARIO actuales'!H121","v":0},{"$f":"+'PROPIETARIO actuales'!I121","v":"DOMICILIO SOCIAL:"},{"$f":"IF('PROPIETARIO actuales'!J121>0,'PROPIETARIO actuales'!J121,\"INCOMPLETO RECHAZAR\")","v":"INCOMPLETO RECHAZAR"},399]
[{"$f":"+'PROPIETARIO actuales'!A64","v":"c PROP PH"},{"$f":"+'PROPIETARIO actuales'!B64","v":0},{"$f":"+'PROPIETARIO actuales'!C64","v":0},{"$f":"+'PROPIETARIO actuales'!D64","v":"DOC. IDENTIDAD –sin puntos-:"},{"$f":"IF('PROPIETARIO actuales'!E64>0,'PROPIETARIO actuales'!E64,\"INCOMPLETO RECHAZAR\")","v":"INCOMPLETO RECHAZAR"},405]
[{"$f":"+'PROPIETARIO actuales'!A84","v":"c PROP PH"},{"$f":"+'PROPIETARIO actuales'!B84","v":0},{"$f":"+'PROPIETARIO actuales'!C84","v":0},{"$f":"+'PROPIETARIO actuales'!D84","v":"NACIONALIDAD:"},{"$f":"IF('PROPIETARIO actuales'!E84>0,'PROPIETARIO actuales'!E84,\"INCOMPLETO RECHAZAR\")","v":"INCOMPLETO RECHAZAR"},406]
[{"$f":"+'PROPIETARIO actuales'!A104","v":"c PROP PH"},{"$f":"+'PROPIETARIO actuales'!B104","v":0},{"$f":"+'PROPIETARIO actuales'!C104","v":0},{"$f":"+'PROPIETARIO actuales'!D104","v":"EMAIL:"},{"$f":"IF('PROPIETARIO actuales'!E104>0,'PROPIETARIO actuales'!E104,\"INCOMPLETO RECHAZAR\")","v":"INCOMPLETO RECHAZAR"},407]
[{"$f":"+'PROPIETARIO actuales'!A124","v":"c PROP PH"},{"$f":"+'PROPIETARIO actuales'!B124","v":0},{"$f":"+'PROPIETARIO actuales'!C124","v":0},{"$f":"+'PROPIETARIO actuales'!D124","v":""},{"$f":"IF('PROPIETARIO actuales'!E124>0,'PROPIETARIO actuales'!E124,\"INCOMPLETO RECHAZAR\")","v":"INCOMPLETO RECHAZAR"},408]
[{"$f":"+'PROPIETARIO actuales'!A142","v":"j ORG. FISCALIZ."},{"$f":"+'PROPIETARIO actuales'!B142","v":0},{"$f":"+'PROPIETARIO actuales'!C142","v":0},{"$f":"+'PROPIETARIO actuales'!D142","v":"NOMBRE CARGO FISCALIZACIÓN QUE OCUPA:"},{"$f":"IF('PROPIETARIO actuales'!E142>0,'PROPIETARIO actuales'!E142,\"INCOMPLETO RECHAZAR\")","v":"INCOMPLETO RECHAZAR"},409]
[{"$f":"+'PROPIETARIO actuales'!A162","v":"c PROP PH"},{"$f":"+'PROPIETARIO actuales'!B162","v":0},{"$f":"+'PROPIETARIO actuales'!C162","v":0},{"$f":"+'PROPIETARIO actuales'!D162","v":"FECHA DE NACIMIENTO –dd/mm/aa-:"},{"$f":"IF('PROPIETARIO actuales'!E162>0,'PROPIETARIO actuales'!E162,\"INCOMPLETO RECHAZAR\")","v":"INCOMPLETO RECHAZAR"},410]
[{"$f":"+'PROPIETARIO actuales'!G37","v":"c PROP PJ"},{"$f":"+'PROPIETARIO actuales'!H37","v":0},{"$f":"+'PROPIETARIO actuales'!H37","v":0},{"$f":"+'PROPIETARIO actuales'!I37","v":"NOTA/OBSERVACIÓN -en mayúscula-:"},{"$f":"IF('PROPIETARIO actuales'!J37>0,'PROPIETARIO actuales'!J37,\"INCOMPLETO RECHAZAR\")","v":"INCOMPLETO RECHAZAR"},418]
[{"$f":"+'PROPIETARIO actuales'!G54","v":"c PROP PJ"},{"$f":"+'PROPIETARIO actuales'!H54","v":0},{"$f":"+'PROPIETARIO actuales'!H54","v":0},{"$f":"+'PROPIETARIO actuales'!I54","v":"APELLIDO/S, NOMBRE/S,  DNI Y CARGO DE CADA MIEMBRO DE SU ADMINISTRACIÓN:"},{"$f":"IF('PROPIETARIO actuales'!J54>0,'PROPIETARIO actuales'!J54,\"INCOMPLETO RECHAZAR\")","v":"INCOMPLETO RECHAZAR"},419]
[{"$f":"+'PROPIETARIO actuales'!G71","v":"c PROP PJ"},{"$f":"+'PROPIETARIO actuales'!H71","v":0},{"$f":"+'PROPIETARIO actuales'!H71","v":0},{"$f":"+'PROPIETARIO actuales'!I71","v":"CUIT –sin puntos ni barras-:"},{"$f":"IF('PROPIETARIO actuales'!J71>0,'PROPIETARIO actuales'!J71,\"INCOMPLETO RECHAZAR\")","v":"INCOMPLETO RECHAZAR"},420]
[{"$f":"+'PROPIETARIO actuales'!G88","v":"c PROP PJ"},{"$f":"+'PROPIETARIO actuales'!H88","v":0},{"$f":"+'PROPIETARIO actuales'!H88","v":0},{"$f":"+'PROPIETARIO actuales'!I88","v":"DOMICILIO SOCIAL:"},{"$f":"IF('PROPIETARIO actuales'!J88>0,'PROPIETARIO actuales'!J88,\"INCOMPLETO RECHAZAR\")","v":"INCOMPLETO RECHAZAR"},421]
[{"$f":"+'PROPIETARIO actuales'!G105","v":"c PROP PJ"},{"$f":"+'PROPIETARIO actuales'!H105","v":0},{"$f":"+'PROPIETARIO actuales'!H105","v":0},{"$f":"+'PROPIETARIO actuales'!I105","v":"TIPO DE PERSONA JCA -FONDO DE COMERCIO, asociación, mutual, etc-:"},{"$f":"IF('PROPIETARIO actuales'!J105>0,'PROPIETARIO actuales'!J105,\"INCOMPLETO RECHAZAR\")","v":"INCOMPLETO RECHAZAR"},422]
[{"$f":"+'PROPIETARIO actuales'!G122","v":"c PROP PJ"},{"$f":"+'PROPIETARIO actuales'!H122","v":0},{"$f":"+'PROPIETARIO actuales'!H122","v":0},{"$f":"+'PROPIETARIO actuales'!I122","v":"SEDE SOCIAL:"},{"$f":"IF('PROPIETARIO actuales'!J122>0,'PROPIETARIO actuales'!J122,\"INCOMPLETO RECHAZAR\")","v":"INCOMPLETO RECHAZAR"},423]
[{"$f":"+'PROPIETARIO actuales'!A45","v":"i ORG. REP. LEGAL/ ADM."},{"$f":"+'PROPIETARIO actuales'!B45","v":0},{"$f":"+'PROPIETARIO actuales'!C45","v":0},{"$f":"+'PROPIETARIO actuales'!D45","v":"NOMBRE CARGO REP. LEGAL/ ADMINISTRACIÓN QUE OCUPA:"},{"$f":"IF('PROPIETARIO actuales'!E45>0,'PROPIETARIO actuales'!E45,\"INCOMPLETO RECHAZAR\")","v":"INCOMPLETO RECHAZAR"},428]
[{"$f":"+'PROPIETARIO actuales'!A65","v":"c PROP PH"},{"$f":"+'PROPIETARIO actuales'!B65","v":0},{"$f":"+'PROPIETARIO actuales'!C65","v":0},{"$f":"+'PROPIETARIO actuales'!D65","v":"CUIT/CUIL –sin puntos ni barras-:"},{"$f":"IF('PROPIETARIO actuales'!E65>0,'PROPIETARIO actuales'!E65,\"INCOMPLETO RECHAZAR\")","v":"INCOMPLETO RECHAZAR"},429]
[{"$f":"+'PROPIETARIO actuales'!A85","v":"c PROP PH"},{"$f":"+'PROPIETARIO actuales'!B85","v":0},{"$f":"+'PROPIETARIO actuales'!C85","v":0},{"$f":"+'PROPIETARIO actuales'!D85","v":"PROFESIÓN/OFICIO:"},{"$f":"IF('PROPIETARIO actuales'!E85>0,'PROPIETARIO actuales'!E85,\"INCOMPLETO RECHAZAR\")","v":"INCOMPLETO RECHAZAR"},430]
[{"$f":"+'PROPIETARIO actuales'!A105","v":"c PROP PH"},{"$f":"+'PROPIETARIO actuales'!B105","v":0},{"$f":"+'PROPIETARIO actuales'!C105","v":0},{"$f":"+'PROPIETARIO actuales'!D105","v":"ESTADO CIVIL:"},{"$f":"IF('PROPIETARIO actuales'!E105>0,'PROPIETARIO actuales'!E105,\"INCOMPLETO RECHAZAR\")","v":"INCOMPLETO RECHAZAR"},431]
[{"$f":"+'PROPIETARIO actuales'!A143","v":"c PROP PH"},{"$f":"+'PROPIETARIO actuales'!B143","v":0},{"$f":"+'PROPIETARIO actuales'!C143","v":0},{"$f":"+'PROPIETARIO actuales'!D143","v":"NOTA/OBSERVACIÓN -en mayúscula-:"},{"$f":"IF('PROPIETARIO actuales'!E143>0,'PROPIETARIO actuales'!E143,\"INCOMPLETO RECHAZAR\")","v":"INCOMPLETO RECHAZAR"},433]
[{"$f":"+'PROPIETARIO actuales'!A163","v":"c PROP PH"},{"$f":"+'PROPIETARIO actuales'!B163","v":0},{"$f":"+'PROPIETARIO actuales'!C163","v":0},{"$f":"+'PROPIETARIO actuales'!D163","v":"LUGAR DE NACIMIENTO:"},{"$f":"IF('PROPIETARIO actuales'!E163>0,'PROPIETARIO actuales'!E163,\"INCOMPLETO RECHAZAR\")","v":"INCOMPLETO RECHAZAR"},434]
[{"$f":"+'PROPIETARIO actuales'!A47","v":"c PROP PH"},{"$f":"+'PROPIETARIO actuales'!B47","v":0},{"$f":"+'PROPIETARIO actuales'!C47","v":0},{"$f":"+'PROPIETARIO actuales'!D47","v":"NOTA/OBSERVACIÓN -en mayúscula-:"},{"$f":"IF('PROPIETARIO actuales'!E47>0,'PROPIETARIO actuales'!E47,\"INCOMPLETO RECHAZAR\")","v":"INCOMPLETO RECHAZAR"},442]
[{"$f":"+'PROPIETARIO actuales'!A67","v":"c PROP PH"},{"$f":"+'PROPIETARIO actuales'!B67","v":0},{"$f":"+'PROPIETARIO actuales'!C67","v":0},{"$f":"+'PROPIETARIO actuales'!D67","v":"LUGAR DE NACIMIENTO:"},{"$f":"IF('PROPIETARIO actuales'!E67>0,'PROPIETARIO actuales'!E67,\"INCOMPLETO RECHAZAR\")","v":"INCOMPLETO RECHAZAR"},443]
[{"$f":"+'PROPIETARIO actuales'!A87","v":"c PROP PH"},{"$f":"+'PROPIETARIO actuales'!B87","v":0},{"$f":"+'PROPIETARIO actuales'!C87","v":0},{"$f":"+'PROPIETARIO actuales'!D87","v":"CEL/TEL :"},{"$f":"IF('PROPIETARIO actuales'!E87>0,'PROPIETARIO actuales'!E87,\"INCOMPLETO RECHAZAR\")","v":"INCOMPLETO RECHAZAR"},444]
[{"$f":"+'PROPIETARIO actuales'!A107","v":"c PROP PH"},{"$f":"+'PROPIETARIO actuales'!B107","v":0},{"$f":"+'PROPIETARIO actuales'!C107","v":0},{"$f":"+'PROPIETARIO actuales'!D107","v":""},{"$f":"IF('PROPIETARIO actuales'!E107>0,'PROPIETARIO actuales'!E107,\"INCOMPLETO RECHAZAR\")","v":"INCOMPLETO RECHAZAR"},445]
[{"$f":"+'PROPIETARIO actuales'!A125","v":"i ORG. REP. LEGAL/ ADM."},{"$f":"+'PROPIETARIO actuales'!B125","v":0},{"$f":"+'PROPIETARIO actuales'!C125","v":0},{"$f":"+'PROPIETARIO actuales'!D125","v":"NOMBRE CARGO REP. LEGAL/ ADMINISTRACIÓN QUE OCUPA:"},{"$f":"IF('PROPIETARIO actuales'!E125>0,'PROPIETARIO actuales'!E125,\"INCOMPLETO RECHAZAR\")","v":"INCOMPLETO RECHAZAR"},446]
[{"$f":"+'PROPIETARIO actuales'!A145","v":"c PROP PH"},{"$f":"+'PROPIETARIO actuales'!B145","v":0},{"$f":"+'PROPIETARIO actuales'!C145","v":0},{"$f":"+'PROPIETARIO actuales'!D145","v":"CUIT/CUIL –sin puntos ni barras-:"},{"$f":"IF('PROPIETARIO actuales'!E145>0,'PROPIETARIO actuales'!E145,\"INCOMPLETO RECHAZAR\")","v":"INCOMPLETO RECHAZAR"},447]
[{"$f":"+'PROPIETARIO actuales'!A165","v":"c PROP PH"},{"$f":"+'PROPIETARIO actuales'!B165","v":0},{"$f":"+'PROPIETARIO actuales'!C165","v":0},{"$f":"+'PROPIETARIO actuales'!D165","v":"PROFESIÓN/OFICIO:"},{"$f":"IF('PROPIETARIO actuales'!E165>0,'PROPIETARIO actuales'!E165,\"INCOMPLETO RECHAZAR\")","v":"INCOMPLETO RECHAZAR"},448]
[{"$f":"+'PROPIETARIO actuales'!G39","v":"c PROP PJ"},{"$f":"+'PROPIETARIO actuales'!H39","v":0},{"$f":"+'PROPIETARIO actuales'!H39","v":0},{"$f":"+'PROPIETARIO actuales'!I39","v":"TIPO DE PERSONA JCA -FONDO DE COMERCIO, asociación, mutual, etc-:"},{"$f":"IF('PROPIETARIO actuales'!J39>0,'PROPIETARIO actuales'!J39,\"INCOMPLETO RECHAZAR\")","v":"INCOMPLETO RECHAZAR"},456]
[{"$f":"+'PROPIETARIO actuales'!G56","v":"c PROP PJ"},{"$f":"+'PROPIETARIO actuales'!H56","v":0},{"$f":"+'PROPIETARIO actuales'!H56","v":0},{"$f":"+'PROPIETARIO actuales'!I56","v":"SEDE SOCIAL:"},{"$f":"IF('PROPIETARIO actuales'!J56>0,'PROPIETARIO actuales'!J56,\"INCOMPLETO RECHAZAR\")","v":"INCOMPLETO RECHAZAR"},457]
[{"$f":"+'PROPIETARIO actuales'!G73","v":"c PROP PJ"},{"$f":"+'PROPIETARIO actuales'!H73","v":0},{"$f":"+'PROPIETARIO actuales'!H73","v":0},{"$f":"+'PROPIETARIO actuales'!I73","v":"ORGANISMO /s DONDE SE INSCRIBIÓ CONSTITUCIÓN (INDICAR LOCALIDAD/PCIA DEL ORG) -si no se inscribió poner: NO INSCRIPTO/A:"},{"$f":"IF('PROPIETARIO actuales'!J73>0,'PROPIETARIO actuales'!J73,\"INCOMPLETO RECHAZAR\")","v":"INCOMPLETO RECHAZAR"},458]
[{"$f":"+'PROPIETARIO actuales'!G90","v":"c PROP PJ"},{"$f":"+'PROPIETARIO actuales'!H90","v":0},{"$f":"+'PROPIETARIO actuales'!H90","v":0},{"$f":"+'PROPIETARIO actuales'!I90","v":"CEL/TEL :"},{"$f":"IF('PROPIETARIO actuales'!J90>0,'PROPIETARIO actuales'!J90,\"INCOMPLETO RECHAZAR\")","v":"INCOMPLETO RECHAZAR"},459]
[{"$f":"+'PROPIETARIO actuales'!G107","v":"c PROP PJ"},{"$f":"+'PROPIETARIO actuales'!H107","v":0},{"$f":"+'PROPIETARIO actuales'!H107","v":0},{"$f":"+'PROPIETARIO actuales'!I107","v":"DATOS DE RESOLUCIÓN Y FECHA DE INSCRIPCIÓN:"},{"$f":"IF('PROPIETARIO actuales'!J107>0,'PROPIETARIO actuales'!J107,\"INCOMPLETO RECHAZAR\")","v":"INCOMPLETO RECHAZAR"},460]
[{"$f":"+'PROPIETARIO actuales'!G124","v":"c PROP PJ"},{"$f":"+'PROPIETARIO actuales'!H124","v":0},{"$f":"+'PROPIETARIO actuales'!H124","v":0},{"$f":"+'PROPIETARIO actuales'!I124","v":"OBJETO PRINCIPAL (EN FORMA RESUMIDA):"},{"$f":"IF('PROPIETARIO actuales'!J124>0,'PROPIETARIO actuales'!J124,\"INCOMPLETO RECHAZAR\")","v":"INCOMPLETO RECHAZAR"},461]
[{"$f":"+'PROPIETARIO actuales'!A29","v":"i ORG. REP. LEGAL/ ADM."},{"$f":"+'PROPIETARIO actuales'!B29","v":0},{"$f":"+'PROPIETARIO actuales'!C29","v":0},{"$f":"+'PROPIETARIO actuales'!D29","v":"NOMBRE CARGO REP. LEGAL/ ADMINISTRACIÓN QUE OCUPA:"},{"$f":"IF('PROPIETARIO actuales'!E29>0,'PROPIETARIO actuales'!E29,\"INCOMPLETO RECHAZAR\")","v":"INCOMPLETO RECHAZAR"},466]
[{"$f":"+'PROPIETARIO actuales'!A49","v":"c PROP PH"},{"$f":"+'PROPIETARIO actuales'!B49","v":0},{"$f":"+'PROPIETARIO actuales'!C49","v":0},{"$f":"+'PROPIETARIO actuales'!D49","v":"CUIT/CUIL –sin puntos ni barras-:"},{"$f":"IF('PROPIETARIO actuales'!E49>0,'PROPIETARIO actuales'!E49,\"INCOMPLETO RECHAZAR\")","v":"INCOMPLETO RECHAZAR"},467]
[{"$f":"+'PROPIETARIO actuales'!A69","v":"c PROP PH"},{"$f":"+'PROPIETARIO actuales'!B69","v":0},{"$f":"+'PROPIETARIO actuales'!C69","v":0},{"$f":"+'PROPIETARIO actuales'!D69","v":"PROFESIÓN/OFICIO:"},{"$f":"IF('PROPIETARIO actuales'!E69>0,'PROPIETARIO actuales'!E69,\"INCOMPLETO RECHAZAR\")","v":"INCOMPLETO RECHAZAR"},468]
[{"$f":"+'PROPIETARIO actuales'!A89","v":"c PROP PH"},{"$f":"+'PROPIETARIO actuales'!B89","v":0},{"$f":"+'PROPIETARIO actuales'!C89","v":0},{"$f":"+'PROPIETARIO actuales'!D89","v":"ESTADO CIVIL:"},{"$f":"IF('PROPIETARIO actuales'!E89>0,'PROPIETARIO actuales'!E89,\"INCOMPLETO RECHAZAR\")","v":"INCOMPLETO RECHAZAR"},469]
[{"$f":"+'PROPIETARIO actuales'!A127","v":"c PROP PH"},{"$f":"+'PROPIETARIO actuales'!B127","v":0},{"$f":"+'PROPIETARIO actuales'!C127","v":0},{"$f":"+'PROPIETARIO actuales'!D127","v":"NOTA/OBSERVACIÓN -en mayúscula-:"},{"$f":"IF('PROPIETARIO actuales'!E127>0,'PROPIETARIO actuales'!E127,\"INCOMPLETO RECHAZAR\")","v":"INCOMPLETO RECHAZAR"},471]
[{"$f":"+'PROPIETARIO actuales'!A147","v":"c PROP PH"},{"$f":"+'PROPIETARIO actuales'!B147","v":0},{"$f":"+'PROPIETARIO actuales'!C147","v":0},{"$f":"+'PROPIETARIO actuales'!D147","v":"LUGAR DE NACIMIENTO:"},{"$f":"IF('PROPIETARIO actuales'!E147>0,'PROPIETARIO actuales'!E147,\"INCOMPLETO RECHAZAR\")","v":"INCOMPLETO RECHAZAR"},472]
[{"$f":"+'PROPIETARIO actuales'!A167","v":"c PROP PH"},{"$f":"+'PROPIETARIO actuales'!B167","v":0},{"$f":"+'PROPIETARIO actuales'!C167","v":0},{"$f":"+'PROPIETARIO actuales'!D167","v":"CEL/TEL :"},{"$f":"IF('PROPIETARIO actuales'!E167>0,'PROPIETARIO actuales'!E167,\"INCOMPLETO RECHAZAR\")","v":"INCOMPLETO RECHAZAR"},473]
[{"$f":"+'NO PROPIETARIOS adm actuales'!A21","v":"i ORG. REP. LEGAL/ ADM."},{"$f":"+'NO PROPIETARIOS adm actuales'!B21","v":0},{"$f":"+'NO PROPIETARIOS adm actuales'!C21","v":0},{"$f":"+'NO PROPIETARIOS adm actuales'!D21","v":"NOMBRE CARGO REP. LEGAL/ ADMINISTRACIÓN QUE OCUPA:"},{"$f":"IF('NO PROPIETARIOS adm actuales'!E21>0,'NO PROPIETARIOS adm actuales'!E21,\"INCOMPLETO RECHAZAR\")","v":"INCOMPLETO RECHAZAR"},480]
[{"$f":"+'NO PROPIETARIOS adm actuales'!A37","v":"i ORG. REP. LEGAL/ ADM."},{"$f":"+'NO PROPIETARIOS adm actuales'!B37","v":0},{"$f":"+'NO PROPIETARIOS adm actuales'!C37","v":0},{"$f":"+'NO PROPIETARIOS adm actuales'!D37","v":"NOMBRE CARGO REP. LEGAL/ ADMINISTRACIÓN QUE OCUPA:"},{"$f":"IF('NO PROPIETARIOS adm actuales'!E37>0,'NO PROPIETARIOS adm actuales'!E37,\"INCOMPLETO RECHAZAR\")","v":"INCOMPLETO RECHAZAR"},481]
[{"$f":"+'NO PROPIETARIOS adm actuales'!A53","v":"i ORG. REP. LEGAL/ ADM."},{"$f":"+'NO PROPIETARIOS adm actuales'!B53","v":0},{"$f":"+'NO PROPIETARIOS adm actuales'!C53","v":0},{"$f":"+'NO PROPIETARIOS adm actuales'!D53","v":"NOMBRE CARGO REP. LEGAL/ ADMINISTRACIÓN QUE OCUPA:"},{"$f":"IF('NO PROPIETARIOS adm actuales'!E53>0,'NO PROPIETARIOS adm actuales'!E53,\"INCOMPLETO RECHAZAR\")","v":"INCOMPLETO RECHAZAR"},482]
[{"$f":"+'NO PROPIETARIOS adm actuales'!A69","v":"i ORG. REP. LEGAL/ ADM."},{"$f":"+'NO PROPIETARIOS adm actuales'!B69","v":0},{"$f":"+'NO PROPIETARIOS adm actuales'!C69","v":0},{"$f":"+'NO PROPIETARIOS adm actuales'!D69","v":"NOMBRE CARGO REP. LEGAL/ ADMINISTRACIÓN QUE OCUPA:"},{"$f":"IF('NO PROPIETARIOS adm actuales'!E69>0,'NO PROPIETARIOS adm actuales'!E69,\"INCOMPLETO RECHAZAR\")","v":"INCOMPLETO RECHAZAR"},483]
[{"$f":"+'NO PROPIETARIOS adm actuales'!A85","v":"i ORG. REP. LEGAL/ ADM."},{"$f":"+'NO PROPIETARIOS adm actuales'!B85","v":0},{"$f":"+'NO PROPIETARIOS adm actuales'!C85","v":0},{"$f":"+'NO PROPIETARIOS adm actuales'!D85","v":"NOMBRE CARGO REP. LEGAL/ ADMINISTRACIÓN QUE OCUPA:"},{"$f":"IF('NO PROPIETARIOS adm actuales'!E85>0,'NO PROPIETARIOS adm actuales'!E85,\"INCOMPLETO RECHAZAR\")","v":"INCOMPLETO RECHAZAR"},484]
[{"$f":"+'NO PROPIETARIOS adm actuales'!A101","v":"i ORG. REP. LEGAL/ ADM."},{"$f":"+'NO PROPIETARIOS adm actuales'!B101","v":0},{"$f":"+'NO PROPIETARIOS adm actuales'!C101","v":0},{"$f":"+'NO PROPIETARIOS adm actuales'!D101","v":"NOMBRE CARGO REP. LEGAL/ ADMINISTRACIÓN QUE OCUPA:"},{"$f":"IF('NO PROPIETARIOS adm actuales'!E101>0,'NO PROPIETARIOS adm actuales'!E101,\"INCOMPLETO RECHAZAR\")","v":"INCOMPLETO RECHAZAR"},485]
[{"$f":"+'NO PROPIETARIOS adm actuales'!A117","v":"i ORG. REP. LEGAL/ ADM."},{"$f":"+'NO PROPIETARIOS adm actuales'!B117","v":0},{"$f":"+'NO PROPIETARIOS adm actuales'!C117","v":0},{"$f":"+'NO PROPIETARIOS adm actuales'!D117","v":"NOMBRE CARGO REP. LEGAL/ ADMINISTRACIÓN QUE OCUPA:"},{"$f":"IF('NO PROPIETARIOS adm actuales'!E117>0,'NO PROPIETARIOS adm actuales'!E117,\"INCOMPLETO RECHAZAR\")","v":"INCOMPLETO RECHAZAR"},486]
[{"$f":"+'NO PROPIETARIOS adm actuales'!A133","v":"i ORG. REP. LEGAL/ ADM."},{"$f":"+'NO PROPIETARIOS adm actuales'!B133","v":0},{"$f":"+'NO PROPIETARIOS adm actuales'!C133","v":0},{"$f":"+'NO PROPIETARIOS adm actuales'!D133","v":"NOMBRE CARGO REP. LEGAL/ ADMINISTRACIÓN QUE OCUPA:"},{"$f":"IF('NO PROPIETARIOS adm actuales'!E133>0,'NO PROPIETARIOS adm actuales'!E133,\"INCOMPLETO RECHAZAR\")","v":"INCOMPLETO RECHAZAR"},487]
[{"$f":"+'NO PROPIETARIOS adm actuales'!A149","v":"i ORG. REP. LEGAL/ ADM."},{"$f":"+'NO PROPIETARIOS adm actuales'!B149","v":0},{"$f":"+'NO PROPIETARIOS adm actuales'!C149","v":0},{"$f":"+'NO PROPIETARIOS adm actuales'!D149","v":"NOMBRE CARGO REP. LEGAL/ ADMINISTRACIÓN QUE OCUPA:"},{"$f":"IF('NO PROPIETARIOS adm actuales'!E149>0,'NO PROPIETARIOS adm actuales'!E149,\"INCOMPLETO RECHAZAR\")","v":"INCOMPLETO RECHAZAR"},488]
[{"$f":"+'NO PROPIETARIOS adm actuales'!A165","v":"i ORG. REP. LEGAL/ ADM."},{"$f":"+'NO PROPIETARIOS adm actuales'!B165","v":0},{"$f":"+'NO PROPIETARIOS adm actuales'!C165","v":0},{"$f":"+'NO PROPIETARIOS adm actuales'!D165","v":"NOMBRE CARGO REP. LEGAL/ ADMINISTRACIÓN QUE OCUPA:"},{"$f":"IF('NO PROPIETARIOS adm actuales'!E165>0,'NO PROPIETARIOS adm actuales'!E165,\"INCOMPLETO RECHAZAR\")","v":"INCOMPLETO RECHAZAR"},489]
[{"$f":"+'NO PROPIETARIOS adm actuales'!A181","v":"i ORG. REP. LEGAL/ ADM."},{"$f":"+'NO PROPIETARIOS adm actuales'!B181","v":0},{"$f":"+'NO PROPIETARIOS adm actuales'!C181","v":0},{"$f":"+'NO PROPIETARIOS adm actuales'!D181","v":"NOMBRE CARGO REP. LEGAL/ ADMINISTRACIÓN QUE OCUPA:"},{"$f":"IF('NO PROPIETARIOS adm actuales'!E181>0,'NO PROPIETARIOS adm actuales'!E181,\"INCOMPLETO RECHAZAR\")","v":"INCOMPLETO RECHAZAR"},490]
[{"$f":"+'NO PROPIETARIOS adm actuales'!A197","v":"i ORG. REP. LEGAL/ ADM."},{"$f":"+'NO PROPIETARIOS adm actuales'!B197","v":0},{"$f":"+'NO PROPIETARIOS adm actuales'!C197","v":0},{"$f":"+'NO PROPIETARIOS adm actuales'!D197","v":"NOMBRE CARGO REP. LEGAL/ ADMINISTRACIÓN QUE OCUPA:"},{"$f":"IF('NO PROPIETARIOS adm actuales'!E197>0,'NO PROPIETARIOS adm actuales'!E197,\"INCOMPLETO RECHAZAR\")","v":"INCOMPLETO RECHAZAR"},491]
[{"$f":"+'NO PROPIETARIOS adm actuales'!A213","v":"i ORG. REP. LEGAL/ ADM."},{"$f":"+'NO PROPIETARIOS adm actuales'!B213","v":0},{"$f":"+'NO PROPIETARIOS adm actuales'!C213","v":0},{"$f":"+'NO PROPIETARIOS adm actuales'!D213","v":"NOMBRE CARGO REP. LEGAL/ ADMINISTRACIÓN QUE OCUPA:"},{"$f":"IF('NO PROPIETARIOS adm actuales'!E213>0,'NO PROPIETARIOS adm actuales'!E213,\"INCOMPLETO RECHAZAR\")","v":"INCOMPLETO RECHAZAR"},492]
[{"$f":"+'NO PROPIETARIOS adm actuales'!A229","v":"i ORG. REP. LEGAL/ ADM."},{"$f":"+'NO PROPIETARIOS adm actuales'!B229","v":0},{"$f":"+'NO PROPIETARIOS adm actuales'!C229","v":0},{"$f":"+'NO PROPIETARIOS adm actuales'!D229","v":"NOMBRE CARGO REP. LEGAL/ ADMINISTRACIÓN QUE OCUPA:"},{"$f":"IF('NO PROPIETARIOS adm actuales'!E229>0,'NO PROPIETARIOS adm actuales'!E229,\"INCOMPLETO RECHAZAR\")","v":"INCOMPLETO RECHAZAR"},493]
[{"$f":"+'NO PROPIETARIOS adm actuales'!A245","v":"i ORG. REP. LEGAL/ ADM."},{"$f":"+'NO PROPIETARIOS adm actuales'!B245","v":0},{"$f":"+'NO PROPIETARIOS adm actuales'!C245","v":0},{"$f":"+'NO PROPIETARIOS adm actuales'!D245","v":"NOMBRE CARGO REP. LEGAL/ ADMINISTRACIÓN QUE OCUPA:"},{"$f":"IF('NO PROPIETARIOS adm actuales'!E245>0,'NO PROPIETARIOS adm actuales'!E245,\"INCOMPLETO RECHAZAR\")","v":"INCOMPLETO RECHAZAR"},494]
[{"$f":"+'PROPIETARIO actuales'!A30","v":"j ORG. FISCALIZ."},{"$f":"+'PROPIETARIO actuales'!B30","v":0},{"$f":"+'PROPIETARIO actuales'!C30","v":0},{"$f":"+'PROPIETARIO actuales'!D30","v":"NOMBRE CARGO FISCALIZACIÓN QUE OCUPA:"},{"$f":"IF('PROPIETARIO actuales'!E30>0,'PROPIETARIO actuales'!E30,\"INCOMPLETO RECHAZAR\")","v":"INCOMPLETO RECHAZAR"},495]
[{"$f":"+'PROPIETARIO actuales'!A50","v":"c PROP PH"},{"$f":"+'PROPIETARIO actuales'!B50","v":0},{"$f":"+'PROPIETARIO actuales'!C50","v":0},{"$f":"+'PROPIETARIO actuales'!D50","v":"FECHA DE NACIMIENTO –dd/mm/aa-:"},{"$f":"IF('PROPIETARIO actuales'!E50>0,'PROPIETARIO actuales'!E50,\"INCOMPLETO RECHAZAR\")","v":"INCOMPLETO RECHAZAR"},496]
[{"$f":"+'PROPIETARIO actuales'!A70","v":"c PROP PH"},{"$f":"+'PROPIETARIO actuales'!B70","v":0},{"$f":"+'PROPIETARIO actuales'!C70","v":0},{"$f":"+'PROPIETARIO actuales'!D70","v":"DOMICILIO REAL:"},{"$f":"IF('PROPIETARIO actuales'!E70>0,'PROPIETARIO actuales'!E70,\"INCOMPLETO RECHAZAR\")","v":"INCOMPLETO RECHAZAR"},497]
[{"$f":"+'PROPIETARIO actuales'!A90","v":"c PROP PH"},{"$f":"+'PROPIETARIO actuales'!B90","v":0},{"$f":"+'PROPIETARIO actuales'!C90","v":0},{"$f":"+'PROPIETARIO actuales'!D90","v":""},{"$f":"IF('PROPIETARIO actuales'!E90>0,'PROPIETARIO actuales'!E90,\"INCOMPLETO RECHAZAR\")","v":"INCOMPLETO RECHAZAR"},498]
[{"$f":"+'PROPIETARIO actuales'!A128","v":"c PROP PH"},{"$f":"+'PROPIETARIO actuales'!B128","v":0},{"$f":"+'PROPIETARIO actuales'!C128","v":0},{"$f":"+'PROPIETARIO actuales'!D128","v":"DOC. IDENTIDAD –sin puntos-:"},{"$f":"IF('PROPIETARIO actuales'!E128>0,'PROPIETARIO actuales'!E128,\"INCOMPLETO RECHAZAR\")","v":"INCOMPLETO RECHAZAR"},500]
[{"$f":"+'PROPIETARIO actuales'!A148","v":"c PROP PH"},{"$f":"+'PROPIETARIO actuales'!B148","v":0},{"$f":"+'PROPIETARIO actuales'!C148","v":0},{"$f":"+'PROPIETARIO actuales'!D148","v":"NACIONALIDAD:"},{"$f":"IF('PROPIETARIO actuales'!E148>0,'PROPIETARIO actuales'!E148,\"INCOMPLETO RECHAZAR\")","v":"INCOMPLETO RECHAZAR"},501]
[{"$f":"+'PROPIETARIO actuales'!A168","v":"c PROP PH"},{"$f":"+'PROPIETARIO actuales'!B168","v":0},{"$f":"+'PROPIETARIO actuales'!C168","v":0},{"$f":"+'PROPIETARIO actuales'!D168","v":"EMAIL:"},{"$f":"IF('PROPIETARIO actuales'!E168>0,'PROPIETARIO actuales'!E168,\"INCOMPLETO RECHAZAR\")","v":"INCOMPLETO RECHAZAR"},502]
[{"$f":"+'NO PROPIETARIOS adm actuales'!A22","v":"j ORG. FISCALIZ."},{"$f":"+'NO PROPIETARIOS adm actuales'!B22","v":0},{"$f":"+'NO PROPIETARIOS adm actuales'!C22","v":0},{"$f":"+'NO PROPIETARIOS adm actuales'!D22","v":"NOMBRE CARGO FISCALIZACIÓN QUE OCUPA:"},{"$f":"IF('NO PROPIETARIOS adm actuales'!E22>0,'NO PROPIETARIOS adm actuales'!E22,\"INCOMPLETO RECHAZAR\")","v":"INCOMPLETO RECHAZAR"},509]
[{"$f":"+'NO PROPIETARIOS adm actuales'!A38","v":"j ORG. FISCALIZ."},{"$f":"+'NO PROPIETARIOS adm actuales'!B38","v":0},{"$f":"+'NO PROPIETARIOS adm actuales'!C38","v":0},{"$f":"+'NO PROPIETARIOS adm actuales'!D38","v":"NOMBRE CARGO FISCALIZACIÓN QUE OCUPA:"},{"$f":"IF('NO PROPIETARIOS adm actuales'!E38>0,'NO PROPIETARIOS adm actuales'!E38,\"INCOMPLETO RECHAZAR\")","v":"INCOMPLETO RECHAZAR"},510]
[{"$f":"+'NO PROPIETARIOS adm actuales'!A54","v":"j ORG. FISCALIZ."},{"$f":"+'NO PROPIETARIOS adm actuales'!B54","v":0},{"$f":"+'NO PROPIETARIOS adm actuales'!C54","v":0},{"$f":"+'NO PROPIETARIOS adm actuales'!D54","v":"NOMBRE CARGO FISCALIZACIÓN QUE OCUPA:"},{"$f":"IF('NO PROPIETARIOS adm actuales'!E54>0,'NO PROPIETARIOS adm actuales'!E54,\"INCOMPLETO RECHAZAR\")","v":"INCOMPLETO RECHAZAR"},511]
[{"$f":"+'NO PROPIETARIOS adm actuales'!A70","v":"j ORG. FISCALIZ."},{"$f":"+'NO PROPIETARIOS adm actuales'!B70","v":0},{"$f":"+'NO PROPIETARIOS adm actuales'!C70","v":0},{"$f":"+'NO PROPIETARIOS adm actuales'!D70","v":"NOMBRE CARGO FISCALIZACIÓN QUE OCUPA:"},{"$f":"IF('NO PROPIETARIOS adm actuales'!E70>0,'NO PROPIETARIOS adm actuales'!E70,\"INCOMPLETO RECHAZAR\")","v":"INCOMPLETO RECHAZAR"},512]
[{"$f":"+'NO PROPIETARIOS adm actuales'!A86","v":"j ORG. FISCALIZ."},{"$f":"+'NO PROPIETARIOS adm actuales'!B86","v":0},{"$f":"+'NO PROPIETARIOS adm actuales'!C86","v":0},{"$f":"+'NO PROPIETARIOS adm actuales'!D86","v":"NOMBRE CARGO FISCALIZACIÓN QUE OCUPA:"},{"$f":"IF('NO PROPIETARIOS adm actuales'!E86>0,'NO PROPIETARIOS adm actuales'!E86,\"INCOMPLETO RECHAZAR\")","v":"INCOMPLETO RECHAZAR"},513]
[{"$f":"+'NO PROPIETARIOS adm actuales'!A102","v":"j ORG. FISCALIZ."},{"$f":"+'NO PROPIETARIOS adm actuales'!B102","v":0},{"$f":"+'NO PROPIETARIOS adm actuales'!C102","v":0},{"$f":"+'NO PROPIETARIOS adm actuales'!D102","v":"NOMBRE CARGO FISCALIZACIÓN QUE OCUPA:"},{"$f":"IF('NO PROPIETARIOS adm actuales'!E102>0,'NO PROPIETARIOS adm actuales'!E102,\"INCOMPLETO RECHAZAR\")","v":"INCOMPLETO RECHAZAR"},514]
[{"$f":"+'NO PROPIETARIOS adm actuales'!A118","v":"j ORG. FISCALIZ."},{"$f":"+'NO PROPIETARIOS adm actuales'!B118","v":0},{"$f":"+'NO PROPIETARIOS adm actuales'!C118","v":0},{"$f":"+'NO PROPIETARIOS adm actuales'!D118","v":"NOMBRE CARGO FISCALIZACIÓN QUE OCUPA:"},{"$f":"IF('NO PROPIETARIOS adm actuales'!E118>0,'NO PROPIETARIOS adm actuales'!E118,\"INCOMPLETO RECHAZAR\")","v":"INCOMPLETO RECHAZAR"},515]
[{"$f":"+'NO PROPIETARIOS adm actuales'!A134","v":"j ORG. FISCALIZ."},{"$f":"+'NO PROPIETARIOS adm actuales'!B134","v":0},{"$f":"+'NO PROPIETARIOS adm actuales'!C134","v":0},{"$f":"+'NO PROPIETARIOS adm actuales'!D134","v":"NOMBRE CARGO FISCALIZACIÓN QUE OCUPA:"},{"$f":"IF('NO PROPIETARIOS adm actuales'!E134>0,'NO PROPIETARIOS adm actuales'!E134,\"INCOMPLETO RECHAZAR\")","v":"INCOMPLETO RECHAZAR"},516]
[{"$f":"+'NO PROPIETARIOS adm actuales'!A150","v":"j ORG. FISCALIZ."},{"$f":"+'NO PROPIETARIOS adm actuales'!B150","v":0},{"$f":"+'NO PROPIETARIOS adm actuales'!C150","v":0},{"$f":"+'NO PROPIETARIOS adm actuales'!D150","v":"NOMBRE CARGO FISCALIZACIÓN QUE OCUPA:"},{"$f":"IF('NO PROPIETARIOS adm actuales'!E150>0,'NO PROPIETARIOS adm actuales'!E150,\"INCOMPLETO RECHAZAR\")","v":"INCOMPLETO RECHAZAR"},517]
[{"$f":"+'NO PROPIETARIOS adm actuales'!A166","v":"j ORG. FISCALIZ."},{"$f":"+'NO PROPIETARIOS adm actuales'!B166","v":0},{"$f":"+'NO PROPIETARIOS adm actuales'!C166","v":0},{"$f":"+'NO PROPIETARIOS adm actuales'!D166","v":"NOMBRE CARGO FISCALIZACIÓN QUE OCUPA:"},{"$f":"IF('NO PROPIETARIOS adm actuales'!E166>0,'NO PROPIETARIOS adm actuales'!E166,\"INCOMPLETO RECHAZAR\")","v":"INCOMPLETO RECHAZAR"},518]
[{"$f":"+'NO PROPIETARIOS adm actuales'!A182","v":"j ORG. FISCALIZ."},{"$f":"+'NO PROPIETARIOS adm actuales'!B182","v":0},{"$f":"+'NO PROPIETARIOS adm actuales'!C182","v":0},{"$f":"+'NO PROPIETARIOS adm actuales'!D182","v":"NOMBRE CARGO FISCALIZACIÓN QUE OCUPA:"},{"$f":"IF('NO PROPIETARIOS adm actuales'!E182>0,'NO PROPIETARIOS adm actuales'!E182,\"INCOMPLETO RECHAZAR\")","v":"INCOMPLETO RECHAZAR"},519]
[{"$f":"+'NO PROPIETARIOS adm actuales'!A198","v":"j ORG. FISCALIZ."},{"$f":"+'NO PROPIETARIOS adm actuales'!B198","v":0},{"$f":"+'NO PROPIETARIOS adm actuales'!C198","v":0},{"$f":"+'NO PROPIETARIOS adm actuales'!D198","v":"NOMBRE CARGO FISCALIZACIÓN QUE OCUPA:"},{"$f":"IF('NO PROPIETARIOS adm actuales'!E198>0,'NO PROPIETARIOS adm actuales'!E198,\"INCOMPLETO RECHAZAR\")","v":"INCOMPLETO RECHAZAR"},520]
[{"$f":"+'NO PROPIETARIOS adm actuales'!A214","v":"j ORG. FISCALIZ."},{"$f":"+'NO PROPIETARIOS adm actuales'!B214","v":0},{"$f":"+'NO PROPIETARIOS adm actuales'!C214","v":0},{"$f":"+'NO PROPIETARIOS adm actuales'!D214","v":"NOMBRE CARGO FISCALIZACIÓN QUE OCUPA:"},{"$f":"IF('NO PROPIETARIOS adm actuales'!E214>0,'NO PROPIETARIOS adm actuales'!E214,\"INCOMPLETO RECHAZAR\")","v":"INCOMPLETO RECHAZAR"},521]
[{"$f":"+'NO PROPIETARIOS adm actuales'!A230","v":"j ORG. FISCALIZ."},{"$f":"+'NO PROPIETARIOS adm actuales'!B230","v":0},{"$f":"+'NO PROPIETARIOS adm actuales'!C230","v":0},{"$f":"+'NO PROPIETARIOS adm actuales'!D230","v":"NOMBRE CARGO FISCALIZACIÓN QUE OCUPA:"},{"$f":"IF('NO PROPIETARIOS adm actuales'!E230>0,'NO PROPIETARIOS adm actuales'!E230,\"INCOMPLETO RECHAZAR\")","v":"INCOMPLETO RECHAZAR"},522]
[{"$f":"+'NO PROPIETARIOS adm actuales'!A246","v":"j ORG. FISCALIZ."},{"$f":"+'NO PROPIETARIOS adm actuales'!B246","v":0},{"$f":"+'NO PROPIETARIOS adm actuales'!C246","v":0},{"$f":"+'NO PROPIETARIOS adm actuales'!D246","v":"NOMBRE CARGO FISCALIZACIÓN QUE OCUPA:"},{"$f":"IF('NO PROPIETARIOS adm actuales'!E246>0,'NO PROPIETARIOS adm actuales'!E246,\"INCOMPLETO RECHAZAR\")","v":"INCOMPLETO RECHAZAR"},523]
[{"$f":"+'NO PROPIETARIOS adm actuales'!A16","v":"l NO PROPIETARIO"},{"$f":"+'NO PROPIETARIOS adm actuales'!B16","v":0},{"$f":"+'NO PROPIETARIOS adm actuales'!C16","v":0},{"$f":"+'NO PROPIETARIOS adm actuales'!D16","v":"EMAIL:"},{"$f":"IF('NO PROPIETARIOS adm actuales'!E16>0,'NO PROPIETARIOS adm actuales'!E16,\"INCOMPLETO RECHAZAR\")","v":"INCOMPLETO RECHAZAR"},524]
[{"$f":"+'NO PROPIETARIOS adm actuales'!A32","v":"l NO PROPIETARIO"},{"$f":"+'NO PROPIETARIOS adm actuales'!B32","v":0},{"$f":"+'NO PROPIETARIOS adm actuales'!C32","v":0},{"$f":"+'NO PROPIETARIOS adm actuales'!D32","v":"EMAIL:"},{"$f":"IF('NO PROPIETARIOS adm actuales'!E32>0,'NO PROPIETARIOS adm actuales'!E32,\"INCOMPLETO RECHAZAR\")","v":"INCOMPLETO RECHAZAR"},525]
[{"$f":"+'NO PROPIETARIOS adm actuales'!A48","v":"l NO PROPIETARIO"},{"$f":"+'NO PROPIETARIOS adm actuales'!B48","v":0},{"$f":"+'NO PROPIETARIOS adm actuales'!C48","v":0},{"$f":"+'NO PROPIETARIOS adm actuales'!D48","v":"EMAIL:"},{"$f":"IF('NO PROPIETARIOS adm actuales'!E48>0,'NO PROPIETARIOS adm actuales'!E48,\"INCOMPLETO RECHAZAR\")","v":"INCOMPLETO RECHAZAR"},526]
[{"$f":"+'NO PROPIETARIOS adm actuales'!A64","v":"l NO PROPIETARIO"},{"$f":"+'NO PROPIETARIOS adm actuales'!B64","v":0},{"$f":"+'NO PROPIETARIOS adm actuales'!C64","v":0},{"$f":"+'NO PROPIETARIOS adm actuales'!D64","v":"EMAIL:"},{"$f":"IF('NO PROPIETARIOS adm actuales'!E64>0,'NO PROPIETARIOS adm actuales'!E64,\"INCOMPLETO RECHAZAR\")","v":"INCOMPLETO RECHAZAR"},527]
[{"$f":"+'NO PROPIETARIOS adm actuales'!A80","v":"l NO PROPIETARIO"},{"$f":"+'NO PROPIETARIOS adm actuales'!B80","v":0},{"$f":"+'NO PROPIETARIOS adm actuales'!C80","v":0},{"$f":"+'NO PROPIETARIOS adm actuales'!D80","v":"EMAIL:"},{"$f":"IF('NO PROPIETARIOS adm actuales'!E80>0,'NO PROPIETARIOS adm actuales'!E80,\"INCOMPLETO RECHAZAR\")","v":"INCOMPLETO RECHAZAR"},528]
[{"$f":"+'NO PROPIETARIOS adm actuales'!A96","v":"l NO PROPIETARIO"},{"$f":"+'NO PROPIETARIOS adm actuales'!B96","v":0},{"$f":"+'NO PROPIETARIOS adm actuales'!C96","v":0},{"$f":"+'NO PROPIETARIOS adm actuales'!D96","v":"EMAIL:"},{"$f":"IF('NO PROPIETARIOS adm actuales'!E96>0,'NO PROPIETARIOS adm actuales'!E96,\"INCOMPLETO RECHAZAR\")","v":"INCOMPLETO RECHAZAR"},529]
[{"$f":"+'NO PROPIETARIOS adm actuales'!A112","v":"l NO PROPIETARIO"},{"$f":"+'NO PROPIETARIOS adm actuales'!B112","v":0},{"$f":"+'NO PROPIETARIOS adm actuales'!C112","v":0},{"$f":"+'NO PROPIETARIOS adm actuales'!D112","v":"EMAIL:"},{"$f":"IF('NO PROPIETARIOS adm actuales'!E112>0,'NO PROPIETARIOS adm actuales'!E112,\"INCOMPLETO RECHAZAR\")","v":"INCOMPLETO RECHAZAR"},530]
[{"$f":"+'NO PROPIETARIOS adm actuales'!A128","v":"l NO PROPIETARIO"},{"$f":"+'NO PROPIETARIOS adm actuales'!B128","v":0},{"$f":"+'NO PROPIETARIOS adm actuales'!C128","v":0},{"$f":"+'NO PROPIETARIOS adm actuales'!D128","v":"EMAIL:"},{"$f":"IF('NO PROPIETARIOS adm actuales'!E128>0,'NO PROPIETARIOS adm actuales'!E128,\"INCOMPLETO RECHAZAR\")","v":"INCOMPLETO RECHAZAR"},531]
[{"$f":"+'NO PROPIETARIOS adm actuales'!A144","v":"l NO PROPIETARIO"},{"$f":"+'NO PROPIETARIOS adm actuales'!B144","v":0},{"$f":"+'NO PROPIETARIOS adm actuales'!C144","v":0},{"$f":"+'NO PROPIETARIOS adm actuales'!D144","v":"EMAIL:"},{"$f":"IF('NO PROPIETARIOS adm actuales'!E144>0,'NO PROPIETARIOS adm actuales'!E144,\"INCOMPLETO RECHAZAR\")","v":"INCOMPLETO RECHAZAR"},532]
[{"$f":"+'NO PROPIETARIOS adm actuales'!A160","v":"l NO PROPIETARIO"},{"$f":"+'NO PROPIETARIOS adm actuales'!B160","v":0},{"$f":"+'NO PROPIETARIOS adm actuales'!C160","v":0},{"$f":"+'NO PROPIETARIOS adm actuales'!D160","v":"EMAIL:"},{"$f":"IF('NO PROPIETARIOS adm actuales'!E160>0,'NO PROPIETARIOS adm actuales'!E160,\"INCOMPLETO RECHAZAR\")","v":"INCOMPLETO RECHAZAR"},533]
[{"$f":"+'NO PROPIETARIOS adm actuales'!A176","v":"l NO PROPIETARIO"},{"$f":"+'NO PROPIETARIOS adm actuales'!B176","v":0},{"$f":"+'NO PROPIETARIOS adm actuales'!C176","v":0},{"$f":"+'NO PROPIETARIOS adm actuales'!D176","v":"EMAIL:"},{"$f":"IF('NO PROPIETARIOS adm actuales'!E176>0,'NO PROPIETARIOS adm actuales'!E176,\"INCOMPLETO RECHAZAR\")","v":"INCOMPLETO RECHAZAR"},534]
[{"$f":"+'NO PROPIETARIOS adm actuales'!A192","v":"l NO PROPIETARIO"},{"$f":"+'NO PROPIETARIOS adm actuales'!B192","v":0},{"$f":"+'NO PROPIETARIOS adm actuales'!C192","v":0},{"$f":"+'NO PROPIETARIOS adm actuales'!D192","v":"EMAIL:"},{"$f":"IF('NO PROPIETARIOS adm actuales'!E192>0,'NO PROPIETARIOS adm actuales'!E192,\"INCOMPLETO RECHAZAR\")","v":"INCOMPLETO RECHAZAR"},535]
[{"$f":"+'NO PROPIETARIOS adm actuales'!A208","v":"l NO PROPIETARIO"},{"$f":"+'NO PROPIETARIOS adm actuales'!B208","v":0},{"$f":"+'NO PROPIETARIOS adm actuales'!C208","v":0},{"$f":"+'NO PROPIETARIOS adm actuales'!D208","v":"EMAIL:"},{"$f":"IF('NO PROPIETARIOS adm actuales'!E208>0,'NO PROPIETARIOS adm actuales'!E208,\"INCOMPLETO RECHAZAR\")","v":"INCOMPLETO RECHAZAR"},536]
[{"$f":"+'NO PROPIETARIOS adm actuales'!A224","v":"l NO PROPIETARIO"},{"$f":"+'NO PROPIETARIOS adm actuales'!B224","v":0},{"$f":"+'NO PROPIETARIOS adm actuales'!C224","v":0},{"$f":"+'NO PROPIETARIOS adm actuales'!D224","v":"EMAIL:"},{"$f":"IF('NO PROPIETARIOS adm actuales'!E224>0,'NO PROPIETARIOS adm actuales'!E224,\"INCOMPLETO RECHAZAR\")","v":"INCOMPLETO RECHAZAR"},537]
[{"$f":"+'NO PROPIETARIOS adm actuales'!A240","v":"l NO PROPIETARIO"},{"$f":"+'NO PROPIETARIOS adm actuales'!B240","v":0},{"$f":"+'NO PROPIETARIOS adm actuales'!C240","v":0},{"$f":"+'NO PROPIETARIOS adm actuales'!D240","v":"EMAIL:"},{"$f":"IF('NO PROPIETARIOS adm actuales'!E240>0,'NO PROPIETARIOS adm actuales'!E240,\"INCOMPLETO RECHAZAR\")","v":"INCOMPLETO RECHAZAR"},538]
[{"$f":"+'NO PROPIETARIOS adm actuales'!A18","v":"l NO PROPIETARIO"},{"$f":"+'NO PROPIETARIOS adm actuales'!B18","v":0},{"$f":"+'NO PROPIETARIOS adm actuales'!C18","v":0},{"$f":"+'NO PROPIETARIOS adm actuales'!D18","v":""},{"$f":"IF('NO PROPIETARIOS adm actuales'!E18>0,'NO PROPIETARIOS adm actuales'!E18,\"INCOMPLETO RECHAZAR\")","v":"INCOMPLETO RECHAZAR"},539]
[{"$f":"+'NO PROPIETARIOS adm actuales'!A15","v":"l NO PROPIETARIO"},{"$f":"+'NO PROPIETARIOS adm actuales'!B15","v":0},{"$f":"+'NO PROPIETARIOS adm actuales'!C15","v":0},{"$f":"+'NO PROPIETARIOS adm actuales'!D15","v":"CEL/TEL :"},{"$f":"IF('NO PROPIETARIOS adm actuales'!E15>0,'NO PROPIETARIOS adm actuales'!E15,\"INCOMPLETO RECHAZAR\")","v":"INCOMPLETO RECHAZAR"},540]
[{"$f":"+'NO PROPIETARIOS adm actuales'!A9","v":"l NO PROPIETARIO"},{"$f":"+'NO PROPIETARIOS adm actuales'!B9","v":0},{"$f":"+'NO PROPIETARIOS adm actuales'!C9","v":0},{"$f":"+'NO PROPIETARIOS adm actuales'!D9","v":"CUIT/CUIL –sin puntos ni barras-:"},{"$f":"IF('NO PROPIETARIOS adm actuales'!E9>0,'NO PROPIETARIOS adm actuales'!E9,\"INCOMPLETO RECHAZAR\")","v":"INCOMPLETO RECHAZAR"},541]
[{"$f":"+'NO PROPIETARIOS adm actuales'!A20","v":"l NO PROPIETARIO"},{"$f":"+'NO PROPIETARIOS adm actuales'!B20","v":0},{"$f":"+'NO PROPIETARIOS adm actuales'!C20","v":0},{"$f":"+'NO PROPIETARIOS adm actuales'!D20","v":""},{"$f":"IF('NO PROPIETARIOS adm actuales'!E20>0,'NO PROPIETARIOS adm actuales'!E20,\"INCOMPLETO RECHAZAR\")","v":"INCOMPLETO RECHAZAR"},542]
[{"$f":"+'NO PROPIETARIOS adm actuales'!A8","v":"l NO PROPIETARIO"},{"$f":"+'NO PROPIETARIOS adm actuales'!B8","v":0},{"$f":"+'NO PROPIETARIOS adm actuales'!C8","v":0},{"$f":"+'NO PROPIETARIOS adm actuales'!D8","v":"DOC. IDENTIDAD –sin puntos-:"},{"$f":"IF('NO PROPIETARIOS adm actuales'!E8>0,'NO PROPIETARIOS adm actuales'!E8,\"INCOMPLETO RECHAZAR\")","v":"INCOMPLETO RECHAZAR"},543]
[{"$f":"+'NO PROPIETARIOS adm actuales'!A14","v":"l NO PROPIETARIO"},{"$f":"+'NO PROPIETARIOS adm actuales'!B14","v":0},{"$f":"+'NO PROPIETARIOS adm actuales'!C14","v":0},{"$f":"+'NO PROPIETARIOS adm actuales'!D14","v":"DOMICILIO REAL:"},{"$f":"IF('NO PROPIETARIOS adm actuales'!E14>0,'NO PROPIETARIOS adm actuales'!E14,\"INCOMPLETO RECHAZAR\")","v":"INCOMPLETO RECHAZAR"},544]
[{"$f":"+'NO PROPIETARIOS adm actuales'!A17","v":"l NO PROPIETARIO"},{"$f":"+'NO PROPIETARIOS adm actuales'!B17","v":0},{"$f":"+'NO PROPIETARIOS adm actuales'!C17","v":0},{"$f":"+'NO PROPIETARIOS adm actuales'!D17","v":"ESTADO CIVIL:"},{"$f":"IF('NO PROPIETARIOS adm actuales'!E17>0,'NO PROPIETARIOS adm actuales'!E17,\"INCOMPLETO RECHAZAR\")","v":"INCOMPLETO RECHAZAR"},545]
[{"$f":"+'NO PROPIETARIOS adm actuales'!A10","v":"l NO PROPIETARIO"},{"$f":"+'NO PROPIETARIOS adm actuales'!B10","v":0},{"$f":"+'NO PROPIETARIOS adm actuales'!C10","v":0},{"$f":"+'NO PROPIETARIOS adm actuales'!D10","v":"FECHA DE NACIMIENTO –dd/mm/aa-:"},{"$f":"IF('NO PROPIETARIOS adm actuales'!E10>0,'NO PROPIETARIOS adm actuales'!E10,\"INCOMPLETO RECHAZAR\")","v":"INCOMPLETO RECHAZAR"},546]
[{"$f":"+'NO PROPIETARIOS adm actuales'!A11","v":"l NO PROPIETARIO"},{"$f":"+'NO PROPIETARIOS adm actuales'!B11","v":0},{"$f":"+'NO PROPIETARIOS adm actuales'!C11","v":0},{"$f":"+'NO PROPIETARIOS adm actuales'!D11","v":"LUGAR DE NACIMIENTO:"},{"$f":"IF('NO PROPIETARIOS adm actuales'!E11>0,'NO PROPIETARIOS adm actuales'!E11,\"INCOMPLETO RECHAZAR\")","v":"INCOMPLETO RECHAZAR"},547]
[{"$f":"+'NO PROPIETARIOS adm actuales'!A12","v":"l NO PROPIETARIO"},{"$f":"+'NO PROPIETARIOS adm actuales'!B12","v":0},{"$f":"+'NO PROPIETARIOS adm actuales'!C12","v":0},{"$f":"+'NO PROPIETARIOS adm actuales'!D12","v":"NACIONALIDAD:"},{"$f":"IF('NO PROPIETARIOS adm actuales'!E12>0,'NO PROPIETARIOS adm actuales'!E12,\"INCOMPLETO RECHAZAR\")","v":"INCOMPLETO RECHAZAR"},548]
[{"$f":"+'NO PROPIETARIOS adm actuales'!A19","v":"l NO PROPIETARIO"},{"$f":"+'NO PROPIETARIOS adm actuales'!B19","v":0},{"$f":"+'NO PROPIETARIOS adm actuales'!C19","v":0},{"$f":"+'NO PROPIETARIOS adm actuales'!D19","v":""},{"$f":"IF('NO PROPIETARIOS adm actuales'!E19>0,'NO PROPIETARIOS adm actuales'!E19,\"INCOMPLETO RECHAZAR\")","v":"INCOMPLETO RECHAZAR"},549]
[{"$f":"+'NO PROPIETARIOS adm actuales'!A23","v":"l NO PROPIETARIO"},{"$f":"+'NO PROPIETARIOS adm actuales'!B23","v":0},{"$f":"+'NO PROPIETARIOS adm actuales'!C23","v":0},{"$f":"+'NO PROPIETARIOS adm actuales'!D23","v":"NOTA/OBSERVACIÓN -en mayúscula-:"},{"$f":"IF('NO PROPIETARIOS adm actuales'!E23>0,'NO PROPIETARIOS adm actuales'!E23,\"INCOMPLETO RECHAZAR\")","v":"INCOMPLETO RECHAZAR"},550]
[{"$f":"+'NO PROPIETARIOS adm actuales'!A13","v":"l NO PROPIETARIO"},{"$f":"+'NO PROPIETARIOS adm actuales'!B13","v":0},{"$f":"+'NO PROPIETARIOS adm actuales'!C13","v":0},{"$f":"+'NO PROPIETARIOS adm actuales'!D13","v":"PROFESIÓN/OFICIO:"},{"$f":"IF('NO PROPIETARIOS adm actuales'!E13>0,'NO PROPIETARIOS adm actuales'!E13,\"INCOMPLETO RECHAZAR\")","v":"INCOMPLETO RECHAZAR"},551]
[{"$f":"+'NO PROPIETARIOS adm actuales'!A34","v":"l NO PROPIETARIO"},{"$f":"+'NO PROPIETARIOS adm actuales'!B34","v":0},{"$f":"+'NO PROPIETARIOS adm actuales'!C34","v":0},{"$f":"+'NO PROPIETARIOS adm actuales'!D34","v":""},{"$f":"IF('NO PROPIETARIOS adm actuales'!E34>0,'NO PROPIETARIOS adm actuales'!E34,\"INCOMPLETO RECHAZAR\")","v":"INCOMPLETO RECHAZAR"},552]
[{"$f":"+'NO PROPIETARIOS adm actuales'!A31","v":"l NO PROPIETARIO"},{"$f":"+'NO PROPIETARIOS adm actuales'!B31","v":0},{"$f":"+'NO PROPIETARIOS adm actuales'!C31","v":0},{"$f":"+'NO PROPIETARIOS adm actuales'!D31","v":"CEL/TEL :"},{"$f":"IF('NO PROPIETARIOS adm actuales'!E31>0,'NO PROPIETARIOS adm actuales'!E31,\"INCOMPLETO RECHAZAR\")","v":"INCOMPLETO RECHAZAR"},553]
[{"$f":"+'NO PROPIETARIOS adm actuales'!A25","v":"l NO PROPIETARIO"},{"$f":"+'NO PROPIETARIOS adm actuales'!B25","v":0},{"$f":"+'NO PROPIETARIOS adm actuales'!C25","v":0},{"$f":"+'NO PROPIETARIOS adm actuales'!D25","v":"CUIT/CUIL –sin puntos ni barras-:"},{"$f":"IF('NO PROPIETARIOS adm actuales'!E25>0,'NO PROPIETARIOS adm actuales'!E25,\"INCOMPLETO RECHAZAR\")","v":"INCOMPLETO RECHAZAR"},554]
[{"$f":"+'NO PROPIETARIOS adm actuales'!A36","v":"l NO PROPIETARIO"},{"$f":"+'NO PROPIETARIOS adm actuales'!B36","v":0},{"$f":"+'NO PROPIETARIOS adm actuales'!C36","v":0},{"$f":"+'NO PROPIETARIOS adm actuales'!D36","v":""},{"$f":"IF('NO PROPIETARIOS adm actuales'!E36>0,'NO PROPIETARIOS adm actuales'!E36,\"INCOMPLETO RECHAZAR\")","v":"INCOMPLETO RECHAZAR"},555]
[{"$f":"+'NO PROPIETARIOS adm actuales'!A24","v":"l NO PROPIETARIO"},{"$f":"+'NO PROPIETARIOS adm actuales'!B24","v":0},{"$f":"+'NO PROPIETARIOS adm actuales'!C24","v":0},{"$f":"+'NO PROPIETARIOS adm actuales'!D24","v":"DOC. IDENTIDAD –sin puntos-:"},{"$f":"IF('NO PROPIETARIOS adm actuales'!E24>0,'NO PROPIETARIOS adm actuales'!E24,\"INCOMPLETO RECHAZAR\")","v":"INCOMPLETO RECHAZAR"},556]
[{"$f":"+'NO PROPIETARIOS adm actuales'!A30","v":"l NO PROPIETARIO"},{"$f":"+'NO PROPIETARIOS adm actuales'!B30","v":0},{"$f":"+'NO PROPIETARIOS adm actuales'!C30","v":0},{"$f":"+'NO PROPIETARIOS adm actuales'!D30","v":"DOMICILIO REAL:"},{"$f":"IF('NO PROPIETARIOS adm actuales'!E30>0,'NO PROPIETARIOS adm actuales'!E30,\"INCOMPLETO RECHAZAR\")","v":"INCOMPLETO RECHAZAR"},557]
[{"$f":"+'NO PROPIETARIOS adm actuales'!A33","v":"l NO PROPIETARIO"},{"$f":"+'NO PROPIETARIOS adm actuales'!B33","v":0},{"$f":"+'NO PROPIETARIOS adm actuales'!C33","v":0},{"$f":"+'NO PROPIETARIOS adm actuales'!D33","v":"ESTADO CIVIL:"},{"$f":"IF('NO PROPIETARIOS adm actuales'!E33>0,'NO PROPIETARIOS adm actuales'!E33,\"INCOMPLETO RECHAZAR\")","v":"INCOMPLETO RECHAZAR"},558]
[{"$f":"+'NO PROPIETARIOS adm actuales'!A26","v":"l NO PROPIETARIO"},{"$f":"+'NO PROPIETARIOS adm actuales'!B26","v":0},{"$f":"+'NO PROPIETARIOS adm actuales'!C26","v":0},{"$f":"+'NO PROPIETARIOS adm actuales'!D26","v":"FECHA DE NACIMIENTO –dd/mm/aa-:"},{"$f":"IF('NO PROPIETARIOS adm actuales'!E26>0,'NO PROPIETARIOS adm actuales'!E26,\"INCOMPLETO RECHAZAR\")","v":"INCOMPLETO RECHAZAR"},559]
[{"$f":"+'NO PROPIETARIOS adm actuales'!A27","v":"l NO PROPIETARIO"},{"$f":"+'NO PROPIETARIOS adm actuales'!B27","v":0},{"$f":"+'NO PROPIETARIOS adm actuales'!C27","v":0},{"$f":"+'NO PROPIETARIOS adm actuales'!D27","v":"LUGAR DE NACIMIENTO:"},{"$f":"IF('NO PROPIETARIOS adm actuales'!E27>0,'NO PROPIETARIOS adm actuales'!E27,\"INCOMPLETO RECHAZAR\")","v":"INCOMPLETO RECHAZAR"},560]
[{"$f":"+'NO PROPIETARIOS adm actuales'!A28","v":"l NO PROPIETARIO"},{"$f":"+'NO PROPIETARIOS adm actuales'!B28","v":0},{"$f":"+'NO PROPIETARIOS adm actuales'!C28","v":0},{"$f":"+'NO PROPIETARIOS adm actuales'!D28","v":"NACIONALIDAD:"},{"$f":"IF('NO PROPIETARIOS adm actuales'!E28>0,'NO PROPIETARIOS adm actuales'!E28,\"INCOMPLETO RECHAZAR\")","v":"INCOMPLETO RECHAZAR"},561]
[{"$f":"+'NO PROPIETARIOS adm actuales'!A35","v":"l NO PROPIETARIO"},{"$f":"+'NO PROPIETARIOS adm actuales'!B35","v":0},{"$f":"+'NO PROPIETARIOS adm actuales'!C35","v":0},{"$f":"+'NO PROPIETARIOS adm actuales'!D35","v":""},{"$f":"IF('NO PROPIETARIOS adm actuales'!E35>0,'NO PROPIETARIOS adm actuales'!E35,\"INCOMPLETO RECHAZAR\")","v":"INCOMPLETO RECHAZAR"},562]
[{"$f":"+'NO PROPIETARIOS adm actuales'!A39","v":"l NO PROPIETARIO"},{"$f":"+'NO PROPIETARIOS adm actuales'!B39","v":0},{"$f":"+'NO PROPIETARIOS adm actuales'!C39","v":0},{"$f":"+'NO PROPIETARIOS adm actuales'!D39","v":"NOTA/OBSERVACIÓN -en mayúscula-:"},{"$f":"IF('NO PROPIETARIOS adm actuales'!E39>0,'NO PROPIETARIOS adm actuales'!E39,\"INCOMPLETO RECHAZAR\")","v":"INCOMPLETO RECHAZAR"},563]
[{"$f":"+'NO PROPIETARIOS adm actuales'!A29","v":"l NO PROPIETARIO"},{"$f":"+'NO PROPIETARIOS adm actuales'!B29","v":0},{"$f":"+'NO PROPIETARIOS adm actuales'!C29","v":0},{"$f":"+'NO PROPIETARIOS adm actuales'!D29","v":"PROFESIÓN/OFICIO:"},{"$f":"IF('NO PROPIETARIOS adm actuales'!E29>0,'NO PROPIETARIOS adm actuales'!E29,\"INCOMPLETO RECHAZAR\")","v":"INCOMPLETO RECHAZAR"},564]
[{"$f":"+'NO PROPIETARIOS adm actuales'!A50","v":"l NO PROPIETARIO"},{"$f":"+'NO PROPIETARIOS adm actuales'!B50","v":0},{"$f":"+'NO PROPIETARIOS adm actuales'!C50","v":0},{"$f":"+'NO PROPIETARIOS adm actuales'!D50","v":""},{"$f":"IF('NO PROPIETARIOS adm actuales'!E50>0,'NO PROPIETARIOS adm actuales'!E50,\"INCOMPLETO RECHAZAR\")","v":"INCOMPLETO RECHAZAR"},565]
[{"$f":"+'NO PROPIETARIOS adm actuales'!A47","v":"l NO PROPIETARIO"},{"$f":"+'NO PROPIETARIOS adm actuales'!B47","v":0},{"$f":"+'NO PROPIETARIOS adm actuales'!C47","v":0},{"$f":"+'NO PROPIETARIOS adm actuales'!D47","v":"CEL/TEL :"},{"$f":"IF('NO PROPIETARIOS adm actuales'!E47>0,'NO PROPIETARIOS adm actuales'!E47,\"INCOMPLETO RECHAZAR\")","v":"INCOMPLETO RECHAZAR"},566]
[{"$f":"+'NO PROPIETARIOS adm actuales'!A41","v":"l NO PROPIETARIO"},{"$f":"+'NO PROPIETARIOS adm actuales'!B41","v":0},{"$f":"+'NO PROPIETARIOS adm actuales'!C41","v":0},{"$f":"+'NO PROPIETARIOS adm actuales'!D41","v":"CUIT/CUIL –sin puntos ni barras-:"},{"$f":"IF('NO PROPIETARIOS adm actuales'!E41>0,'NO PROPIETARIOS adm actuales'!E41,\"INCOMPLETO RECHAZAR\")","v":"INCOMPLETO RECHAZAR"},567]
[{"$f":"+'NO PROPIETARIOS adm actuales'!A52","v":"l NO PROPIETARIO"},{"$f":"+'NO PROPIETARIOS adm actuales'!B52","v":0},{"$f":"+'NO PROPIETARIOS adm actuales'!C52","v":0},{"$f":"+'NO PROPIETARIOS adm actuales'!D52","v":""},{"$f":"IF('NO PROPIETARIOS adm actuales'!E52>0,'NO PROPIETARIOS adm actuales'!E52,\"INCOMPLETO RECHAZAR\")","v":"INCOMPLETO RECHAZAR"},568]
[{"$f":"+'NO PROPIETARIOS adm actuales'!A40","v":"l NO PROPIETARIO"},{"$f":"+'NO PROPIETARIOS adm actuales'!B40","v":0},{"$f":"+'NO PROPIETARIOS adm actuales'!C40","v":0},{"$f":"+'NO PROPIETARIOS adm actuales'!D40","v":"DOC. IDENTIDAD –sin puntos-:"},{"$f":"IF('NO PROPIETARIOS adm actuales'!E40>0,'NO PROPIETARIOS adm actuales'!E40,\"INCOMPLETO RECHAZAR\")","v":"INCOMPLETO RECHAZAR"},569]
[{"$f":"+'NO PROPIETARIOS adm actuales'!A46","v":"l NO PROPIETARIO"},{"$f":"+'NO PROPIETARIOS adm actuales'!B46","v":0},{"$f":"+'NO PROPIETARIOS adm actuales'!C46","v":0},{"$f":"+'NO PROPIETARIOS adm actuales'!D46","v":"DOMICILIO REAL:"},{"$f":"IF('NO PROPIETARIOS adm actuales'!E46>0,'NO PROPIETARIOS adm actuales'!E46,\"INCOMPLETO RECHAZAR\")","v":"INCOMPLETO RECHAZAR"},570]
[{"$f":"+'NO PROPIETARIOS adm actuales'!A49","v":"l NO PROPIETARIO"},{"$f":"+'NO PROPIETARIOS adm actuales'!B49","v":0},{"$f":"+'NO PROPIETARIOS adm actuales'!C49","v":0},{"$f":"+'NO PROPIETARIOS adm actuales'!D49","v":"ESTADO CIVIL:"},{"$f":"IF('NO PROPIETARIOS adm actuales'!E49>0,'NO PROPIETARIOS adm actuales'!E49,\"INCOMPLETO RECHAZAR\")","v":"INCOMPLETO RECHAZAR"},571]
[{"$f":"+'NO PROPIETARIOS adm actuales'!A42","v":"l NO PROPIETARIO"},{"$f":"+'NO PROPIETARIOS adm actuales'!B42","v":0},{"$f":"+'NO PROPIETARIOS adm actuales'!C42","v":0},{"$f":"+'NO PROPIETARIOS adm actuales'!D42","v":"FECHA DE NACIMIENTO –dd/mm/aa-:"},{"$f":"IF('NO PROPIETARIOS adm actuales'!E42>0,'NO PROPIETARIOS adm actuales'!E42,\"INCOMPLETO RECHAZAR\")","v":"INCOMPLETO RECHAZAR"},572]
[{"$f":"+'NO PROPIETARIOS adm actuales'!A43","v":"l NO PROPIETARIO"},{"$f":"+'NO PROPIETARIOS adm actuales'!B43","v":0},{"$f":"+'NO PROPIETARIOS adm actuales'!C43","v":0},{"$f":"+'NO PROPIETARIOS adm actuales'!D43","v":"LUGAR DE NACIMIENTO:"},{"$f":"IF('NO PROPIETARIOS adm actuales'!E43>0,'NO PROPIETARIOS adm actuales'!E43,\"INCOMPLETO RECHAZAR\")","v":"INCOMPLETO RECHAZAR"},573]
[{"$f":"+'NO PROPIETARIOS adm actuales'!A44","v":"l NO PROPIETARIO"},{"$f":"+'NO PROPIETARIOS adm actuales'!B44","v":0},{"$f":"+'NO PROPIETARIOS adm actuales'!C44","v":0},{"$f":"+'NO PROPIETARIOS adm actuales'!D44","v":"NACIONALIDAD:"},{"$f":"IF('NO PROPIETARIOS adm actuales'!E44>0,'NO PROPIETARIOS adm actuales'!E44,\"INCOMPLETO RECHAZAR\")","v":"INCOMPLETO RECHAZAR"},574]
[{"$f":"+'NO PROPIETARIOS adm actuales'!A51","v":"l NO PROPIETARIO"},{"$f":"+'NO PROPIETARIOS adm actuales'!B51","v":0},{"$f":"+'NO PROPIETARIOS adm actuales'!C51","v":0},{"$f":"+'NO PROPIETARIOS adm actuales'!D51","v":""},{"$f":"IF('NO PROPIETARIOS adm actuales'!E51>0,'NO PROPIETARIOS adm actuales'!E51,\"INCOMPLETO RECHAZAR\")","v":"INCOMPLETO RECHAZAR"},575]
[{"$f":"+'NO PROPIETARIOS adm actuales'!A55","v":"l NO PROPIETARIO"},{"$f":"+'NO PROPIETARIOS adm actuales'!B55","v":0},{"$f":"+'NO PROPIETARIOS adm actuales'!C55","v":0},{"$f":"+'NO PROPIETARIOS adm actuales'!D55","v":"NOTA/OBSERVACIÓN -en mayúscula-:"},{"$f":"IF('NO PROPIETARIOS adm actuales'!E55>0,'NO PROPIETARIOS adm actuales'!E55,\"INCOMPLETO RECHAZAR\")","v":"INCOMPLETO RECHAZAR"},576]
[{"$f":"+'NO PROPIETARIOS adm actuales'!A45","v":"l NO PROPIETARIO"},{"$f":"+'NO PROPIETARIOS adm actuales'!B45","v":0},{"$f":"+'NO PROPIETARIOS adm actuales'!C45","v":0},{"$f":"+'NO PROPIETARIOS adm actuales'!D45","v":"PROFESIÓN/OFICIO:"},{"$f":"IF('NO PROPIETARIOS adm actuales'!E45>0,'NO PROPIETARIOS adm actuales'!E45,\"INCOMPLETO RECHAZAR\")","v":"INCOMPLETO RECHAZAR"},577]
[{"$f":"+'NO PROPIETARIOS adm actuales'!A66","v":"l NO PROPIETARIO"},{"$f":"+'NO PROPIETARIOS adm actuales'!B66","v":0},{"$f":"+'NO PROPIETARIOS adm actuales'!C66","v":0},{"$f":"+'NO PROPIETARIOS adm actuales'!D66","v":""},{"$f":"IF('NO PROPIETARIOS adm actuales'!E66>0,'NO PROPIETARIOS adm actuales'!E66,\"INCOMPLETO RECHAZAR\")","v":"INCOMPLETO RECHAZAR"},578]
[{"$f":"+'NO PROPIETARIOS adm actuales'!A63","v":"l NO PROPIETARIO"},{"$f":"+'NO PROPIETARIOS adm actuales'!B63","v":0},{"$f":"+'NO PROPIETARIOS adm actuales'!C63","v":0},{"$f":"+'NO PROPIETARIOS adm actuales'!D63","v":"CEL/TEL :"},{"$f":"IF('NO PROPIETARIOS adm actuales'!E63>0,'NO PROPIETARIOS adm actuales'!E63,\"INCOMPLETO RECHAZAR\")","v":"INCOMPLETO RECHAZAR"},579]
[{"$f":"+'NO PROPIETARIOS adm actuales'!A57","v":"l NO PROPIETARIO"},{"$f":"+'NO PROPIETARIOS adm actuales'!B57","v":0},{"$f":"+'NO PROPIETARIOS adm actuales'!C57","v":0},{"$f":"+'NO PROPIETARIOS adm actuales'!D57","v":"CUIT/CUIL –sin puntos ni barras-:"},{"$f":"IF('NO PROPIETARIOS adm actuales'!E57>0,'NO PROPIETARIOS adm actuales'!E57,\"INCOMPLETO RECHAZAR\")","v":"INCOMPLETO RECHAZAR"},580]
[{"$f":"+'NO PROPIETARIOS adm actuales'!A68","v":"l NO PROPIETARIO"},{"$f":"+'NO PROPIETARIOS adm actuales'!B68","v":0},{"$f":"+'NO PROPIETARIOS adm actuales'!C68","v":0},{"$f":"+'NO PROPIETARIOS adm actuales'!D68","v":""},{"$f":"IF('NO PROPIETARIOS adm actuales'!E68>0,'NO PROPIETARIOS adm actuales'!E68,\"INCOMPLETO RECHAZAR\")","v":"INCOMPLETO RECHAZAR"},581]
[{"$f":"+'NO PROPIETARIOS adm actuales'!A56","v":"l NO PROPIETARIO"},{"$f":"+'NO PROPIETARIOS adm actuales'!B56","v":0},{"$f":"+'NO PROPIETARIOS adm actuales'!C56","v":0},{"$f":"+'NO PROPIETARIOS adm actuales'!D56","v":"DOC. IDENTIDAD –sin puntos-:"},{"$f":"IF('NO PROPIETARIOS adm actuales'!E56>0,'NO PROPIETARIOS adm actuales'!E56,\"INCOMPLETO RECHAZAR\")","v":"INCOMPLETO RECHAZAR"},582]
[{"$f":"+'NO PROPIETARIOS adm actuales'!A62","v":"l NO PROPIETARIO"},{"$f":"+'NO PROPIETARIOS adm actuales'!B62","v":0},{"$f":"+'NO PROPIETARIOS adm actuales'!C62","v":0},{"$f":"+'NO PROPIETARIOS adm actuales'!D62","v":"DOMICILIO REAL:"},{"$f":"IF('NO PROPIETARIOS adm actuales'!E62>0,'NO PROPIETARIOS adm actuales'!E62,\"INCOMPLETO RECHAZAR\")","v":"INCOMPLETO RECHAZAR"},583]
[{"$f":"+'NO PROPIETARIOS adm actuales'!A65","v":"l NO PROPIETARIO"},{"$f":"+'NO PROPIETARIOS adm actuales'!B65","v":0},{"$f":"+'NO PROPIETARIOS adm actuales'!C65","v":0},{"$f":"+'NO PROPIETARIOS adm actuales'!D65","v":"ESTADO CIVIL:"},{"$f":"IF('NO PROPIETARIOS adm actuales'!E65>0,'NO PROPIETARIOS adm actuales'!E65,\"INCOMPLETO RECHAZAR\")","v":"INCOMPLETO RECHAZAR"},584]
[{"$f":"+'NO PROPIETARIOS adm actuales'!A58","v":"l NO PROPIETARIO"},{"$f":"+'NO PROPIETARIOS adm actuales'!B58","v":0},{"$f":"+'NO PROPIETARIOS adm actuales'!C58","v":0},{"$f":"+'NO PROPIETARIOS adm actuales'!D58","v":"FECHA DE NACIMIENTO –dd/mm/aa-:"},{"$f":"IF('NO PROPIETARIOS adm actuales'!E58>0,'NO PROPIETARIOS adm actuales'!E58,\"INCOMPLETO RECHAZAR\")","v":"INCOMPLETO RECHAZAR"},585]
[{"$f":"+'NO PROPIETARIOS adm actuales'!A59","v":"l NO PROPIETARIO"},{"$f":"+'NO PROPIETARIOS adm actuales'!B59","v":0},{"$f":"+'NO PROPIETARIOS adm actuales'!C59","v":0},{"$f":"+'NO PROPIETARIOS adm actuales'!D59","v":"LUGAR DE NACIMIENTO:"},{"$f":"IF('NO PROPIETARIOS adm actuales'!E59>0,'NO PROPIETARIOS adm actuales'!E59,\"INCOMPLETO RECHAZAR\")","v":"INCOMPLETO RECHAZAR"},586]
[{"$f":"+'NO PROPIETARIOS adm actuales'!A60","v":"l NO PROPIETARIO"},{"$f":"+'NO PROPIETARIOS adm actuales'!B60","v":0},{"$f":"+'NO PROPIETARIOS adm actuales'!C60","v":0},{"$f":"+'NO PROPIETARIOS adm actuales'!D60","v":"NACIONALIDAD:"},{"$f":"IF('NO PROPIETARIOS adm actuales'!E60>0,'NO PROPIETARIOS adm actuales'!E60,\"INCOMPLETO RECHAZAR\")","v":"INCOMPLETO RECHAZAR"},587]
[{"$f":"+'NO PROPIETARIOS adm actuales'!A67","v":"l NO PROPIETARIO"},{"$f":"+'NO PROPIETARIOS adm actuales'!B67","v":0},{"$f":"+'NO PROPIETARIOS adm actuales'!C67","v":0},{"$f":"+'NO PROPIETARIOS adm actuales'!D67","v":""},{"$f":"IF('NO PROPIETARIOS adm actuales'!E67>0,'NO PROPIETARIOS adm actuales'!E67,\"INCOMPLETO RECHAZAR\")","v":"INCOMPLETO RECHAZAR"},588]
[{"$f":"+'NO PROPIETARIOS adm actuales'!A71","v":"l NO PROPIETARIO"},{"$f":"+'NO PROPIETARIOS adm actuales'!B71","v":0},{"$f":"+'NO PROPIETARIOS adm actuales'!C71","v":0},{"$f":"+'NO PROPIETARIOS adm actuales'!D71","v":"NOTA/OBSERVACIÓN -en mayúscula-:"},{"$f":"IF('NO PROPIETARIOS adm actuales'!E71>0,'NO PROPIETARIOS adm actuales'!E71,\"INCOMPLETO RECHAZAR\")","v":"INCOMPLETO RECHAZAR"},589]
[{"$f":"+'NO PROPIETARIOS adm actuales'!A61","v":"l NO PROPIETARIO"},{"$f":"+'NO PROPIETARIOS adm actuales'!B61","v":0},{"$f":"+'NO PROPIETARIOS adm actuales'!C61","v":0},{"$f":"+'NO PROPIETARIOS adm actuales'!D61","v":"PROFESIÓN/OFICIO:"},{"$f":"IF('NO PROPIETARIOS adm actuales'!E61>0,'NO PROPIETARIOS adm actuales'!E61,\"INCOMPLETO RECHAZAR\")","v":"INCOMPLETO RECHAZAR"},590]
[{"$f":"+'NO PROPIETARIOS adm actuales'!A82","v":"l NO PROPIETARIO"},{"$f":"+'NO PROPIETARIOS adm actuales'!B82","v":0},{"$f":"+'NO PROPIETARIOS adm actuales'!C82","v":0},{"$f":"+'NO PROPIETARIOS adm actuales'!D82","v":""},{"$f":"IF('NO PROPIETARIOS adm actuales'!E82>0,'NO PROPIETARIOS adm actuales'!E82,\"INCOMPLETO RECHAZAR\")","v":"INCOMPLETO RECHAZAR"},591]
[{"$f":"+'NO PROPIETARIOS adm actuales'!A79","v":"l NO PROPIETARIO"},{"$f":"+'NO PROPIETARIOS adm actuales'!B79","v":0},{"$f":"+'NO PROPIETARIOS adm actuales'!C79","v":0},{"$f":"+'NO PROPIETARIOS adm actuales'!D79","v":"CEL/TEL :"},{"$f":"IF('NO PROPIETARIOS adm actuales'!E79>0,'NO PROPIETARIOS adm actuales'!E79,\"INCOMPLETO RECHAZAR\")","v":"INCOMPLETO RECHAZAR"},592]
[{"$f":"+'NO PROPIETARIOS adm actuales'!A73","v":"l NO PROPIETARIO"},{"$f":"+'NO PROPIETARIOS adm actuales'!B73","v":0},{"$f":"+'NO PROPIETARIOS adm actuales'!C73","v":0},{"$f":"+'NO PROPIETARIOS adm actuales'!D73","v":"CUIT/CUIL –sin puntos ni barras-:"},{"$f":"IF('NO PROPIETARIOS adm actuales'!E73>0,'NO PROPIETARIOS adm actuales'!E73,\"INCOMPLETO RECHAZAR\")","v":"INCOMPLETO RECHAZAR"},593]
[{"$f":"+'NO PROPIETARIOS adm actuales'!A84","v":"l NO PROPIETARIO"},{"$f":"+'NO PROPIETARIOS adm actuales'!B84","v":0},{"$f":"+'NO PROPIETARIOS adm actuales'!C84","v":0},{"$f":"+'NO PROPIETARIOS adm actuales'!D84","v":""},{"$f":"IF('NO PROPIETARIOS adm actuales'!E84>0,'NO PROPIETARIOS adm actuales'!E84,\"INCOMPLETO RECHAZAR\")","v":"INCOMPLETO RECHAZAR"},594]
[{"$f":"+'NO PROPIETARIOS adm actuales'!A72","v":"l NO PROPIETARIO"},{"$f":"+'NO PROPIETARIOS adm actuales'!B72","v":0},{"$f":"+'NO PROPIETARIOS adm actuales'!C72","v":0},{"$f":"+'NO PROPIETARIOS adm actuales'!D72","v":"DOC. IDENTIDAD –sin puntos-:"},{"$f":"IF('NO PROPIETARIOS adm actuales'!E72>0,'NO PROPIETARIOS adm actuales'!E72,\"INCOMPLETO RECHAZAR\")","v":"INCOMPLETO RECHAZAR"},595]
[{"$f":"+'NO PROPIETARIOS adm actuales'!A78","v":"l NO PROPIETARIO"},{"$f":"+'NO PROPIETARIOS adm actuales'!B78","v":0},{"$f":"+'NO PROPIETARIOS adm actuales'!C78","v":0},{"$f":"+'NO PROPIETARIOS adm actuales'!D78","v":"DOMICILIO REAL:"},{"$f":"IF('NO PROPIETARIOS adm actuales'!E78>0,'NO PROPIETARIOS adm actuales'!E78,\"INCOMPLETO RECHAZAR\")","v":"INCOMPLETO RECHAZAR"},596]
[{"$f":"+'NO PROPIETARIOS adm actuales'!A81","v":"l NO PROPIETARIO"},{"$f":"+'NO PROPIETARIOS adm actuales'!B81","v":0},{"$f":"+'NO PROPIETARIOS adm actuales'!C81","v":0},{"$f":"+'NO PROPIETARIOS adm actuales'!D81","v":"ESTADO CIVIL:"},{"$f":"IF('NO PROPIETARIOS adm actuales'!E81>0,'NO PROPIETARIOS adm actuales'!E81,\"INCOMPLETO RECHAZAR\")","v":"INCOMPLETO RECHAZAR"},597]
[{"$f":"+'NO PROPIETARIOS adm actuales'!A74","v":"l NO PROPIETARIO"},{"$f":"+'NO PROPIETARIOS adm actuales'!B74","v":0},{"$f":"+'NO PROPIETARIOS adm actuales'!C74","v":0},{"$f":"+'NO PROPIETARIOS adm actuales'!D74","v":"FECHA DE NACIMIENTO –dd/mm/aa-:"},{"$f":"IF('NO PROPIETARIOS adm actuales'!E74>0,'NO PROPIETARIOS adm actuales'!E74,\"INCOMPLETO RECHAZAR\")","v":"INCOMPLETO RECHAZAR"},598]
[{"$f":"+'NO PROPIETARIOS adm actuales'!A75","v":"l NO PROPIETARIO"},{"$f":"+'NO PROPIETARIOS adm actuales'!B75","v":0},{"$f":"+'NO PROPIETARIOS adm actuales'!C75","v":0},{"$f":"+'NO PROPIETARIOS adm actuales'!D75","v":"LUGAR DE NACIMIENTO:"},{"$f":"IF('NO PROPIETARIOS adm actuales'!E75>0,'NO PROPIETARIOS adm actuales'!E75,\"INCOMPLETO RECHAZAR\")","v":"INCOMPLETO RECHAZAR"},599]
[{"$f":"+'NO PROPIETARIOS adm actuales'!A76","v":"l NO PROPIETARIO"},{"$f":"+'NO PROPIETARIOS adm actuales'!B76","v":0},{"$f":"+'NO PROPIETARIOS adm actuales'!C76","v":0},{"$f":"+'NO PROPIETARIOS adm actuales'!D76","v":"NACIONALIDAD:"},{"$f":"IF('NO PROPIETARIOS adm actuales'!E76>0,'NO PROPIETARIOS adm actuales'!E76,\"INCOMPLETO RECHAZAR\")","v":"INCOMPLETO RECHAZAR"},600]
[{"$f":"+'NO PROPIETARIOS adm actuales'!A83","v":"l NO PROPIETARIO"},{"$f":"+'NO PROPIETARIOS adm actuales'!B83","v":0},{"$f":"+'NO PROPIETARIOS adm actuales'!C83","v":0},{"$f":"+'NO PROPIETARIOS adm actuales'!D83","v":""},{"$f":"IF('NO PROPIETARIOS adm actuales'!E83>0,'NO PROPIETARIOS adm actuales'!E83,\"INCOMPLETO RECHAZAR\")","v":"INCOMPLETO RECHAZAR"},601]
[{"$f":"+'NO PROPIETARIOS adm actuales'!A87","v":"l NO PROPIETARIO"},{"$f":"+'NO PROPIETARIOS adm actuales'!B87","v":0},{"$f":"+'NO PROPIETARIOS adm actuales'!C87","v":0},{"$f":"+'NO PROPIETARIOS adm actuales'!D87","v":"NOTA/OBSERVACIÓN -en mayúscula-:"},{"$f":"IF('NO PROPIETARIOS adm actuales'!E87>0,'NO PROPIETARIOS adm actuales'!E87,\"INCOMPLETO RECHAZAR\")","v":"INCOMPLETO RECHAZAR"},602]
[{"$f":"+'NO PROPIETARIOS adm actuales'!A77","v":"l NO PROPIETARIO"},{"$f":"+'NO PROPIETARIOS adm actuales'!B77","v":0},{"$f":"+'NO PROPIETARIOS adm actuales'!C77","v":0},{"$f":"+'NO PROPIETARIOS adm actuales'!D77","v":"PROFESIÓN/OFICIO:"},{"$f":"IF('NO PROPIETARIOS adm actuales'!E77>0,'NO PROPIETARIOS adm actuales'!E77,\"INCOMPLETO RECHAZAR\")","v":"INCOMPLETO RECHAZAR"},603]
[{"$f":"+'NO PROPIETARIOS adm actuales'!A98","v":"l NO PROPIETARIO"},{"$f":"+'NO PROPIETARIOS adm actuales'!B98","v":0},{"$f":"+'NO PROPIETARIOS adm actuales'!C98","v":0},{"$f":"+'NO PROPIETARIOS adm actuales'!D98","v":""},{"$f":"IF('NO PROPIETARIOS adm actuales'!E98>0,'NO PROPIETARIOS adm actuales'!E98,\"INCOMPLETO RECHAZAR\")","v":"INCOMPLETO RECHAZAR"},604]
[{"$f":"+'NO PROPIETARIOS adm actuales'!A95","v":"l NO PROPIETARIO"},{"$f":"+'NO PROPIETARIOS adm actuales'!B95","v":0},{"$f":"+'NO PROPIETARIOS adm actuales'!C95","v":0},{"$f":"+'NO PROPIETARIOS adm actuales'!D95","v":"CEL/TEL :"},{"$f":"IF('NO PROPIETARIOS adm actuales'!E95>0,'NO PROPIETARIOS adm actuales'!E95,\"INCOMPLETO RECHAZAR\")","v":"INCOMPLETO RECHAZAR"},605]
[{"$f":"+'NO PROPIETARIOS adm actuales'!A89","v":"l NO PROPIETARIO"},{"$f":"+'NO PROPIETARIOS adm actuales'!B89","v":0},{"$f":"+'NO PROPIETARIOS adm actuales'!C89","v":0},{"$f":"+'NO PROPIETARIOS adm actuales'!D89","v":"CUIT/CUIL –sin puntos ni barras-:"},{"$f":"IF('NO PROPIETARIOS adm actuales'!E89>0,'NO PROPIETARIOS adm actuales'!E89,\"INCOMPLETO RECHAZAR\")","v":"INCOMPLETO RECHAZAR"},606]
[{"$f":"+'NO PROPIETARIOS adm actuales'!A100","v":"l NO PROPIETARIO"},{"$f":"+'NO PROPIETARIOS adm actuales'!B100","v":0},{"$f":"+'NO PROPIETARIOS adm actuales'!C100","v":0},{"$f":"+'NO PROPIETARIOS adm actuales'!D100","v":""},{"$f":"IF('NO PROPIETARIOS adm actuales'!E100>0,'NO PROPIETARIOS adm actuales'!E100,\"INCOMPLETO RECHAZAR\")","v":"INCOMPLETO RECHAZAR"},607]
[{"$f":"+'NO PROPIETARIOS adm actuales'!A88","v":"l NO PROPIETARIO"},{"$f":"+'NO PROPIETARIOS adm actuales'!B88","v":0},{"$f":"+'NO PROPIETARIOS adm actuales'!C88","v":0},{"$f":"+'NO PROPIETARIOS adm actuales'!D88","v":"DOC. IDENTIDAD –sin puntos-:"},{"$f":"IF('NO PROPIETARIOS adm actuales'!E88>0,'NO PROPIETARIOS adm actuales'!E88,\"INCOMPLETO RECHAZAR\")","v":"INCOMPLETO RECHAZAR"},608]
[{"$f":"+'NO PROPIETARIOS adm actuales'!A94","v":"l NO PROPIETARIO"},{"$f":"+'NO PROPIETARIOS adm actuales'!B94","v":0},{"$f":"+'NO PROPIETARIOS adm actuales'!C94","v":0},{"$f":"+'NO PROPIETARIOS adm actuales'!D94","v":"DOMICILIO REAL:"},{"$f":"IF('NO PROPIETARIOS adm actuales'!E94>0,'NO PROPIETARIOS adm actuales'!E94,\"INCOMPLETO RECHAZAR\")","v":"INCOMPLETO RECHAZAR"},609]
[{"$f":"+'NO PROPIETARIOS adm actuales'!A97","v":"l NO PROPIETARIO"},{"$f":"+'NO PROPIETARIOS adm actuales'!B97","v":0},{"$f":"+'NO PROPIETARIOS adm actuales'!C97","v":0},{"$f":"+'NO PROPIETARIOS adm actuales'!D97","v":"ESTADO CIVIL:"},{"$f":"IF('NO PROPIETARIOS adm actuales'!E97>0,'NO PROPIETARIOS adm actuales'!E97,\"INCOMPLETO RECHAZAR\")","v":"INCOMPLETO RECHAZAR"},610]
[{"$f":"+'NO PROPIETARIOS adm actuales'!A90","v":"l NO PROPIETARIO"},{"$f":"+'NO PROPIETARIOS adm actuales'!B90","v":0},{"$f":"+'NO PROPIETARIOS adm actuales'!C90","v":0},{"$f":"+'NO PROPIETARIOS adm actuales'!D90","v":"FECHA DE NACIMIENTO –dd/mm/aa-:"},{"$f":"IF('NO PROPIETARIOS adm actuales'!E90>0,'NO PROPIETARIOS adm actuales'!E90,\"INCOMPLETO RECHAZAR\")","v":"INCOMPLETO RECHAZAR"},611]
[{"$f":"+'NO PROPIETARIOS adm actuales'!A91","v":"l NO PROPIETARIO"},{"$f":"+'NO PROPIETARIOS adm actuales'!B91","v":0},{"$f":"+'NO PROPIETARIOS adm actuales'!C91","v":0},{"$f":"+'NO PROPIETARIOS adm actuales'!D91","v":"LUGAR DE NACIMIENTO:"},{"$f":"IF('NO PROPIETARIOS adm actuales'!E91>0,'NO PROPIETARIOS adm actuales'!E91,\"INCOMPLETO RECHAZAR\")","v":"INCOMPLETO RECHAZAR"},612]
[{"$f":"+'NO PROPIETARIOS adm actuales'!A92","v":"l NO PROPIETARIO"},{"$f":"+'NO PROPIETARIOS adm actuales'!B92","v":0},{"$f":"+'NO PROPIETARIOS adm actuales'!C92","v":0},{"$f":"+'NO PROPIETARIOS adm actuales'!D92","v":"NACIONALIDAD:"},{"$f":"IF('NO PROPIETARIOS adm actuales'!E92>0,'NO PROPIETARIOS adm actuales'!E92,\"INCOMPLETO RECHAZAR\")","v":"INCOMPLETO RECHAZAR"},613]
[{"$f":"+'NO PROPIETARIOS adm actuales'!A99","v":"l NO PROPIETARIO"},{"$f":"+'NO PROPIETARIOS adm actuales'!B99","v":0},{"$f":"+'NO PROPIETARIOS adm actuales'!C99","v":0},{"$f":"+'NO PROPIETARIOS adm actuales'!D99","v":""},{"$f":"IF('NO PROPIETARIOS adm actuales'!E99>0,'NO PROPIETARIOS adm actuales'!E99,\"INCOMPLETO RECHAZAR\")","v":"INCOMPLETO RECHAZAR"},614]
[{"$f":"+'NO PROPIETARIOS adm actuales'!A103","v":"l NO PROPIETARIO"},{"$f":"+'NO PROPIETARIOS adm actuales'!B103","v":0},{"$f":"+'NO PROPIETARIOS adm actuales'!C103","v":0},{"$f":"+'NO PROPIETARIOS adm actuales'!D103","v":"NOTA/OBSERVACIÓN -en mayúscula-:"},{"$f":"IF('NO PROPIETARIOS adm actuales'!E103>0,'NO PROPIETARIOS adm actuales'!E103,\"INCOMPLETO RECHAZAR\")","v":"INCOMPLETO RECHAZAR"},615]
[{"$f":"+'NO PROPIETARIOS adm actuales'!A93","v":"l NO PROPIETARIO"},{"$f":"+'NO PROPIETARIOS adm actuales'!B93","v":0},{"$f":"+'NO PROPIETARIOS adm actuales'!C93","v":0},{"$f":"+'NO PROPIETARIOS adm actuales'!D93","v":"PROFESIÓN/OFICIO:"},{"$f":"IF('NO PROPIETARIOS adm actuales'!E93>0,'NO PROPIETARIOS adm actuales'!E93,\"INCOMPLETO RECHAZAR\")","v":"INCOMPLETO RECHAZAR"},616]
[{"$f":"+'NO PROPIETARIOS adm actuales'!A114","v":"l NO PROPIETARIO"},{"$f":"+'NO PROPIETARIOS adm actuales'!B114","v":0},{"$f":"+'NO PROPIETARIOS adm actuales'!C114","v":0},{"$f":"+'NO PROPIETARIOS adm actuales'!D114","v":""},{"$f":"IF('NO PROPIETARIOS adm actuales'!E114>0,'NO PROPIETARIOS adm actuales'!E114,\"INCOMPLETO RECHAZAR\")","v":"INCOMPLETO RECHAZAR"},617]
[{"$f":"+'NO PROPIETARIOS adm actuales'!A111","v":"l NO PROPIETARIO"},{"$f":"+'NO PROPIETARIOS adm actuales'!B111","v":0},{"$f":"+'NO PROPIETARIOS adm actuales'!C111","v":0},{"$f":"+'NO PROPIETARIOS adm actuales'!D111","v":"CEL/TEL :"},{"$f":"IF('NO PROPIETARIOS adm actuales'!E111>0,'NO PROPIETARIOS adm actuales'!E111,\"INCOMPLETO RECHAZAR\")","v":"INCOMPLETO RECHAZAR"},618]
[{"$f":"+'NO PROPIETARIOS adm actuales'!A105","v":"l NO PROPIETARIO"},{"$f":"+'NO PROPIETARIOS adm actuales'!B105","v":0},{"$f":"+'NO PROPIETARIOS adm actuales'!C105","v":0},{"$f":"+'NO PROPIETARIOS adm actuales'!D105","v":"CUIT/CUIL –sin puntos ni barras-:"},{"$f":"IF('NO PROPIETARIOS adm actuales'!E105>0,'NO PROPIETARIOS adm actuales'!E105,\"INCOMPLETO RECHAZAR\")","v":"INCOMPLETO RECHAZAR"},619]
[{"$f":"+'NO PROPIETARIOS adm actuales'!A116","v":"l NO PROPIETARIO"},{"$f":"+'NO PROPIETARIOS adm actuales'!B116","v":0},{"$f":"+'NO PROPIETARIOS adm actuales'!C116","v":0},{"$f":"+'NO PROPIETARIOS adm actuales'!D116","v":""},{"$f":"IF('NO PROPIETARIOS adm actuales'!E116>0,'NO PROPIETARIOS adm actuales'!E116,\"INCOMPLETO RECHAZAR\")","v":"INCOMPLETO RECHAZAR"},620]
[{"$f":"+'NO PROPIETARIOS adm actuales'!A104","v":"l NO PROPIETARIO"},{"$f":"+'NO PROPIETARIOS adm actuales'!B104","v":0},{"$f":"+'NO PROPIETARIOS adm actuales'!C104","v":0},{"$f":"+'NO PROPIETARIOS adm actuales'!D104","v":"DOC. IDENTIDAD –sin puntos-:"},{"$f":"IF('NO PROPIETARIOS adm actuales'!E104>0,'NO PROPIETARIOS adm actuales'!E104,\"INCOMPLETO RECHAZAR\")","v":"INCOMPLETO RECHAZAR"},621]
[{"$f":"+'NO PROPIETARIOS adm actuales'!A110","v":"l NO PROPIETARIO"},{"$f":"+'NO PROPIETARIOS adm actuales'!B110","v":0},{"$f":"+'NO PROPIETARIOS adm actuales'!C110","v":0},{"$f":"+'NO PROPIETARIOS adm actuales'!D110","v":"DOMICILIO REAL:"},{"$f":"IF('NO PROPIETARIOS adm actuales'!E110>0,'NO PROPIETARIOS adm actuales'!E110,\"INCOMPLETO RECHAZAR\")","v":"INCOMPLETO RECHAZAR"},622]
[{"$f":"+'NO PROPIETARIOS adm actuales'!A113","v":"l NO PROPIETARIO"},{"$f":"+'NO PROPIETARIOS adm actuales'!B113","v":0},{"$f":"+'NO PROPIETARIOS adm actuales'!C113","v":0},{"$f":"+'NO PROPIETARIOS adm actuales'!D113","v":"ESTADO CIVIL:"},{"$f":"IF('NO PROPIETARIOS adm actuales'!E113>0,'NO PROPIETARIOS adm actuales'!E113,\"INCOMPLETO RECHAZAR\")","v":"INCOMPLETO RECHAZAR"},623]
[{"$f":"+'NO PROPIETARIOS adm actuales'!A106","v":"l NO PROPIETARIO"},{"$f":"+'NO PROPIETARIOS adm actuales'!B106","v":0},{"$f":"+'NO PROPIETARIOS adm actuales'!C106","v":0},{"$f":"+'NO PROPIETARIOS adm actuales'!D106","v":"FECHA DE NACIMIENTO –dd/mm/aa-:"},{"$f":"IF('NO PROPIETARIOS adm actuales'!E106>0,'NO PROPIETARIOS adm actuales'!E106,\"INCOMPLETO RECHAZAR\")","v":"INCOMPLETO RECHAZAR"},624]
[{"$f":"+'NO PROPIETARIOS adm actuales'!A107","v":"l NO PROPIETARIO"},{"$f":"+'NO PROPIETARIOS adm actuales'!B107","v":0},{"$f":"+'NO PROPIETARIOS adm actuales'!C107","v":0},{"$f":"+'NO PROPIETARIOS adm actuales'!D107","v":"LUGAR DE NACIMIENTO:"},{"$f":"IF('NO PROPIETARIOS adm actuales'!E107>0,'NO PROPIETARIOS adm actuales'!E107,\"INCOMPLETO RECHAZAR\")","v":"INCOMPLETO RECHAZAR"},625]
[{"$f":"+'NO PROPIETARIOS adm actuales'!A108","v":"l NO PROPIETARIO"},{"$f":"+'NO PROPIETARIOS adm actuales'!B108","v":0},{"$f":"+'NO PROPIETARIOS adm actuales'!C108","v":0},{"$f":"+'NO PROPIETARIOS adm actuales'!D108","v":"NACIONALIDAD:"},{"$f":"IF('NO PROPIETARIOS adm actuales'!E108>0,'NO PROPIETARIOS adm actuales'!E108,\"INCOMPLETO RECHAZAR\")","v":"INCOMPLETO RECHAZAR"},626]
[{"$f":"+'NO PROPIETARIOS adm actuales'!A115","v":"l NO PROPIETARIO"},{"$f":"+'NO PROPIETARIOS adm actuales'!B115","v":0},{"$f":"+'NO PROPIETARIOS adm actuales'!C115","v":0},{"$f":"+'NO PROPIETARIOS adm actuales'!D115","v":""},{"$f":"IF('NO PROPIETARIOS adm actuales'!E115>0,'NO PROPIETARIOS adm actuales'!E115,\"INCOMPLETO RECHAZAR\")","v":"INCOMPLETO RECHAZAR"},627]
[{"$f":"+'NO PROPIETARIOS adm actuales'!A119","v":"l NO PROPIETARIO"},{"$f":"+'NO PROPIETARIOS adm actuales'!B119","v":0},{"$f":"+'NO PROPIETARIOS adm actuales'!C119","v":0},{"$f":"+'NO PROPIETARIOS adm actuales'!D119","v":"NOTA/OBSERVACIÓN -en mayúscula-:"},{"$f":"IF('NO PROPIETARIOS adm actuales'!E119>0,'NO PROPIETARIOS adm actuales'!E119,\"INCOMPLETO RECHAZAR\")","v":"INCOMPLETO RECHAZAR"},628]
[{"$f":"+'NO PROPIETARIOS adm actuales'!A109","v":"l NO PROPIETARIO"},{"$f":"+'NO PROPIETARIOS adm actuales'!B109","v":0},{"$f":"+'NO PROPIETARIOS adm actuales'!C109","v":0},{"$f":"+'NO PROPIETARIOS adm actuales'!D109","v":"PROFESIÓN/OFICIO:"},{"$f":"IF('NO PROPIETARIOS adm actuales'!E109>0,'NO PROPIETARIOS adm actuales'!E109,\"INCOMPLETO RECHAZAR\")","v":"INCOMPLETO RECHAZAR"},629]
[{"$f":"+'NO PROPIETARIOS adm actuales'!A130","v":"l NO PROPIETARIO"},{"$f":"+'NO PROPIETARIOS adm actuales'!B130","v":0},{"$f":"+'NO PROPIETARIOS adm actuales'!C130","v":0},{"$f":"+'NO PROPIETARIOS adm actuales'!D130","v":""},{"$f":"IF('NO PROPIETARIOS adm actuales'!E130>0,'NO PROPIETARIOS adm actuales'!E130,\"INCOMPLETO RECHAZAR\")","v":"INCOMPLETO RECHAZAR"},630]
[{"$f":"+'NO PROPIETARIOS adm actuales'!A127","v":"l NO PROPIETARIO"},{"$f":"+'NO PROPIETARIOS adm actuales'!B127","v":0},{"$f":"+'NO PROPIETARIOS adm actuales'!C127","v":0},{"$f":"+'NO PROPIETARIOS adm actuales'!D127","v":"CEL/TEL :"},{"$f":"IF('NO PROPIETARIOS adm actuales'!E127>0,'NO PROPIETARIOS adm actuales'!E127,\"INCOMPLETO RECHAZAR\")","v":"INCOMPLETO RECHAZAR"},631]
[{"$f":"+'NO PROPIETARIOS adm actuales'!A121","v":"l NO PROPIETARIO"},{"$f":"+'NO PROPIETARIOS adm actuales'!B121","v":0},{"$f":"+'NO PROPIETARIOS adm actuales'!C121","v":0},{"$f":"+'NO PROPIETARIOS adm actuales'!D121","v":"CUIT/CUIL –sin puntos ni barras-:"},{"$f":"IF('NO PROPIETARIOS adm actuales'!E121>0,'NO PROPIETARIOS adm actuales'!E121,\"INCOMPLETO RECHAZAR\")","v":"INCOMPLETO RECHAZAR"},632]
[{"$f":"+'NO PROPIETARIOS adm actuales'!A132","v":"l NO PROPIETARIO"},{"$f":"+'NO PROPIETARIOS adm actuales'!B132","v":0},{"$f":"+'NO PROPIETARIOS adm actuales'!C132","v":0},{"$f":"+'NO PROPIETARIOS adm actuales'!D132","v":""},{"$f":"IF('NO PROPIETARIOS adm actuales'!E132>0,'NO PROPIETARIOS adm actuales'!E132,\"INCOMPLETO RECHAZAR\")","v":"INCOMPLETO RECHAZAR"},633]
[{"$f":"+'NO PROPIETARIOS adm actuales'!A120","v":"l NO PROPIETARIO"},{"$f":"+'NO PROPIETARIOS adm actuales'!B120","v":0},{"$f":"+'NO PROPIETARIOS adm actuales'!C120","v":0},{"$f":"+'NO PROPIETARIOS adm actuales'!D120","v":"DOC. IDENTIDAD –sin puntos-:"},{"$f":"IF('NO PROPIETARIOS adm actuales'!E120>0,'NO PROPIETARIOS adm actuales'!E120,\"INCOMPLETO RECHAZAR\")","v":"INCOMPLETO RECHAZAR"},634]
[{"$f":"+'NO PROPIETARIOS adm actuales'!A126","v":"l NO PROPIETARIO"},{"$f":"+'NO PROPIETARIOS adm actuales'!B126","v":0},{"$f":"+'NO PROPIETARIOS adm actuales'!C126","v":0},{"$f":"+'NO PROPIETARIOS adm actuales'!D126","v":"DOMICILIO REAL:"},{"$f":"IF('NO PROPIETARIOS adm actuales'!E126>0,'NO PROPIETARIOS adm actuales'!E126,\"INCOMPLETO RECHAZAR\")","v":"INCOMPLETO RECHAZAR"},635]
[{"$f":"+'NO PROPIETARIOS adm actuales'!A129","v":"l NO PROPIETARIO"},{"$f":"+'NO PROPIETARIOS adm actuales'!B129","v":0},{"$f":"+'NO PROPIETARIOS adm actuales'!C129","v":0},{"$f":"+'NO PROPIETARIOS adm actuales'!D129","v":"ESTADO CIVIL:"},{"$f":"IF('NO PROPIETARIOS adm actuales'!E129>0,'NO PROPIETARIOS adm actuales'!E129,\"INCOMPLETO RECHAZAR\")","v":"INCOMPLETO RECHAZAR"},636]
[{"$f":"+'NO PROPIETARIOS adm actuales'!A122","v":"l NO PROPIETARIO"},{"$f":"+'NO PROPIETARIOS adm actuales'!B122","v":0},{"$f":"+'NO PROPIETARIOS adm actuales'!C122","v":0},{"$f":"+'NO PROPIETARIOS adm actuales'!D122","v":"FECHA DE NACIMIENTO –dd/mm/aa-:"},{"$f":"IF('NO PROPIETARIOS adm actuales'!E122>0,'NO PROPIETARIOS adm actuales'!E122,\"INCOMPLETO RECHAZAR\")","v":"INCOMPLETO RECHAZAR"},637]
[{"$f":"+'NO PROPIETARIOS adm actuales'!A123","v":"l NO PROPIETARIO"},{"$f":"+'NO PROPIETARIOS adm actuales'!B123","v":0},{"$f":"+'NO PROPIETARIOS adm actuales'!C123","v":0},{"$f":"+'NO PROPIETARIOS adm actuales'!D123","v":"LUGAR DE NACIMIENTO:"},{"$f":"IF('NO PROPIETARIOS adm actuales'!E123>0,'NO PROPIETARIOS adm actuales'!E123,\"INCOMPLETO RECHAZAR\")","v":"INCOMPLETO RECHAZAR"},638]
[{"$f":"+'NO PROPIETARIOS adm actuales'!A124","v":"l NO PROPIETARIO"},{"$f":"+'NO PROPIETARIOS adm actuales'!B124","v":0},{"$f":"+'NO PROPIETARIOS adm actuales'!C124","v":0},{"$f":"+'NO PROPIETARIOS adm actuales'!D124","v":"NACIONALIDAD:"},{"$f":"IF('NO PROPIETARIOS adm actuales'!E124>0,'NO PROPIETARIOS adm actuales'!E124,\"INCOMPLETO RECHAZAR\")","v":"INCOMPLETO RECHAZAR"},639]
[{"$f":"+'NO PROPIETARIOS adm actuales'!A131","v":"l NO PROPIETARIO"},{"$f":"+'NO PROPIETARIOS adm actuales'!B131","v":0},{"$f":"+'NO PROPIETARIOS adm actuales'!C131","v":0},{"$f":"+'NO PROPIETARIOS adm actuales'!D131","v":""},{"$f":"IF('NO PROPIETARIOS adm actuales'!E131>0,'NO PROPIETARIOS adm actuales'!E131,\"INCOMPLETO RECHAZAR\")","v":"INCOMPLETO RECHAZAR"},640]
[{"$f":"+'NO PROPIETARIOS adm actuales'!A135","v":"l NO PROPIETARIO"},{"$f":"+'NO PROPIETARIOS adm actuales'!B135","v":0},{"$f":"+'NO PROPIETARIOS adm actuales'!C135","v":0},{"$f":"+'NO PROPIETARIOS adm actuales'!D135","v":"NOTA/OBSERVACIÓN -en mayúscula-:"},{"$f":"IF('NO PROPIETARIOS adm actuales'!E135>0,'NO PROPIETARIOS adm actuales'!E135,\"INCOMPLETO RECHAZAR\")","v":"INCOMPLETO RECHAZAR"},641]
[{"$f":"+'NO PROPIETARIOS adm actuales'!A125","v":"l NO PROPIETARIO"},{"$f":"+'NO PROPIETARIOS adm actuales'!B125","v":0},{"$f":"+'NO PROPIETARIOS adm actuales'!C125","v":0},{"$f":"+'NO PROPIETARIOS adm actuales'!D125","v":"PROFESIÓN/OFICIO:"},{"$f":"IF('NO PROPIETARIOS adm actuales'!E125>0,'NO PROPIETARIOS adm actuales'!E125,\"INCOMPLETO RECHAZAR\")","v":"INCOMPLETO RECHAZAR"},642]
[{"$f":"+'NO PROPIETARIOS adm actuales'!A146","v":"l NO PROPIETARIO"},{"$f":"+'NO PROPIETARIOS adm actuales'!B146","v":0},{"$f":"+'NO PROPIETARIOS adm actuales'!C146","v":0},{"$f":"+'NO PROPIETARIOS adm actuales'!D146","v":""},{"$f":"IF('NO PROPIETARIOS adm actuales'!E146>0,'NO PROPIETARIOS adm actuales'!E146,\"INCOMPLETO RECHAZAR\")","v":"INCOMPLETO RECHAZAR"},643]
[{"$f":"+'NO PROPIETARIOS adm actuales'!A143","v":"l NO PROPIETARIO"},{"$f":"+'NO PROPIETARIOS adm actuales'!B143","v":0},{"$f":"+'NO PROPIETARIOS adm actuales'!C143","v":0},{"$f":"+'NO PROPIETARIOS adm actuales'!D143","v":"CEL/TEL :"},{"$f":"IF('NO PROPIETARIOS adm actuales'!E143>0,'NO PROPIETARIOS adm actuales'!E143,\"INCOMPLETO RECHAZAR\")","v":"INCOMPLETO RECHAZAR"},644]
[{"$f":"+'NO PROPIETARIOS adm actuales'!A137","v":"l NO PROPIETARIO"},{"$f":"+'NO PROPIETARIOS adm actuales'!B137","v":0},{"$f":"+'NO PROPIETARIOS adm actuales'!C137","v":0},{"$f":"+'NO PROPIETARIOS adm actuales'!D137","v":"CUIT/CUIL –sin puntos ni barras-:"},{"$f":"IF('NO PROPIETARIOS adm actuales'!E137>0,'NO PROPIETARIOS adm actuales'!E137,\"INCOMPLETO RECHAZAR\")","v":"INCOMPLETO RECHAZAR"},645]
[{"$f":"+'NO PROPIETARIOS adm actuales'!A148","v":"l NO PROPIETARIO"},{"$f":"+'NO PROPIETARIOS adm actuales'!B148","v":0},{"$f":"+'NO PROPIETARIOS adm actuales'!C148","v":0},{"$f":"+'NO PROPIETARIOS adm actuales'!D148","v":""},{"$f":"IF('NO PROPIETARIOS adm actuales'!E148>0,'NO PROPIETARIOS adm actuales'!E148,\"INCOMPLETO RECHAZAR\")","v":"INCOMPLETO RECHAZAR"},646]
[{"$f":"+'NO PROPIETARIOS adm actuales'!A136","v":"l NO PROPIETARIO"},{"$f":"+'NO PROPIETARIOS adm actuales'!B136","v":0},{"$f":"+'NO PROPIETARIOS adm actuales'!C136","v":0},{"$f":"+'NO PROPIETARIOS adm actuales'!D136","v":"DOC. IDENTIDAD –sin puntos-:"},{"$f":"IF('NO PROPIETARIOS adm actuales'!E136>0,'NO PROPIETARIOS adm actuales'!E136,\"INCOMPLETO RECHAZAR\")","v":"INCOMPLETO RECHAZAR"},647]
[{"$f":"+'NO PROPIETARIOS adm actuales'!A142","v":"l NO PROPIETARIO"},{"$f":"+'NO PROPIETARIOS adm actuales'!B142","v":0},{"$f":"+'NO PROPIETARIOS adm actuales'!C142","v":0},{"$f":"+'NO PROPIETARIOS adm actuales'!D142","v":"DOMICILIO REAL:"},{"$f":"IF('NO PROPIETARIOS adm actuales'!E142>0,'NO PROPIETARIOS adm actuales'!E142,\"INCOMPLETO RECHAZAR\")","v":"INCOMPLETO RECHAZAR"},648]
[{"$f":"+'NO PROPIETARIOS adm actuales'!A145","v":"l NO PROPIETARIO"},{"$f":"+'NO PROPIETARIOS adm actuales'!B145","v":0},{"$f":"+'NO PROPIETARIOS adm actuales'!C145","v":0},{"$f":"+'NO PROPIETARIOS adm actuales'!D145","v":"ESTADO CIVIL:"},{"$f":"IF('NO PROPIETARIOS adm actuales'!E145>0,'NO PROPIETARIOS adm actuales'!E145,\"INCOMPLETO RECHAZAR\")","v":"INCOMPLETO RECHAZAR"},649]
[{"$f":"+'NO PROPIETARIOS adm actuales'!A138","v":"l NO PROPIETARIO"},{"$f":"+'NO PROPIETARIOS adm actuales'!B138","v":0},{"$f":"+'NO PROPIETARIOS adm actuales'!C138","v":0},{"$f":"+'NO PROPIETARIOS adm actuales'!D138","v":"FECHA DE NACIMIENTO –dd/mm/aa-:"},{"$f":"IF('NO PROPIETARIOS adm actuales'!E138>0,'NO PROPIETARIOS adm actuales'!E138,\"INCOMPLETO RECHAZAR\")","v":"INCOMPLETO RECHAZAR"},650]
[{"$f":"+'NO PROPIETARIOS adm actuales'!A139","v":"l NO PROPIETARIO"},{"$f":"+'NO PROPIETARIOS adm actuales'!B139","v":0},{"$f":"+'NO PROPIETARIOS adm actuales'!C139","v":0},{"$f":"+'NO PROPIETARIOS adm actuales'!D139","v":"LUGAR DE NACIMIENTO:"},{"$f":"IF('NO PROPIETARIOS adm actuales'!E139>0,'NO PROPIETARIOS adm actuales'!E139,\"INCOMPLETO RECHAZAR\")","v":"INCOMPLETO RECHAZAR"},651]
[{"$f":"+'NO PROPIETARIOS adm actuales'!A140","v":"l NO PROPIETARIO"},{"$f":"+'NO PROPIETARIOS adm actuales'!B140","v":0},{"$f":"+'NO PROPIETARIOS adm actuales'!C140","v":0},{"$f":"+'NO PROPIETARIOS adm actuales'!D140","v":"NACIONALIDAD:"},{"$f":"IF('NO PROPIETARIOS adm actuales'!E140>0,'NO PROPIETARIOS adm actuales'!E140,\"INCOMPLETO RECHAZAR\")","v":"INCOMPLETO RECHAZAR"},652]
[{"$f":"+'NO PROPIETARIOS adm actuales'!A147","v":"l NO PROPIETARIO"},{"$f":"+'NO PROPIETARIOS adm actuales'!B147","v":0},{"$f":"+'NO PROPIETARIOS adm actuales'!C147","v":0},{"$f":"+'NO PROPIETARIOS adm actuales'!D147","v":""},{"$f":"IF('NO PROPIETARIOS adm actuales'!E147>0,'NO PROPIETARIOS adm actuales'!E147,\"INCOMPLETO RECHAZAR\")","v":"INCOMPLETO RECHAZAR"},653]
[{"$f":"+'NO PROPIETARIOS adm actuales'!A151","v":"l NO PROPIETARIO"},{"$f":"+'NO PROPIETARIOS adm actuales'!B151","v":0},{"$f":"+'NO PROPIETARIOS adm actuales'!C151","v":0},{"$f":"+'NO PROPIETARIOS adm actuales'!D151","v":"NOTA/OBSERVACIÓN -en mayúscula-:"},{"$f":"IF('NO PROPIETARIOS adm actuales'!E151>0,'NO PROPIETARIOS adm actuales'!E151,\"INCOMPLETO RECHAZAR\")","v":"INCOMPLETO RECHAZAR"},654]
[{"$f":"+'NO PROPIETARIOS adm actuales'!A141","v":"l NO PROPIETARIO"},{"$f":"+'NO PROPIETARIOS adm actuales'!B141","v":0},{"$f":"+'NO PROPIETARIOS adm actuales'!C141","v":0},{"$f":"+'NO PROPIETARIOS adm actuales'!D141","v":"PROFESIÓN/OFICIO:"},{"$f":"IF('NO PROPIETARIOS adm actuales'!E141>0,'NO PROPIETARIOS adm actuales'!E141,\"INCOMPLETO RECHAZAR\")","v":"INCOMPLETO RECHAZAR"},655]
[{"$f":"+'NO PROPIETARIOS adm actuales'!A162","v":"l NO PROPIETARIO"},{"$f":"+'NO PROPIETARIOS adm actuales'!B162","v":0},{"$f":"+'NO PROPIETARIOS adm actuales'!C162","v":0},{"$f":"+'NO PROPIETARIOS adm actuales'!D162","v":""},{"$f":"IF('NO PROPIETARIOS adm actuales'!E162>0,'NO PROPIETARIOS adm actuales'!E162,\"INCOMPLETO RECHAZAR\")","v":"INCOMPLETO RECHAZAR"},656]
[{"$f":"+'NO PROPIETARIOS adm actuales'!A159","v":"l NO PROPIETARIO"},{"$f":"+'NO PROPIETARIOS adm actuales'!B159","v":0},{"$f":"+'NO PROPIETARIOS adm actuales'!C159","v":0},{"$f":"+'NO PROPIETARIOS adm actuales'!D159","v":"CEL/TEL :"},{"$f":"IF('NO PROPIETARIOS adm actuales'!E159>0,'NO PROPIETARIOS adm actuales'!E159,\"INCOMPLETO RECHAZAR\")","v":"INCOMPLETO RECHAZAR"},657]
[{"$f":"+'NO PROPIETARIOS adm actuales'!A153","v":"l NO PROPIETARIO"},{"$f":"+'NO PROPIETARIOS adm actuales'!B153","v":0},{"$f":"+'NO PROPIETARIOS adm actuales'!C153","v":0},{"$f":"+'NO PROPIETARIOS adm actuales'!D153","v":"CUIT/CUIL –sin puntos ni barras-:"},{"$f":"IF('NO PROPIETARIOS adm actuales'!E153>0,'NO PROPIETARIOS adm actuales'!E153,\"INCOMPLETO RECHAZAR\")","v":"INCOMPLETO RECHAZAR"},658]
[{"$f":"+'NO PROPIETARIOS adm actuales'!A164","v":"l NO PROPIETARIO"},{"$f":"+'NO PROPIETARIOS adm actuales'!B164","v":0},{"$f":"+'NO PROPIETARIOS adm actuales'!C164","v":0},{"$f":"+'NO PROPIETARIOS adm actuales'!D164","v":""},{"$f":"IF('NO PROPIETARIOS adm actuales'!E164>0,'NO PROPIETARIOS adm actuales'!E164,\"INCOMPLETO RECHAZAR\")","v":"INCOMPLETO RECHAZAR"},659]
[{"$f":"+'NO PROPIETARIOS adm actuales'!A152","v":"l NO PROPIETARIO"},{"$f":"+'NO PROPIETARIOS adm actuales'!B152","v":0},{"$f":"+'NO PROPIETARIOS adm actuales'!C152","v":0},{"$f":"+'NO PROPIETARIOS adm actuales'!D152","v":"DOC. IDENTIDAD –sin puntos-:"},{"$f":"IF('NO PROPIETARIOS adm actuales'!E152>0,'NO PROPIETARIOS adm actuales'!E152,\"INCOMPLETO RECHAZAR\")","v":"INCOMPLETO RECHAZAR"},660]
[{"$f":"+'NO PROPIETARIOS adm actuales'!A158","v":"l NO PROPIETARIO"},{"$f":"+'NO PROPIETARIOS adm actuales'!B158","v":0},{"$f":"+'NO PROPIETARIOS adm actuales'!C158","v":0},{"$f":"+'NO PROPIETARIOS adm actuales'!D158","v":"DOMICILIO REAL:"},{"$f":"IF('NO PROPIETARIOS adm actuales'!E158>0,'NO PROPIETARIOS adm actuales'!E158,\"INCOMPLETO RECHAZAR\")","v":"INCOMPLETO RECHAZAR"},661]
[{"$f":"+'NO PROPIETARIOS adm actuales'!A161","v":"l NO PROPIETARIO"},{"$f":"+'NO PROPIETARIOS adm actuales'!B161","v":0},{"$f":"+'NO PROPIETARIOS adm actuales'!C161","v":0},{"$f":"+'NO PROPIETARIOS adm actuales'!D161","v":"ESTADO CIVIL:"},{"$f":"IF('NO PROPIETARIOS adm actuales'!E161>0,'NO PROPIETARIOS adm actuales'!E161,\"INCOMPLETO RECHAZAR\")","v":"INCOMPLETO RECHAZAR"},662]
[{"$f":"+'NO PROPIETARIOS adm actuales'!A154","v":"l NO PROPIETARIO"},{"$f":"+'NO PROPIETARIOS adm actuales'!B154","v":0},{"$f":"+'NO PROPIETARIOS adm actuales'!C154","v":0},{"$f":"+'NO PROPIETARIOS adm actuales'!D154","v":"FECHA DE NACIMIENTO –dd/mm/aa-:"},{"$f":"IF('NO PROPIETARIOS adm actuales'!E154>0,'NO PROPIETARIOS adm actuales'!E154,\"INCOMPLETO RECHAZAR\")","v":"INCOMPLETO RECHAZAR"},663]
[{"$f":"+'NO PROPIETARIOS adm actuales'!A155","v":"l NO PROPIETARIO"},{"$f":"+'NO PROPIETARIOS adm actuales'!B155","v":0},{"$f":"+'NO PROPIETARIOS adm actuales'!C155","v":0},{"$f":"+'NO PROPIETARIOS adm actuales'!D155","v":"LUGAR DE NACIMIENTO:"},{"$f":"IF('NO PROPIETARIOS adm actuales'!E155>0,'NO PROPIETARIOS adm actuales'!E155,\"INCOMPLETO RECHAZAR\")","v":"INCOMPLETO RECHAZAR"},664]
[{"$f":"+'NO PROPIETARIOS adm actuales'!A156","v":"l NO PROPIETARIO"},{"$f":"+'NO PROPIETARIOS adm actuales'!B156","v":0},{"$f":"+'NO PROPIETARIOS adm actuales'!C156","v":0},{"$f":"+'NO PROPIETARIOS adm actuales'!D156","v":"NACIONALIDAD:"},{"$f":"IF('NO PROPIETARIOS adm actuales'!E156>0,'NO PROPIETARIOS adm actuales'!E156,\"INCOMPLETO RECHAZAR\")","v":"INCOMPLETO RECHAZAR"},665]
[{"$f":"+'NO PROPIETARIOS adm actuales'!A163","v":"l NO PROPIETARIO"},{"$f":"+'NO PROPIETARIOS adm actuales'!B163","v":0},{"$f":"+'NO PROPIETARIOS adm actuales'!C163","v":0},{"$f":"+'NO PROPIETARIOS adm actuales'!D163","v":""},{"$f":"IF('NO PROPIETARIOS adm actuales'!E163>0,'NO PROPIETARIOS adm actuales'!E163,\"INCOMPLETO RECHAZAR\")","v":"INCOMPLETO RECHAZAR"},666]
[{"$f":"+'NO PROPIETARIOS adm actuales'!A167","v":"l NO PROPIETARIO"},{"$f":"+'NO PROPIETARIOS adm actuales'!B167","v":0},{"$f":"+'NO PROPIETARIOS adm actuales'!C167","v":0},{"$f":"+'NO PROPIETARIOS adm actuales'!D167","v":"NOTA/OBSERVACIÓN -en mayúscula-:"},{"$f":"IF('NO PROPIETARIOS adm actuales'!E167>0,'NO PROPIETARIOS adm actuales'!E167,\"INCOMPLETO RECHAZAR\")","v":"INCOMPLETO RECHAZAR"},667]
[{"$f":"+'NO PROPIETARIOS adm actuales'!A157","v":"l NO PROPIETARIO"},{"$f":"+'NO PROPIETARIOS adm actuales'!B157","v":0},{"$f":"+'NO PROPIETARIOS adm actuales'!C157","v":0},{"$f":"+'NO PROPIETARIOS adm actuales'!D157","v":"PROFESIÓN/OFICIO:"},{"$f":"IF('NO PROPIETARIOS adm actuales'!E157>0,'NO PROPIETARIOS adm actuales'!E157,\"INCOMPLETO RECHAZAR\")","v":"INCOMPLETO RECHAZAR"},668]
[{"$f":"+'NO PROPIETARIOS adm actuales'!A178","v":"l NO PROPIETARIO"},{"$f":"+'NO PROPIETARIOS adm actuales'!B178","v":0},{"$f":"+'NO PROPIETARIOS adm actuales'!C178","v":0},{"$f":"+'NO PROPIETARIOS adm actuales'!D178","v":""},{"$f":"IF('NO PROPIETARIOS adm actuales'!E178>0,'NO PROPIETARIOS adm actuales'!E178,\"INCOMPLETO RECHAZAR\")","v":"INCOMPLETO RECHAZAR"},669]
[{"$f":"+'NO PROPIETARIOS adm actuales'!A175","v":"l NO PROPIETARIO"},{"$f":"+'NO PROPIETARIOS adm actuales'!B175","v":0},{"$f":"+'NO PROPIETARIOS adm actuales'!C175","v":0},{"$f":"+'NO PROPIETARIOS adm actuales'!D175","v":"CEL/TEL :"},{"$f":"IF('NO PROPIETARIOS adm actuales'!E175>0,'NO PROPIETARIOS adm actuales'!E175,\"INCOMPLETO RECHAZAR\")","v":"INCOMPLETO RECHAZAR"},670]
[{"$f":"+'NO PROPIETARIOS adm actuales'!A169","v":"l NO PROPIETARIO"},{"$f":"+'NO PROPIETARIOS adm actuales'!B169","v":0},{"$f":"+'NO PROPIETARIOS adm actuales'!C169","v":0},{"$f":"+'NO PROPIETARIOS adm actuales'!D169","v":"CUIT/CUIL –sin puntos ni barras-:"},{"$f":"IF('NO PROPIETARIOS adm actuales'!E169>0,'NO PROPIETARIOS adm actuales'!E169,\"INCOMPLETO RECHAZAR\")","v":"INCOMPLETO RECHAZAR"},671]
[{"$f":"+'NO PROPIETARIOS adm actuales'!A180","v":"l NO PROPIETARIO"},{"$f":"+'NO PROPIETARIOS adm actuales'!B180","v":0},{"$f":"+'NO PROPIETARIOS adm actuales'!C180","v":0},{"$f":"+'NO PROPIETARIOS adm actuales'!D180","v":""},{"$f":"IF('NO PROPIETARIOS adm actuales'!E180>0,'NO PROPIETARIOS adm actuales'!E180,\"INCOMPLETO RECHAZAR\")","v":"INCOMPLETO RECHAZAR"},672]
[{"$f":"+'NO PROPIETARIOS adm actuales'!A168","v":"l NO PROPIETARIO"},{"$f":"+'NO PROPIETARIOS adm actuales'!B168","v":0},{"$f":"+'NO PROPIETARIOS adm actuales'!C168","v":0},{"$f":"+'NO PROPIETARIOS adm actuales'!D168","v":"DOC. IDENTIDAD –sin puntos-:"},{"$f":"IF('NO PROPIETARIOS adm actuales'!E168>0,'NO PROPIETARIOS adm actuales'!E168,\"INCOMPLETO RECHAZAR\")","v":"INCOMPLETO RECHAZAR"},673]
[{"$f":"+'NO PROPIETARIOS adm actuales'!A174","v":"l NO PROPIETARIO"},{"$f":"+'NO PROPIETARIOS adm actuales'!B174","v":0},{"$f":"+'NO PROPIETARIOS adm actuales'!C174","v":0},{"$f":"+'NO PROPIETARIOS adm actuales'!D174","v":"DOMICILIO REAL:"},{"$f":"IF('NO PROPIETARIOS adm actuales'!E174>0,'NO PROPIETARIOS adm actuales'!E174,\"INCOMPLETO RECHAZAR\")","v":"INCOMPLETO RECHAZAR"},674]
[{"$f":"+'NO PROPIETARIOS adm actuales'!A177","v":"l NO PROPIETARIO"},{"$f":"+'NO PROPIETARIOS adm actuales'!B177","v":0},{"$f":"+'NO PROPIETARIOS adm actuales'!C177","v":0},{"$f":"+'NO PROPIETARIOS adm actuales'!D177","v":"ESTADO CIVIL:"},{"$f":"IF('NO PROPIETARIOS adm actuales'!E177>0,'NO PROPIETARIOS adm actuales'!E177,\"INCOMPLETO RECHAZAR\")","v":"INCOMPLETO RECHAZAR"},675]
[{"$f":"+'NO PROPIETARIOS adm actuales'!A170","v":"l NO PROPIETARIO"},{"$f":"+'NO PROPIETARIOS adm actuales'!B170","v":0},{"$f":"+'NO PROPIETARIOS adm actuales'!C170","v":0},{"$f":"+'NO PROPIETARIOS adm actuales'!D170","v":"FECHA DE NACIMIENTO –dd/mm/aa-:"},{"$f":"IF('NO PROPIETARIOS adm actuales'!E170>0,'NO PROPIETARIOS adm actuales'!E170,\"INCOMPLETO RECHAZAR\")","v":"INCOMPLETO RECHAZAR"},676]
[{"$f":"+'NO PROPIETARIOS adm actuales'!A171","v":"l NO PROPIETARIO"},{"$f":"+'NO PROPIETARIOS adm actuales'!B171","v":0},{"$f":"+'NO PROPIETARIOS adm actuales'!C171","v":0},{"$f":"+'NO PROPIETARIOS adm actuales'!D171","v":"LUGAR DE NACIMIENTO:"},{"$f":"IF('NO PROPIETARIOS adm actuales'!E171>0,'NO PROPIETARIOS adm actuales'!E171,\"INCOMPLETO RECHAZAR\")","v":"INCOMPLETO RECHAZAR"},677]
[{"$f":"+'NO PROPIETARIOS adm actuales'!A172","v":"l NO PROPIETARIO"},{"$f":"+'NO PROPIETARIOS adm actuales'!B172","v":0},{"$f":"+'NO PROPIETARIOS adm actuales'!C172","v":0},{"$f":"+'NO PROPIETARIOS adm actuales'!D172","v":"NACIONALIDAD:"},{"$f":"IF('NO PROPIETARIOS adm actuales'!E172>0,'NO PROPIETARIOS adm actuales'!E172,\"INCOMPLETO RECHAZAR\")","v":"INCOMPLETO RECHAZAR"},678]
[{"$f":"+'NO PROPIETARIOS adm actuales'!A179","v":"l NO PROPIETARIO"},{"$f":"+'NO PROPIETARIOS adm actuales'!B179","v":0},{"$f":"+'NO PROPIETARIOS adm actuales'!C179","v":0},{"$f":"+'NO PROPIETARIOS adm actuales'!D179","v":""},{"$f":"IF('NO PROPIETARIOS adm actuales'!E179>0,'NO PROPIETARIOS adm actuales'!E179,\"INCOMPLETO RECHAZAR\")","v":"INCOMPLETO RECHAZAR"},679]
[{"$f":"+'NO PROPIETARIOS adm actuales'!A183","v":"l NO PROPIETARIO"},{"$f":"+'NO PROPIETARIOS adm actuales'!B183","v":0},{"$f":"+'NO PROPIETARIOS adm actuales'!C183","v":0},{"$f":"+'NO PROPIETARIOS adm actuales'!D183","v":"NOTA/OBSERVACIÓN -en mayúscula-:"},{"$f":"IF('NO PROPIETARIOS adm actuales'!E183>0,'NO PROPIETARIOS adm actuales'!E183,\"INCOMPLETO RECHAZAR\")","v":"INCOMPLETO RECHAZAR"},680]
[{"$f":"+'NO PROPIETARIOS adm actuales'!A173","v":"l NO PROPIETARIO"},{"$f":"+'NO PROPIETARIOS adm actuales'!B173","v":0},{"$f":"+'NO PROPIETARIOS adm actuales'!C173","v":0},{"$f":"+'NO PROPIETARIOS adm actuales'!D173","v":"PROFESIÓN/OFICIO:"},{"$f":"IF('NO PROPIETARIOS adm actuales'!E173>0,'NO PROPIETARIOS adm actuales'!E173,\"INCOMPLETO RECHAZAR\")","v":"INCOMPLETO RECHAZAR"},681]
[{"$f":"+'NO PROPIETARIOS adm actuales'!A194","v":"l NO PROPIETARIO"},{"$f":"+'NO PROPIETARIOS adm actuales'!B194","v":0},{"$f":"+'NO PROPIETARIOS adm actuales'!C194","v":0},{"$f":"+'NO PROPIETARIOS adm actuales'!D194","v":""},{"$f":"IF('NO PROPIETARIOS adm actuales'!E194>0,'NO PROPIETARIOS adm actuales'!E194,\"INCOMPLETO RECHAZAR\")","v":"INCOMPLETO RECHAZAR"},682]
[{"$f":"+'NO PROPIETARIOS adm actuales'!A191","v":"l NO PROPIETARIO"},{"$f":"+'NO PROPIETARIOS adm actuales'!B191","v":0},{"$f":"+'NO PROPIETARIOS adm actuales'!C191","v":0},{"$f":"+'NO PROPIETARIOS adm actuales'!D191","v":"CEL/TEL :"},{"$f":"IF('NO PROPIETARIOS adm actuales'!E191>0,'NO PROPIETARIOS adm actuales'!E191,\"INCOMPLETO RECHAZAR\")","v":"INCOMPLETO RECHAZAR"},683]
[{"$f":"+'NO PROPIETARIOS adm actuales'!A185","v":"l NO PROPIETARIO"},{"$f":"+'NO PROPIETARIOS adm actuales'!B185","v":0},{"$f":"+'NO PROPIETARIOS adm actuales'!C185","v":0},{"$f":"+'NO PROPIETARIOS adm actuales'!D185","v":"CUIT/CUIL –sin puntos ni barras-:"},{"$f":"IF('NO PROPIETARIOS adm actuales'!E185>0,'NO PROPIETARIOS adm actuales'!E185,\"INCOMPLETO RECHAZAR\")","v":"INCOMPLETO RECHAZAR"},684]
[{"$f":"+'NO PROPIETARIOS adm actuales'!A196","v":"l NO PROPIETARIO"},{"$f":"+'NO PROPIETARIOS adm actuales'!B196","v":0},{"$f":"+'NO PROPIETARIOS adm actuales'!C196","v":0},{"$f":"+'NO PROPIETARIOS adm actuales'!D196","v":""},{"$f":"IF('NO PROPIETARIOS adm actuales'!E196>0,'NO PROPIETARIOS adm actuales'!E196,\"INCOMPLETO RECHAZAR\")","v":"INCOMPLETO RECHAZAR"},685]
[{"$f":"+'NO PROPIETARIOS adm actuales'!A184","v":"l NO PROPIETARIO"},{"$f":"+'NO PROPIETARIOS adm actuales'!B184","v":0},{"$f":"+'NO PROPIETARIOS adm actuales'!C184","v":0},{"$f":"+'NO PROPIETARIOS adm actuales'!D184","v":"DOC. IDENTIDAD –sin puntos-:"},{"$f":"IF('NO PROPIETARIOS adm actuales'!E184>0,'NO PROPIETARIOS adm actuales'!E184,\"INCOMPLETO RECHAZAR\")","v":"INCOMPLETO RECHAZAR"},686]
[{"$f":"+'NO PROPIETARIOS adm actuales'!A190","v":"l NO PROPIETARIO"},{"$f":"+'NO PROPIETARIOS adm actuales'!B190","v":0},{"$f":"+'NO PROPIETARIOS adm actuales'!C190","v":0},{"$f":"+'NO PROPIETARIOS adm actuales'!D190","v":"DOMICILIO REAL:"},{"$f":"IF('NO PROPIETARIOS adm actuales'!E190>0,'NO PROPIETARIOS adm actuales'!E190,\"INCOMPLETO RECHAZAR\")","v":"INCOMPLETO RECHAZAR"},687]
[{"$f":"+'NO PROPIETARIOS adm actuales'!A193","v":"l NO PROPIETARIO"},{"$f":"+'NO PROPIETARIOS adm actuales'!B193","v":0},{"$f":"+'NO PROPIETARIOS adm actuales'!C193","v":0},{"$f":"+'NO PROPIETARIOS adm actuales'!D193","v":"ESTADO CIVIL:"},{"$f":"IF('NO PROPIETARIOS adm actuales'!E193>0,'NO PROPIETARIOS adm actuales'!E193,\"INCOMPLETO RECHAZAR\")","v":"INCOMPLETO RECHAZAR"},688]
[{"$f":"+'NO PROPIETARIOS adm actuales'!A186","v":"l NO PROPIETARIO"},{"$f":"+'NO PROPIETARIOS adm actuales'!B186","v":0},{"$f":"+'NO PROPIETARIOS adm actuales'!C186","v":0},{"$f":"+'NO PROPIETARIOS adm actuales'!D186","v":"FECHA DE NACIMIENTO –dd/mm/aa-:"},{"$f":"IF('NO PROPIETARIOS adm actuales'!E186>0,'NO PROPIETARIOS adm actuales'!E186,\"INCOMPLETO RECHAZAR\")","v":"INCOMPLETO RECHAZAR"},689]
[{"$f":"+'NO PROPIETARIOS adm actuales'!A187","v":"l NO PROPIETARIO"},{"$f":"+'NO PROPIETARIOS adm actuales'!B187","v":0},{"$f":"+'NO PROPIETARIOS adm actuales'!C187","v":0},{"$f":"+'NO PROPIETARIOS adm actuales'!D187","v":"LUGAR DE NACIMIENTO:"},{"$f":"IF('NO PROPIETARIOS adm actuales'!E187>0,'NO PROPIETARIOS adm actuales'!E187,\"INCOMPLETO RECHAZAR\")","v":"INCOMPLETO RECHAZAR"},690]
[{"$f":"+'NO PROPIETARIOS adm actuales'!A188","v":"l NO PROPIETARIO"},{"$f":"+'NO PROPIETARIOS adm actuales'!B188","v":0},{"$f":"+'NO PROPIETARIOS adm actuales'!C188","v":0},{"$f":"+'NO PROPIETARIOS adm actuales'!D188","v":"NACIONALIDAD:"},{"$f":"IF('NO PROPIETARIOS adm actuales'!E188>0,'NO PROPIETARIOS adm actuales'!E188,\"INCOMPLETO RECHAZAR\")","v":"INCOMPLETO RECHAZAR"},691]
[{"$f":"+'NO PROPIETARIOS adm actuales'!A195","v":"l NO PROPIETARIO"},{"$f":"+'NO PROPIETARIOS adm actuales'!B195","v":0},{"$f":"+'NO PROPIETARIOS adm actuales'!C195","v":0},{"$f":"+'NO PROPIETARIOS adm actuales'!D195","v":""},{"$f":"IF('NO PROPIETARIOS adm actuales'!E195>0,'NO PROPIETARIOS adm actuales'!E195,\"INCOMPLETO RECHAZAR\")","v":"INCOMPLETO RECHAZAR"},692]
[{"$f":"+'NO PROPIETARIOS adm actuales'!A199","v":"l NO PROPIETARIO"},{"$f":"+'NO PROPIETARIOS adm actuales'!B199","v":0},{"$f":"+'NO PROPIETARIOS adm actuales'!C199","v":0},{"$f":"+'NO PROPIETARIOS adm actuales'!D199","v":"NOTA/OBSERVACIÓN -en mayúscula-:"},{"$f":"IF('NO PROPIETARIOS adm actuales'!E199>0,'NO PROPIETARIOS adm actuales'!E199,\"INCOMPLETO RECHAZAR\")","v":"INCOMPLETO RECHAZAR"},693]
[{"$f":"+'NO PROPIETARIOS adm actuales'!A189","v":"l NO PROPIETARIO"},{"$f":"+'NO PROPIETARIOS adm actuales'!B189","v":0},{"$f":"+'NO PROPIETARIOS adm actuales'!C189","v":0},{"$f":"+'NO PROPIETARIOS adm actuales'!D189","v":"PROFESIÓN/OFICIO:"},{"$f":"IF('NO PROPIETARIOS adm actuales'!E189>0,'NO PROPIETARIOS adm actuales'!E189,\"INCOMPLETO RECHAZAR\")","v":"INCOMPLETO RECHAZAR"},694]
[{"$f":"+'NO PROPIETARIOS adm actuales'!A210","v":"l NO PROPIETARIO"},{"$f":"+'NO PROPIETARIOS adm actuales'!B210","v":0},{"$f":"+'NO PROPIETARIOS adm actuales'!C210","v":0},{"$f":"+'NO PROPIETARIOS adm actuales'!D210","v":""},{"$f":"IF('NO PROPIETARIOS adm actuales'!E210>0,'NO PROPIETARIOS adm actuales'!E210,\"INCOMPLETO RECHAZAR\")","v":"INCOMPLETO RECHAZAR"},695]
[{"$f":"+'NO PROPIETARIOS adm actuales'!A207","v":"l NO PROPIETARIO"},{"$f":"+'NO PROPIETARIOS adm actuales'!B207","v":0},{"$f":"+'NO PROPIETARIOS adm actuales'!C207","v":0},{"$f":"+'NO PROPIETARIOS adm actuales'!D207","v":"CEL/TEL :"},{"$f":"IF('NO PROPIETARIOS adm actuales'!E207>0,'NO PROPIETARIOS adm actuales'!E207,\"INCOMPLETO RECHAZAR\")","v":"INCOMPLETO RECHAZAR"},696]
[{"$f":"+'NO PROPIETARIOS adm actuales'!A201","v":"l NO PROPIETARIO"},{"$f":"+'NO PROPIETARIOS adm actuales'!B201","v":0},{"$f":"+'NO PROPIETARIOS adm actuales'!C201","v":0},{"$f":"+'NO PROPIETARIOS adm actuales'!D201","v":"CUIT/CUIL –sin puntos ni barras-:"},{"$f":"IF('NO PROPIETARIOS adm actuales'!E201>0,'NO PROPIETARIOS adm actuales'!E201,\"INCOMPLETO RECHAZAR\")","v":"INCOMPLETO RECHAZAR"},697]
[{"$f":"+'NO PROPIETARIOS adm actuales'!A212","v":"l NO PROPIETARIO"},{"$f":"+'NO PROPIETARIOS adm actuales'!B212","v":0},{"$f":"+'NO PROPIETARIOS adm actuales'!C212","v":0},{"$f":"+'NO PROPIETARIOS adm actuales'!D212","v":""},{"$f":"IF('NO PROPIETARIOS adm actuales'!E212>0,'NO PROPIETARIOS adm actuales'!E212,\"INCOMPLETO RECHAZAR\")","v":"INCOMPLETO RECHAZAR"},698]
[{"$f":"+'NO PROPIETARIOS adm actuales'!A200","v":"l NO PROPIETARIO"},{"$f":"+'NO PROPIETARIOS adm actuales'!B200","v":0},{"$f":"+'NO PROPIETARIOS adm actuales'!C200","v":0},{"$f":"+'NO PROPIETARIOS adm actuales'!D200","v":"DOC. IDENTIDAD –sin puntos-:"},{"$f":"IF('NO PROPIETARIOS adm actuales'!E200>0,'NO PROPIETARIOS adm actuales'!E200,\"INCOMPLETO RECHAZAR\")","v":"INCOMPLETO RECHAZAR"},699]
[{"$f":"+'NO PROPIETARIOS adm actuales'!A206","v":"l NO PROPIETARIO"},{"$f":"+'NO PROPIETARIOS adm actuales'!B206","v":0},{"$f":"+'NO PROPIETARIOS adm actuales'!C206","v":0},{"$f":"+'NO PROPIETARIOS adm actuales'!D206","v":"DOMICILIO REAL:"},{"$f":"IF('NO PROPIETARIOS adm actuales'!E206>0,'NO PROPIETARIOS adm actuales'!E206,\"INCOMPLETO RECHAZAR\")","v":"INCOMPLETO RECHAZAR"},700]
[{"$f":"+'NO PROPIETARIOS adm actuales'!A209","v":"l NO PROPIETARIO"},{"$f":"+'NO PROPIETARIOS adm actuales'!B209","v":0},{"$f":"+'NO PROPIETARIOS adm actuales'!C209","v":0},{"$f":"+'NO PROPIETARIOS adm actuales'!D209","v":"ESTADO CIVIL:"},{"$f":"IF('NO PROPIETARIOS adm actuales'!E209>0,'NO PROPIETARIOS adm actuales'!E209,\"INCOMPLETO RECHAZAR\")","v":"INCOMPLETO RECHAZAR"},701]
[{"$f":"+'NO PROPIETARIOS adm actuales'!A202","v":"l NO PROPIETARIO"},{"$f":"+'NO PROPIETARIOS adm actuales'!B202","v":0},{"$f":"+'NO PROPIETARIOS adm actuales'!C202","v":0},{"$f":"+'NO PROPIETARIOS adm actuales'!D202","v":"FECHA DE NACIMIENTO –dd/mm/aa-:"},{"$f":"IF('NO PROPIETARIOS adm actuales'!E202>0,'NO PROPIETARIOS adm actuales'!E202,\"INCOMPLETO RECHAZAR\")","v":"INCOMPLETO RECHAZAR"},702]
[{"$f":"+'NO PROPIETARIOS adm actuales'!A203","v":"l NO PROPIETARIO"},{"$f":"+'NO PROPIETARIOS adm actuales'!B203","v":0},{"$f":"+'NO PROPIETARIOS adm actuales'!C203","v":0},{"$f":"+'NO PROPIETARIOS adm actuales'!D203","v":"LUGAR DE NACIMIENTO:"},{"$f":"IF('NO PROPIETARIOS adm actuales'!E203>0,'NO PROPIETARIOS adm actuales'!E203,\"INCOMPLETO RECHAZAR\")","v":"INCOMPLETO RECHAZAR"},703]
[{"$f":"+'NO PROPIETARIOS adm actuales'!A204","v":"l NO PROPIETARIO"},{"$f":"+'NO PROPIETARIOS adm actuales'!B204","v":0},{"$f":"+'NO PROPIETARIOS adm actuales'!C204","v":0},{"$f":"+'NO PROPIETARIOS adm actuales'!D204","v":"NACIONALIDAD:"},{"$f":"IF('NO PROPIETARIOS adm actuales'!E204>0,'NO PROPIETARIOS adm actuales'!E204,\"INCOMPLETO RECHAZAR\")","v":"INCOMPLETO RECHAZAR"},704]
[{"$f":"+'NO PROPIETARIOS adm actuales'!A211","v":"l NO PROPIETARIO"},{"$f":"+'NO PROPIETARIOS adm actuales'!B211","v":0},{"$f":"+'NO PROPIETARIOS adm actuales'!C211","v":0},{"$f":"+'NO PROPIETARIOS adm actuales'!D211","v":""},{"$f":"IF('NO PROPIETARIOS adm actuales'!E211>0,'NO PROPIETARIOS adm actuales'!E211,\"INCOMPLETO RECHAZAR\")","v":"INCOMPLETO RECHAZAR"},705]
[{"$f":"+'NO PROPIETARIOS adm actuales'!A215","v":"l NO PROPIETARIO"},{"$f":"+'NO PROPIETARIOS adm actuales'!B215","v":0},{"$f":"+'NO PROPIETARIOS adm actuales'!C215","v":0},{"$f":"+'NO PROPIETARIOS adm actuales'!D215","v":"NOTA/OBSERVACIÓN -en mayúscula-:"},{"$f":"IF('NO PROPIETARIOS adm actuales'!E215>0,'NO PROPIETARIOS adm actuales'!E215,\"INCOMPLETO RECHAZAR\")","v":"INCOMPLETO RECHAZAR"},706]
[{"$f":"+'NO PROPIETARIOS adm actuales'!A205","v":"l NO PROPIETARIO"},{"$f":"+'NO PROPIETARIOS adm actuales'!B205","v":0},{"$f":"+'NO PROPIETARIOS adm actuales'!C205","v":0},{"$f":"+'NO PROPIETARIOS adm actuales'!D205","v":"PROFESIÓN/OFICIO:"},{"$f":"IF('NO PROPIETARIOS adm actuales'!E205>0,'NO PROPIETARIOS adm actuales'!E205,\"INCOMPLETO RECHAZAR\")","v":"INCOMPLETO RECHAZAR"},707]
[{"$f":"+'NO PROPIETARIOS adm actuales'!A226","v":"l NO PROPIETARIO"},{"$f":"+'NO PROPIETARIOS adm actuales'!B226","v":0},{"$f":"+'NO PROPIETARIOS adm actuales'!C226","v":0},{"$f":"+'NO PROPIETARIOS adm actuales'!D226","v":""},{"$f":"IF('NO PROPIETARIOS adm actuales'!E226>0,'NO PROPIETARIOS adm actuales'!E226,\"INCOMPLETO RECHAZAR\")","v":"INCOMPLETO RECHAZAR"},708]
[{"$f":"+'NO PROPIETARIOS adm actuales'!A223","v":"l NO PROPIETARIO"},{"$f":"+'NO PROPIETARIOS adm actuales'!B223","v":0},{"$f":"+'NO PROPIETARIOS adm actuales'!C223","v":0},{"$f":"+'NO PROPIETARIOS adm actuales'!D223","v":"CEL/TEL :"},{"$f":"IF('NO PROPIETARIOS adm actuales'!E223>0,'NO PROPIETARIOS adm actuales'!E223,\"INCOMPLETO RECHAZAR\")","v":"INCOMPLETO RECHAZAR"},709]
[{"$f":"+'NO PROPIETARIOS adm actuales'!A217","v":"l NO PROPIETARIO"},{"$f":"+'NO PROPIETARIOS adm actuales'!B217","v":0},{"$f":"+'NO PROPIETARIOS adm actuales'!C217","v":0},{"$f":"+'NO PROPIETARIOS adm actuales'!D217","v":"CUIT/CUIL –sin puntos ni barras-:"},{"$f":"IF('NO PROPIETARIOS adm actuales'!E217>0,'NO PROPIETARIOS adm actuales'!E217,\"INCOMPLETO RECHAZAR\")","v":"INCOMPLETO RECHAZAR"},710]
[{"$f":"+'NO PROPIETARIOS adm actuales'!A228","v":"l NO PROPIETARIO"},{"$f":"+'NO PROPIETARIOS adm actuales'!B228","v":0},{"$f":"+'NO PROPIETARIOS adm actuales'!C228","v":0},{"$f":"+'NO PROPIETARIOS adm actuales'!D228","v":""},{"$f":"IF('NO PROPIETARIOS adm actuales'!E228>0,'NO PROPIETARIOS adm actuales'!E228,\"INCOMPLETO RECHAZAR\")","v":"INCOMPLETO RECHAZAR"},711]
[{"$f":"+'NO PROPIETARIOS adm actuales'!A216","v":"l NO PROPIETARIO"},{"$f":"+'NO PROPIETARIOS adm actuales'!B216","v":0},{"$f":"+'NO PROPIETARIOS adm actuales'!C216","v":0},{"$f":"+'NO PROPIETARIOS adm actuales'!D216","v":"DOC. IDENTIDAD –sin puntos-:"},{"$f":"IF('NO PROPIETARIOS adm actuales'!E216>0,'NO PROPIETARIOS adm actuales'!E216,\"INCOMPLETO RECHAZAR\")","v":"INCOMPLETO RECHAZAR"},712]
[{"$f":"+'NO PROPIETARIOS adm actuales'!A222","v":"l NO PROPIETARIO"},{"$f":"+'NO PROPIETARIOS adm actuales'!B222","v":0},{"$f":"+'NO PROPIETARIOS adm actuales'!C222","v":0},{"$f":"+'NO PROPIETARIOS adm actuales'!D222","v":"DOMICILIO REAL:"},{"$f":"IF('NO PROPIETARIOS adm actuales'!E222>0,'NO PROPIETARIOS adm actuales'!E222,\"INCOMPLETO RECHAZAR\")","v":"INCOMPLETO RECHAZAR"},713]
[{"$f":"+'NO PROPIETARIOS adm actuales'!A225","v":"l NO PROPIETARIO"},{"$f":"+'NO PROPIETARIOS adm actuales'!B225","v":0},{"$f":"+'NO PROPIETARIOS adm actuales'!C225","v":0},{"$f":"+'NO PROPIETARIOS adm actuales'!D225","v":"ESTADO CIVIL:"},{"$f":"IF('NO PROPIETARIOS adm actuales'!E225>0,'NO PROPIETARIOS adm actuales'!E225,\"INCOMPLETO RECHAZAR\")","v":"INCOMPLETO RECHAZAR"},714]
[{"$f":"+'NO PROPIETARIOS adm actuales'!A218","v":"l NO PROPIETARIO"},{"$f":"+'NO PROPIETARIOS adm actuales'!B218","v":0},{"$f":"+'NO PROPIETARIOS adm actuales'!C218","v":0},{"$f":"+'NO PROPIETARIOS adm actuales'!D218","v":"FECHA DE NACIMIENTO –dd/mm/aa-:"},{"$f":"IF('NO PROPIETARIOS adm actuales'!E218>0,'NO PROPIETARIOS adm actuales'!E218,\"INCOMPLETO RECHAZAR\")","v":"INCOMPLETO RECHAZAR"},715]
[{"$f":"+'NO PROPIETARIOS adm actuales'!A219","v":"l NO PROPIETARIO"},{"$f":"+'NO PROPIETARIOS adm actuales'!B219","v":0},{"$f":"+'NO PROPIETARIOS adm actuales'!C219","v":0},{"$f":"+'NO PROPIETARIOS adm actuales'!D219","v":"LUGAR DE NACIMIENTO:"},{"$f":"IF('NO PROPIETARIOS adm actuales'!E219>0,'NO PROPIETARIOS adm actuales'!E219,\"INCOMPLETO RECHAZAR\")","v":"INCOMPLETO RECHAZAR"},716]
[{"$f":"+'NO PROPIETARIOS adm actuales'!A220","v":"l NO PROPIETARIO"},{"$f":"+'NO PROPIETARIOS adm actuales'!B220","v":0},{"$f":"+'NO PROPIETARIOS adm actuales'!C220","v":0},{"$f":"+'NO PROPIETARIOS adm actuales'!D220","v":"NACIONALIDAD:"},{"$f":"IF('NO PROPIETARIOS adm actuales'!E220>0,'NO PROPIETARIOS adm actuales'!E220,\"INCOMPLETO RECHAZAR\")","v":"INCOMPLETO RECHAZAR"},717]
[{"$f":"+'NO PROPIETARIOS adm actuales'!A227","v":"l NO PROPIETARIO"},{"$f":"+'NO PROPIETARIOS adm actuales'!B227","v":0},{"$f":"+'NO PROPIETARIOS adm actuales'!C227","v":0},{"$f":"+'NO PROPIETARIOS adm actuales'!D227","v":""},{"$f":"IF('NO PROPIETARIOS adm actuales'!E227>0,'NO PROPIETARIOS adm actuales'!E227,\"INCOMPLETO RECHAZAR\")","v":"INCOMPLETO RECHAZAR"},718]
[{"$f":"+'NO PROPIETARIOS adm actuales'!A231","v":"l NO PROPIETARIO"},{"$f":"+'NO PROPIETARIOS adm actuales'!B231","v":0},{"$f":"+'NO PROPIETARIOS adm actuales'!C231","v":0},{"$f":"+'NO PROPIETARIOS adm actuales'!D231","v":"NOTA/OBSERVACIÓN -en mayúscula-:"},{"$f":"IF('NO PROPIETARIOS adm actuales'!E231>0,'NO PROPIETARIOS adm actuales'!E231,\"INCOMPLETO RECHAZAR\")","v":"INCOMPLETO RECHAZAR"},719]
[{"$f":"+'NO PROPIETARIOS adm actuales'!A221","v":"l NO PROPIETARIO"},{"$f":"+'NO PROPIETARIOS adm actuales'!B221","v":0},{"$f":"+'NO PROPIETARIOS adm actuales'!C221","v":0},{"$f":"+'NO PROPIETARIOS adm actuales'!D221","v":"PROFESIÓN/OFICIO:"},{"$f":"IF('NO PROPIETARIOS adm actuales'!E221>0,'NO PROPIETARIOS adm actuales'!E221,\"INCOMPLETO RECHAZAR\")","v":"INCOMPLETO RECHAZAR"},720]
[{"$f":"+'NO PROPIETARIOS adm actuales'!A242","v":"l NO PROPIETARIO"},{"$f":"+'NO PROPIETARIOS adm actuales'!B242","v":0},{"$f":"+'NO PROPIETARIOS adm actuales'!C242","v":0},{"$f":"+'NO PROPIETARIOS adm actuales'!D242","v":""},{"$f":"IF('NO PROPIETARIOS adm actuales'!E242>0,'NO PROPIETARIOS adm actuales'!E242,\"INCOMPLETO RECHAZAR\")","v":"INCOMPLETO RECHAZAR"},721]
[{"$f":"+'NO PROPIETARIOS adm actuales'!A239","v":"l NO PROPIETARIO"},{"$f":"+'NO PROPIETARIOS adm actuales'!B239","v":0},{"$f":"+'NO PROPIETARIOS adm actuales'!C239","v":0},{"$f":"+'NO PROPIETARIOS adm actuales'!D239","v":"CEL/TEL :"},{"$f":"IF('NO PROPIETARIOS adm actuales'!E239>0,'NO PROPIETARIOS adm actuales'!E239,\"INCOMPLETO RECHAZAR\")","v":"INCOMPLETO RECHAZAR"},722]
[{"$f":"+'NO PROPIETARIOS adm actuales'!A233","v":"l NO PROPIETARIO"},{"$f":"+'NO PROPIETARIOS adm actuales'!B233","v":0},{"$f":"+'NO PROPIETARIOS adm actuales'!C233","v":0},{"$f":"+'NO PROPIETARIOS adm actuales'!D233","v":"CUIT/CUIL –sin puntos ni barras-:"},{"$f":"IF('NO PROPIETARIOS adm actuales'!E233>0,'NO PROPIETARIOS adm actuales'!E233,\"INCOMPLETO RECHAZAR\")","v":"INCOMPLETO RECHAZAR"},723]
[{"$f":"+'NO PROPIETARIOS adm actuales'!A244","v":"l NO PROPIETARIO"},{"$f":"+'NO PROPIETARIOS adm actuales'!B244","v":0},{"$f":"+'NO PROPIETARIOS adm actuales'!C244","v":0},{"$f":"+'NO PROPIETARIOS adm actuales'!D244","v":""},{"$f":"IF('NO PROPIETARIOS adm actuales'!E244>0,'NO PROPIETARIOS adm actuales'!E244,\"INCOMPLETO RECHAZAR\")","v":"INCOMPLETO RECHAZAR"},724]
[{"$f":"+'NO PROPIETARIOS adm actuales'!A232","v":"l NO PROPIETARIO"},{"$f":"+'NO PROPIETARIOS adm actuales'!B232","v":0},{"$f":"+'NO PROPIETARIOS adm actuales'!C232","v":0},{"$f":"+'NO PROPIETARIOS adm actuales'!D232","v":"DOC. IDENTIDAD –sin puntos-:"},{"$f":"IF('NO PROPIETARIOS adm actuales'!E232>0,'NO PROPIETARIOS adm actuales'!E232,\"INCOMPLETO RECHAZAR\")","v":"INCOMPLETO RECHAZAR"},725]
[{"$f":"+'NO PROPIETARIOS adm actuales'!A238","v":"l NO PROPIETARIO"},{"$f":"+'NO PROPIETARIOS adm actuales'!B238","v":0},{"$f":"+'NO PROPIETARIOS adm actuales'!C238","v":0},{"$f":"+'NO PROPIETARIOS adm actuales'!D238","v":"DOMICILIO REAL:"},{"$f":"IF('NO PROPIETARIOS adm actuales'!E238>0,'NO PROPIETARIOS adm actuales'!E238,\"INCOMPLETO RECHAZAR\")","v":"INCOMPLETO RECHAZAR"},726]
[{"$f":"+'NO PROPIETARIOS adm actuales'!A241","v":"l NO PROPIETARIO"},{"$f":"+'NO PROPIETARIOS adm actuales'!B241","v":0},{"$f":"+'NO PROPIETARIOS adm actuales'!C241","v":0},{"$f":"+'NO PROPIETARIOS adm actuales'!D241","v":"ESTADO CIVIL:"},{"$f":"IF('NO PROPIETARIOS adm actuales'!E241>0,'NO PROPIETARIOS adm actuales'!E241,\"INCOMPLETO RECHAZAR\")","v":"INCOMPLETO RECHAZAR"},727]
[{"$f":"+'NO PROPIETARIOS adm actuales'!A234","v":"l NO PROPIETARIO"},{"$f":"+'NO PROPIETARIOS adm actuales'!B234","v":0},{"$f":"+'NO PROPIETARIOS adm actuales'!C234","v":0},{"$f":"+'NO PROPIETARIOS adm actuales'!D234","v":"FECHA DE NACIMIENTO –dd/mm/aa-:"},{"$f":"IF('NO PROPIETARIOS adm actuales'!E234>0,'NO PROPIETARIOS adm actuales'!E234,\"INCOMPLETO RECHAZAR\")","v":"INCOMPLETO RECHAZAR"},728]
[{"$f":"+'NO PROPIETARIOS adm actuales'!A235","v":"l NO PROPIETARIO"},{"$f":"+'NO PROPIETARIOS adm actuales'!B235","v":0},{"$f":"+'NO PROPIETARIOS adm actuales'!C235","v":0},{"$f":"+'NO PROPIETARIOS adm actuales'!D235","v":"LUGAR DE NACIMIENTO:"},{"$f":"IF('NO PROPIETARIOS adm actuales'!E235>0,'NO PROPIETARIOS adm actuales'!E235,\"INCOMPLETO RECHAZAR\")","v":"INCOMPLETO RECHAZAR"},729]
[{"$f":"+'NO PROPIETARIOS adm actuales'!A236","v":"l NO PROPIETARIO"},{"$f":"+'NO PROPIETARIOS adm actuales'!B236","v":0},{"$f":"+'NO PROPIETARIOS adm actuales'!C236","v":0},{"$f":"+'NO PROPIETARIOS adm actuales'!D236","v":"NACIONALIDAD:"},{"$f":"IF('NO PROPIETARIOS adm actuales'!E236>0,'NO PROPIETARIOS adm actuales'!E236,\"INCOMPLETO RECHAZAR\")","v":"INCOMPLETO RECHAZAR"},730]
[{"$f":"+'NO PROPIETARIOS adm actuales'!A243","v":"l NO PROPIETARIO"},{"$f":"+'NO PROPIETARIOS adm actuales'!B243","v":0},{"$f":"+'NO PROPIETARIOS adm actuales'!C243","v":0},{"$f":"+'NO PROPIETARIOS adm actuales'!D243","v":""},{"$f":"IF('NO PROPIETARIOS adm actuales'!E243>0,'NO PROPIETARIOS adm actuales'!E243,\"INCOMPLETO RECHAZAR\")","v":"INCOMPLETO RECHAZAR"},731]
[{"$f":"+'NO PROPIETARIOS adm actuales'!A247","v":"l NO PROPIETARIO"},{"$f":"+'NO PROPIETARIOS adm actuales'!B247","v":0},{"$f":"+'NO PROPIETARIOS adm actuales'!C247","v":0},{"$f":"+'NO PROPIETARIOS adm actuales'!D247","v":"NOTA/OBSERVACIÓN -en mayúscula-:"},{"$f":"IF('NO PROPIETARIOS adm actuales'!E247>0,'NO PROPIETARIOS adm actuales'!E247,\"INCOMPLETO RECHAZAR\")","v":"INCOMPLETO RECHAZAR"},732]
[{"$f":"+'NO PROPIETARIOS adm actuales'!A237","v":"l NO PROPIETARIO"},{"$f":"+'NO PROPIETARIOS adm actuales'!B237","v":0},{"$f":"+'NO PROPIETARIOS adm actuales'!C237","v":0},{"$f":"+'NO PROPIETARIOS adm actuales'!D237","v":"PROFESIÓN/OFICIO:"},{"$f":"IF('NO PROPIETARIOS adm actuales'!E237>0,'NO PROPIETARIOS adm actuales'!E237,\"INCOMPLETO RECHAZAR\")","v":"INCOMPLETO RECHAZAR"},733]
[{"$f":"+'ANTERIORES PROP'!A8","v":"c ANT. PROP PH"},{"$f":"+'ANTERIORES PROP'!B8","v":0},{"$f":"+'ANTERIORES PROP'!C8","v":0},{"$f":"+'ANTERIORES PROP'!D8","v":"DOC. IDENTIDAD –sin puntos-:"},{"$f":"IF('ANTERIORES PROP'!B8>0,'ANTERIORES PROP'!B8,\"INCOMPLETO RECHAZAR\")","v":"INCOMPLETO RECHAZAR"}]
[{"$f":"+'ANTERIORES PROP'!A9","v":"c ANT. PROP PH"},{"$f":"+'ANTERIORES PROP'!B9","v":0},{"$f":"+'ANTERIORES PROP'!C9","v":0},{"$f":"+'ANTERIORES PROP'!D9","v":"CUIT/CUIL –sin puntos ni barras-:"},{"$f":"IF('ANTERIORES PROP'!B9>0,'ANTERIORES PROP'!B9,\"INCOMPLETO RECHAZAR\")","v":"INCOMPLETO RECHAZAR"}]
[{"$f":"+'ANTERIORES PROP'!A10","v":"c ANT. PROP PH"},{"$f":"+'ANTERIORES PROP'!B10","v":0},{"$f":"+'ANTERIORES PROP'!C10","v":0},{"$f":"+'ANTERIORES PROP'!D10","v":"FECHA DE NACIMIENTO –dd/mm/aa-:"},{"$f":"IF('ANTERIORES PROP'!B10>0,'ANTERIORES PROP'!B10,\"INCOMPLETO RECHAZAR\")","v":"INCOMPLETO RECHAZAR"}]
[{"$f":"+'ANTERIORES PROP'!A11","v":"c ANT. PROP PH"},{"$f":"+'ANTERIORES PROP'!B11","v":0},{"$f":"+'ANTERIORES PROP'!C11","v":0},{"$f":"+'ANTERIORES PROP'!D11","v":"LUGAR DE NACIMIENTO:"},{"$f":"IF('ANTERIORES PROP'!B11>0,'ANTERIORES PROP'!B11,\"INCOMPLETO RECHAZAR\")","v":"INCOMPLETO RECHAZAR"}]
[{"$f":"+'ANTERIORES PROP'!A12","v":"c ANT. PROP PH"},{"$f":"+'ANTERIORES PROP'!B12","v":0},{"$f":"+'ANTERIORES PROP'!C12","v":0},{"$f":"+'ANTERIORES PROP'!D12","v":"NACIONALIDAD:"},{"$f":"IF('ANTERIORES PROP'!B12>0,'ANTERIORES PROP'!B12,\"INCOMPLETO RECHAZAR\")","v":"INCOMPLETO RECHAZAR"}]
[{"$f":"+'ANTERIORES PROP'!A13","v":"c ANT. PROP PH"},{"$f":"+'ANTERIORES PROP'!B13","v":0},{"$f":"+'ANTERIORES PROP'!C13","v":0},{"$f":"+'ANTERIORES PROP'!D13","v":"PROFESIÓN/OFICIO:"},{"$f":"IF('ANTERIORES PROP'!B13>0,'ANTERIORES PROP'!B13,\"INCOMPLETO RECHAZAR\")","v":"INCOMPLETO RECHAZAR"}]
[{"$f":"+'ANTERIORES PROP'!A14","v":"c ANT. PROP PH"},{"$f":"+'ANTERIORES PROP'!B14","v":0},{"$f":"+'ANTERIORES PROP'!C14","v":0},{"$f":"+'ANTERIORES PROP'!D14","v":"DOMICILIO REAL:"},{"$f":"IF('ANTERIORES PROP'!B14>0,'ANTERIORES PROP'!B14,\"INCOMPLETO RECHAZAR\")","v":"INCOMPLETO RECHAZAR"}]
[{"$f":"+'ANTERIORES PROP'!A15","v":"c ANT. PROP PH"},{"$f":"+'ANTERIORES PROP'!B15","v":0},{"$f":"+'ANTERIORES PROP'!C15","v":0},{"$f":"+'ANTERIORES PROP'!D15","v":"CEL/TEL :"},{"$f":"IF('ANTERIORES PROP'!B15>0,'ANTERIORES PROP'!B15,\"INCOMPLETO RECHAZAR\")","v":"INCOMPLETO RECHAZAR"}]
[{"$f":"+'ANTERIORES PROP'!A16","v":"c ANT. PROP PH"},{"$f":"+'ANTERIORES PROP'!B16","v":0},{"$f":"+'ANTERIORES PROP'!C16","v":0},{"$f":"+'ANTERIORES PROP'!D16","v":"EMAIL:"},{"$f":"IF('ANTERIORES PROP'!B16>0,'ANTERIORES PROP'!B16,\"INCOMPLETO RECHAZAR\")","v":"INCOMPLETO RECHAZAR"}]
[{"$f":"+'ANTERIORES PROP'!A17","v":"c ANT. PROP PH"},{"$f":"+'ANTERIORES PROP'!B17","v":0},{"$f":"+'ANTERIORES PROP'!C17","v":0},{"$f":"+'ANTERIORES PROP'!D17","v":"ESTADO CIVIL:"},{"$f":"IF('ANTERIORES PROP'!B17>0,'ANTERIORES PROP'!B17,\"INCOMPLETO RECHAZAR\")","v":"INCOMPLETO RECHAZAR"}]
[{"$f":"+'ANTERIORES PROP'!A18","v":"c ANT. PROP PH"},{"$f":"+'ANTERIORES PROP'!B18","v":0},{"$f":"+'ANTERIORES PROP'!C18","v":0},{"$f":"+'ANTERIORES PROP'!D18","v":""},{"$f":"IF('ANTERIORES PROP'!B18>0,'ANTERIORES PROP'!B18,\"INCOMPLETO RECHAZAR\")","v":"INCOMPLETO RECHAZAR"}]
[{"$f":"+'ANTERIORES PROP'!A19","v":"c ANT. PROP PH"},{"$f":"+'ANTERIORES PROP'!B19","v":0},{"$f":"+'ANTERIORES PROP'!C19","v":0},{"$f":"+'ANTERIORES PROP'!D19","v":""},{"$f":"IF('ANTERIORES PROP'!B19>0,'ANTERIORES PROP'!B19,\"INCOMPLETO RECHAZAR\")","v":"INCOMPLETO RECHAZAR"}]
[{"$f":"+'ANTERIORES PROP'!A20","v":"c ANT. PROP PH"},{"$f":"+'ANTERIORES PROP'!B20","v":0},{"$f":"+'ANTERIORES PROP'!C20","v":0},{"$f":"+'ANTERIORES PROP'!D20","v":""},{"$f":"IF('ANTERIORES PROP'!B20>0,'ANTERIORES PROP'!B20,\"INCOMPLETO RECHAZAR\")","v":"INCOMPLETO RECHAZAR"}]
[{"$f":"+'ANTERIORES PROP'!A21","v":"c ANT. PROP PH"},{"$f":"+'ANTERIORES PROP'!B21","v":0},{"$f":"+'ANTERIORES PROP'!C21","v":0},{"$f":"+'ANTERIORES PROP'!D21","v":"NOTA/OBSERVACIÓN -en mayúscula-:"},{"$f":"IF('ANTERIORES PROP'!B21>0,'ANTERIORES PROP'!B21,\"INCOMPLETO RECHAZAR\")","v":"INCOMPLETO RECHAZAR"}]
[{"$f":"+'ANTERIORES PROP'!A22","v":"c ANT. PROP PH"},{"$f":"+'ANTERIORES PROP'!B22","v":0},{"$f":"+'ANTERIORES PROP'!C22","v":0},{"$f":"+'ANTERIORES PROP'!D22","v":"DOC. IDENTIDAD –sin puntos-:"},{"$f":"IF('ANTERIORES PROP'!B22>0,'ANTERIORES PROP'!B22,\"INCOMPLETO RECHAZAR\")","v":"INCOMPLETO RECHAZAR"}]
[{"$f":"+'ANTERIORES PROP'!A23","v":"c ANT. PROP PH"},{"$f":"+'ANTERIORES PROP'!B23","v":0},{"$f":"+'ANTERIORES PROP'!C23","v":0},{"$f":"+'ANTERIORES PROP'!D23","v":"CUIT/CUIL –sin puntos ni barras-:"},{"$f":"IF('ANTERIORES PROP'!B23>0,'ANTERIORES PROP'!B23,\"INCOMPLETO RECHAZAR\")","v":"INCOMPLETO RECHAZAR"}]
[{"$f":"+'ANTERIORES PROP'!A24","v":"c ANT. PROP PH"},{"$f":"+'ANTERIORES PROP'!B24","v":0},{"$f":"+'ANTERIORES PROP'!C24","v":0},{"$f":"+'ANTERIORES PROP'!D24","v":"FECHA DE NACIMIENTO –dd/mm/aa-:"},{"$f":"IF('ANTERIORES PROP'!B24>0,'ANTERIORES PROP'!B24,\"INCOMPLETO RECHAZAR\")","v":"INCOMPLETO RECHAZAR"}]
[{"$f":"+'ANTERIORES PROP'!A25","v":"c ANT. PROP PH"},{"$f":"+'ANTERIORES PROP'!B25","v":0},{"$f":"+'ANTERIORES PROP'!C25","v":0},{"$f":"+'ANTERIORES PROP'!D25","v":"LUGAR DE NACIMIENTO:"},{"$f":"IF('ANTERIORES PROP'!B25>0,'ANTERIORES PROP'!B25,\"INCOMPLETO RECHAZAR\")","v":"INCOMPLETO RECHAZAR"}]
[{"$f":"+'ANTERIORES PROP'!A26","v":"c ANT. PROP PH"},{"$f":"+'ANTERIORES PROP'!B26","v":0},{"$f":"+'ANTERIORES PROP'!C26","v":0},{"$f":"+'ANTERIORES PROP'!D26","v":"NACIONALIDAD:"},{"$f":"IF('ANTERIORES PROP'!B26>0,'ANTERIORES PROP'!B26,\"INCOMPLETO RECHAZAR\")","v":"INCOMPLETO RECHAZAR"}]
[{"$f":"+'ANTERIORES PROP'!A27","v":"c ANT. PROP PH"},{"$f":"+'ANTERIORES PROP'!B27","v":0},{"$f":"+'ANTERIORES PROP'!C27","v":0},{"$f":"+'ANTERIORES PROP'!D27","v":"PROFESIÓN/OFICIO:"},{"$f":"IF('ANTERIORES PROP'!B27>0,'ANTERIORES PROP'!B27,\"INCOMPLETO RECHAZAR\")","v":"INCOMPLETO RECHAZAR"}]
[{"$f":"+'ANTERIORES PROP'!A28","v":"c ANT. PROP PH"},{"$f":"+'ANTERIORES PROP'!B28","v":0},{"$f":"+'ANTERIORES PROP'!C28","v":0},{"$f":"+'ANTERIORES PROP'!D28","v":"DOMICILIO REAL:"},{"$f":"IF('ANTERIORES PROP'!B28>0,'ANTERIORES PROP'!B28,\"INCOMPLETO RECHAZAR\")","v":"INCOMPLETO RECHAZAR"}]
[{"$f":"+'ANTERIORES PROP'!A29","v":"c ANT. PROP PH"},{"$f":"+'ANTERIORES PROP'!B29","v":0},{"$f":"+'ANTERIORES PROP'!C29","v":0},{"$f":"+'ANTERIORES PROP'!D29","v":"CEL/TEL :"},{"$f":"IF('ANTERIORES PROP'!B29>0,'ANTERIORES PROP'!B29,\"INCOMPLETO RECHAZAR\")","v":"INCOMPLETO RECHAZAR"}]
[{"$f":"+'ANTERIORES PROP'!A30","v":"c ANT. PROP PH"},{"$f":"+'ANTERIORES PROP'!B30","v":0},{"$f":"+'ANTERIORES PROP'!C30","v":0},{"$f":"+'ANTERIORES PROP'!D30","v":"EMAIL:"},{"$f":"IF('ANTERIORES PROP'!B30>0,'ANTERIORES PROP'!B30,\"INCOMPLETO RECHAZAR\")","v":"INCOMPLETO RECHAZAR"}]
[{"$f":"+'ANTERIORES PROP'!A31","v":"c ANT. PROP PH"},{"$f":"+'ANTERIORES PROP'!B31","v":0},{"$f":"+'ANTERIORES PROP'!C31","v":0},{"$f":"+'ANTERIORES PROP'!D31","v":"ESTADO CIVIL:"},{"$f":"IF('ANTERIORES PROP'!B31>0,'ANTERIORES PROP'!B31,\"INCOMPLETO RECHAZAR\")","v":"INCOMPLETO RECHAZAR"}]
[{"$f":"+'ANTERIORES PROP'!A32","v":"c ANT. PROP PH"},{"$f":"+'ANTERIORES PROP'!B32","v":0},{"$f":"+'ANTERIORES PROP'!C32","v":0},{"$f":"+'ANTERIORES PROP'!D32","v":""},{"$f":"IF('ANTERIORES PROP'!B32>0,'ANTERIORES PROP'!B32,\"INCOMPLETO RECHAZAR\")","v":"INCOMPLETO RECHAZAR"}]
[{"$f":"+'ANTERIORES PROP'!A33","v":"c ANT. PROP PH"},{"$f":"+'ANTERIORES PROP'!B33","v":0},{"$f":"+'ANTERIORES PROP'!C33","v":0},{"$f":"+'ANTERIORES PROP'!D33","v":""},{"$f":"IF('ANTERIORES PROP'!B33>0,'ANTERIORES PROP'!B33,\"INCOMPLETO RECHAZAR\")","v":"INCOMPLETO RECHAZAR"}]
[{"$f":"+'ANTERIORES PROP'!A34","v":"c ANT. PROP PH"},{"$f":"+'ANTERIORES PROP'!B34","v":0},{"$f":"+'ANTERIORES PROP'!C34","v":0},{"$f":"+'ANTERIORES PROP'!D34","v":""},{"$f":"IF('ANTERIORES PROP'!B34>0,'ANTERIORES PROP'!B34,\"INCOMPLETO RECHAZAR\")","v":"INCOMPLETO RECHAZAR"}]
[{"$f":"+'ANTERIORES PROP'!A35","v":"c ANT. PROP PH"},{"$f":"+'ANTERIORES PROP'!B35","v":0},{"$f":"+'ANTERIORES PROP'!C35","v":0},{"$f":"+'ANTERIORES PROP'!D35","v":"NOTA/OBSERVACIÓN -en mayúscula-:"},{"$f":"IF('ANTERIORES PROP'!B35>0,'ANTERIORES PROP'!B35,\"INCOMPLETO RECHAZAR\")","v":"INCOMPLETO RECHAZAR"}]
[{"$f":"+'ANTERIORES PROP'!A36","v":"c ANT. PROP PH"},{"$f":"+'ANTERIORES PROP'!B36","v":0},{"$f":"+'ANTERIORES PROP'!C36","v":0},{"$f":"+'ANTERIORES PROP'!D36","v":"DOC. IDENTIDAD –sin puntos-:"},{"$f":"IF('ANTERIORES PROP'!B36>0,'ANTERIORES PROP'!B36,\"INCOMPLETO RECHAZAR\")","v":"INCOMPLETO RECHAZAR"}]
[{"$f":"+'ANTERIORES PROP'!A37","v":"c ANT. PROP PH"},{"$f":"+'ANTERIORES PROP'!B37","v":0},{"$f":"+'ANTERIORES PROP'!C37","v":0},{"$f":"+'ANTERIORES PROP'!D37","v":"CUIT/CUIL –sin puntos ni barras-:"},{"$f":"IF('ANTERIORES PROP'!B37>0,'ANTERIORES PROP'!B37,\"INCOMPLETO RECHAZAR\")","v":"INCOMPLETO RECHAZAR"}]
[{"$f":"+'ANTERIORES PROP'!A38","v":"c ANT. PROP PH"},{"$f":"+'ANTERIORES PROP'!B38","v":0},{"$f":"+'ANTERIORES PROP'!C38","v":0},{"$f":"+'ANTERIORES PROP'!D38","v":"FECHA DE NACIMIENTO –dd/mm/aa-:"},{"$f":"IF('ANTERIORES PROP'!B38>0,'ANTERIORES PROP'!B38,\"INCOMPLETO RECHAZAR\")","v":"INCOMPLETO RECHAZAR"}]
[{"$f":"+'ANTERIORES PROP'!A39","v":"c ANT. PROP PH"},{"$f":"+'ANTERIORES PROP'!B39","v":0},{"$f":"+'ANTERIORES PROP'!C39","v":0},{"$f":"+'ANTERIORES PROP'!D39","v":"LUGAR DE NACIMIENTO:"},{"$f":"IF('ANTERIORES PROP'!B39>0,'ANTERIORES PROP'!B39,\"INCOMPLETO RECHAZAR\")","v":"INCOMPLETO RECHAZAR"}]
[{"$f":"+'ANTERIORES PROP'!A40","v":"c ANT. PROP PH"},{"$f":"+'ANTERIORES PROP'!B40","v":0},{"$f":"+'ANTERIORES PROP'!C40","v":0},{"$f":"+'ANTERIORES PROP'!D40","v":"NACIONALIDAD:"},{"$f":"IF('ANTERIORES PROP'!B40>0,'ANTERIORES PROP'!B40,\"INCOMPLETO RECHAZAR\")","v":"INCOMPLETO RECHAZAR"}]
[{"$f":"+'ANTERIORES PROP'!A41","v":"c ANT. PROP PH"},{"$f":"+'ANTERIORES PROP'!B41","v":0},{"$f":"+'ANTERIORES PROP'!C41","v":0},{"$f":"+'ANTERIORES PROP'!D41","v":"PROFESIÓN/OFICIO:"},{"$f":"IF('ANTERIORES PROP'!B41>0,'ANTERIORES PROP'!B41,\"INCOMPLETO RECHAZAR\")","v":"INCOMPLETO RECHAZAR"}]
[{"$f":"+'ANTERIORES PROP'!A42","v":"c ANT. PROP PH"},{"$f":"+'ANTERIORES PROP'!B42","v":0},{"$f":"+'ANTERIORES PROP'!C42","v":0},{"$f":"+'ANTERIORES PROP'!D42","v":"DOMICILIO REAL:"},{"$f":"IF('ANTERIORES PROP'!B42>0,'ANTERIORES PROP'!B42,\"INCOMPLETO RECHAZAR\")","v":"INCOMPLETO RECHAZAR"}]
[{"$f":"+'ANTERIORES PROP'!A43","v":"c ANT. PROP PH"},{"$f":"+'ANTERIORES PROP'!B43","v":0},{"$f":"+'ANTERIORES PROP'!C43","v":0},{"$f":"+'ANTERIORES PROP'!D43","v":"CEL/TEL :"},{"$f":"IF('ANTERIORES PROP'!B43>0,'ANTERIORES PROP'!B43,\"INCOMPLETO RECHAZAR\")","v":"INCOMPLETO RECHAZAR"}]
[{"$f":"+'ANTERIORES PROP'!A44","v":"c ANT. PROP PH"},{"$f":"+'ANTERIORES PROP'!B44","v":0},{"$f":"+'ANTERIORES PROP'!C44","v":0},{"$f":"+'ANTERIORES PROP'!D44","v":"EMAIL:"},{"$f":"IF('ANTERIORES PROP'!B44>0,'ANTERIORES PROP'!B44,\"INCOMPLETO RECHAZAR\")","v":"INCOMPLETO RECHAZAR"}]
[{"$f":"+'ANTERIORES PROP'!A45","v":"c ANT. PROP PH"},{"$f":"+'ANTERIORES PROP'!B45","v":0},{"$f":"+'ANTERIORES PROP'!C45","v":0},{"$f":"+'ANTERIORES PROP'!D45","v":"ESTADO CIVIL:"},{"$f":"IF('ANTERIORES PROP'!B45>0,'ANTERIORES PROP'!B45,\"INCOMPLETO RECHAZAR\")","v":"INCOMPLETO RECHAZAR"}]
[{"$f":"+'ANTERIORES PROP'!A46","v":"c ANT. PROP PH"},{"$f":"+'ANTERIORES PROP'!B46","v":0},{"$f":"+'ANTERIORES PROP'!C46","v":0},{"$f":"+'ANTERIORES PROP'!D46","v":""},{"$f":"IF('ANTERIORES PROP'!B46>0,'ANTERIORES PROP'!B46,\"INCOMPLETO RECHAZAR\")","v":"INCOMPLETO RECHAZAR"}]
[{"$f":"+'ANTERIORES PROP'!A47","v":"c ANT. PROP PH"},{"$f":"+'ANTERIORES PROP'!B47","v":0},{"$f":"+'ANTERIORES PROP'!C47","v":0},{"$f":"+'ANTERIORES PROP'!D47","v":""},{"$f":"IF('ANTERIORES PROP'!B47>0,'ANTERIORES PROP'!B47,\"INCOMPLETO RECHAZAR\")","v":"INCOMPLETO RECHAZAR"}]
[{"$f":"+'ANTERIORES PROP'!A48","v":"c ANT. PROP PH"},{"$f":"+'ANTERIORES PROP'!B48","v":0},{"$f":"+'ANTERIORES PROP'!C48","v":0},{"$f":"+'ANTERIORES PROP'!D48","v":""},{"$f":"IF('ANTERIORES PROP'!B48>0,'ANTERIORES PROP'!B48,\"INCOMPLETO RECHAZAR\")","v":"INCOMPLETO RECHAZAR"}]
[{"$f":"+'ANTERIORES PROP'!A49","v":"c ANT. PROP PH"},{"$f":"+'ANTERIORES PROP'!B49","v":0},{"$f":"+'ANTERIORES PROP'!C49","v":0},{"$f":"+'ANTERIORES PROP'!D49","v":"NOTA/OBSERVACIÓN -en mayúscula-:"},{"$f":"IF('ANTERIORES PROP'!B49>0,'ANTERIORES PROP'!B49,\"INCOMPLETO RECHAZAR\")","v":"INCOMPLETO RECHAZAR"}]
[{"$f":"+'ANTERIORES PROP'!A50","v":"c ANT. PROP PH"},{"$f":"+'ANTERIORES PROP'!B50","v":0},{"$f":"+'ANTERIORES PROP'!C50","v":0},{"$f":"+'ANTERIORES PROP'!D50","v":"DOC. IDENTIDAD –sin puntos-:"},{"$f":"IF('ANTERIORES PROP'!B50>0,'ANTERIORES PROP'!B50,\"INCOMPLETO RECHAZAR\")","v":"INCOMPLETO RECHAZAR"}]
[{"$f":"+'ANTERIORES PROP'!A51","v":"c ANT. PROP PH"},{"$f":"+'ANTERIORES PROP'!B51","v":0},{"$f":"+'ANTERIORES PROP'!C51","v":0},{"$f":"+'ANTERIORES PROP'!D51","v":"CUIT/CUIL –sin puntos ni barras-:"},{"$f":"IF('ANTERIORES PROP'!B51>0,'ANTERIORES PROP'!B51,\"INCOMPLETO RECHAZAR\")","v":"INCOMPLETO RECHAZAR"}]
[{"$f":"+'ANTERIORES PROP'!A52","v":"c ANT. PROP PH"},{"$f":"+'ANTERIORES PROP'!B52","v":0},{"$f":"+'ANTERIORES PROP'!C52","v":0},{"$f":"+'ANTERIORES PROP'!D52","v":"FECHA DE NACIMIENTO –dd/mm/aa-:"},{"$f":"IF('ANTERIORES PROP'!B52>0,'ANTERIORES PROP'!B52,\"INCOMPLETO RECHAZAR\")","v":"INCOMPLETO RECHAZAR"}]
[{"$f":"+'ANTERIORES PROP'!A53","v":"c ANT. PROP PH"},{"$f":"+'ANTERIORES PROP'!B53","v":0},{"$f":"+'ANTERIORES PROP'!C53","v":0},{"$f":"+'ANTERIORES PROP'!D53","v":"LUGAR DE NACIMIENTO:"},{"$f":"IF('ANTERIORES PROP'!B53>0,'ANTERIORES PROP'!B53,\"INCOMPLETO RECHAZAR\")","v":"INCOMPLETO RECHAZAR"}]
[{"$f":"+'ANTERIORES PROP'!A54","v":"c ANT. PROP PH"},{"$f":"+'ANTERIORES PROP'!B54","v":0},{"$f":"+'ANTERIORES PROP'!C54","v":0},{"$f":"+'ANTERIORES PROP'!D54","v":"NACIONALIDAD:"},{"$f":"IF('ANTERIORES PROP'!B54>0,'ANTERIORES PROP'!B54,\"INCOMPLETO RECHAZAR\")","v":"INCOMPLETO RECHAZAR"}]
[{"$f":"+'ANTERIORES PROP'!A55","v":"c ANT. PROP PH"},{"$f":"+'ANTERIORES PROP'!B55","v":0},{"$f":"+'ANTERIORES PROP'!C55","v":0},{"$f":"+'ANTERIORES PROP'!D55","v":"PROFESIÓN/OFICIO:"},{"$f":"IF('ANTERIORES PROP'!B55>0,'ANTERIORES PROP'!B55,\"INCOMPLETO RECHAZAR\")","v":"INCOMPLETO RECHAZAR"}]
[{"$f":"+'ANTERIORES PROP'!A56","v":"c ANT. PROP PH"},{"$f":"+'ANTERIORES PROP'!B56","v":0},{"$f":"+'ANTERIORES PROP'!C56","v":0},{"$f":"+'ANTERIORES PROP'!D56","v":"DOMICILIO REAL:"},{"$f":"IF('ANTERIORES PROP'!B56>0,'ANTERIORES PROP'!B56,\"INCOMPLETO RECHAZAR\")","v":"INCOMPLETO RECHAZAR"}]
[{"$f":"+'ANTERIORES PROP'!A57","v":"c ANT. PROP PH"},{"$f":"+'ANTERIORES PROP'!B57","v":0},{"$f":"+'ANTERIORES PROP'!C57","v":0},{"$f":"+'ANTERIORES PROP'!D57","v":"CEL/TEL :"},{"$f":"IF('ANTERIORES PROP'!B57>0,'ANTERIORES PROP'!B57,\"INCOMPLETO RECHAZAR\")","v":"INCOMPLETO RECHAZAR"}]
[{"$f":"+'ANTERIORES PROP'!A58","v":"c ANT. PROP PH"},{"$f":"+'ANTERIORES PROP'!B58","v":0},{"$f":"+'ANTERIORES PROP'!C58","v":0},{"$f":"+'ANTERIORES PROP'!D58","v":"EMAIL:"},{"$f":"IF('ANTERIORES PROP'!B58>0,'ANTERIORES PROP'!B58,\"INCOMPLETO RECHAZAR\")","v":"INCOMPLETO RECHAZAR"}]
[{"$f":"+'ANTERIORES PROP'!A59","v":"c ANT. PROP PH"},{"$f":"+'ANTERIORES PROP'!B59","v":0},{"$f":"+'ANTERIORES PROP'!C59","v":0},{"$f":"+'ANTERIORES PROP'!D59","v":"ESTADO CIVIL:"},{"$f":"IF('ANTERIORES PROP'!B59>0,'ANTERIORES PROP'!B59,\"INCOMPLETO RECHAZAR\")","v":"INCOMPLETO RECHAZAR"}]
[{"$f":"+'ANTERIORES PROP'!A60","v":"c ANT. PROP PH"},{"$f":"+'ANTERIORES PROP'!B60","v":0},{"$f":"+'ANTERIORES PROP'!C60","v":0},{"$f":"+'ANTERIORES PROP'!D60","v":""},{"$f":"IF('ANTERIORES PROP'!B60>0,'ANTERIORES PROP'!B60,\"INCOMPLETO RECHAZAR\")","v":"INCOMPLETO RECHAZAR"}]
[{"$f":"+'ANTERIORES PROP'!A61","v":"c ANT. PROP PH"},{"$f":"+'ANTERIORES PROP'!B61","v":0},{"$f":"+'ANTERIORES PROP'!C61","v":0},{"$f":"+'ANTERIORES PROP'!D61","v":""},{"$f":"IF('ANTERIORES PROP'!B61>0,'ANTERIORES PROP'!B61,\"INCOMPLETO RECHAZAR\")","v":"INCOMPLETO RECHAZAR"}]
[{"$f":"+'ANTERIORES PROP'!A62","v":"c ANT. PROP PH"},{"$f":"+'ANTERIORES PROP'!B62","v":0},{"$f":"+'ANTERIORES PROP'!C62","v":0},{"$f":"+'ANTERIORES PROP'!D62","v":""},{"$f":"IF('ANTERIORES PROP'!B62>0,'ANTERIORES PROP'!B62,\"INCOMPLETO RECHAZAR\")","v":"INCOMPLETO RECHAZAR"}]
[{"$f":"+'ANTERIORES PROP'!A63","v":"c ANT. PROP PH"},{"$f":"+'ANTERIORES PROP'!B63","v":0},{"$f":"+'ANTERIORES PROP'!C63","v":0},{"$f":"+'ANTERIORES PROP'!D63","v":"NOTA/OBSERVACIÓN -en mayúscula-:"},{"$f":"IF('ANTERIORES PROP'!B63>0,'ANTERIORES PROP'!B63,\"INCOMPLETO RECHAZAR\")","v":"INCOMPLETO RECHAZAR"}]
[{"$f":"+'ANTERIORES PROP'!A64","v":"c ANT. PROP PH"},{"$f":"+'ANTERIORES PROP'!B64","v":0},{"$f":"+'ANTERIORES PROP'!C64","v":0},{"$f":"+'ANTERIORES PROP'!D64","v":"DOC. IDENTIDAD –sin puntos-:"},{"$f":"IF('ANTERIORES PROP'!B64>0,'ANTERIORES PROP'!B64,\"INCOMPLETO RECHAZAR\")","v":"INCOMPLETO RECHAZAR"}]
[{"$f":"+'ANTERIORES PROP'!A65","v":"c ANT. PROP PH"},{"$f":"+'ANTERIORES PROP'!B65","v":0},{"$f":"+'ANTERIORES PROP'!C65","v":0},{"$f":"+'ANTERIORES PROP'!D65","v":"CUIT/CUIL –sin puntos ni barras-:"},{"$f":"IF('ANTERIORES PROP'!B65>0,'ANTERIORES PROP'!B65,\"INCOMPLETO RECHAZAR\")","v":"INCOMPLETO RECHAZAR"}]
[{"$f":"+'ANTERIORES PROP'!A66","v":"c ANT. PROP PH"},{"$f":"+'ANTERIORES PROP'!B66","v":0},{"$f":"+'ANTERIORES PROP'!C66","v":0},{"$f":"+'ANTERIORES PROP'!D66","v":"FECHA DE NACIMIENTO –dd/mm/aa-:"},{"$f":"IF('ANTERIORES PROP'!B66>0,'ANTERIORES PROP'!B66,\"INCOMPLETO RECHAZAR\")","v":"INCOMPLETO RECHAZAR"}]
[{"$f":"+'ANTERIORES PROP'!A67","v":"c ANT. PROP PH"},{"$f":"+'ANTERIORES PROP'!B67","v":0},{"$f":"+'ANTERIORES PROP'!C67","v":0},{"$f":"+'ANTERIORES PROP'!D67","v":"LUGAR DE NACIMIENTO:"},{"$f":"IF('ANTERIORES PROP'!B67>0,'ANTERIORES PROP'!B67,\"INCOMPLETO RECHAZAR\")","v":"INCOMPLETO RECHAZAR"}]
[{"$f":"+'ANTERIORES PROP'!A68","v":"c ANT. PROP PH"},{"$f":"+'ANTERIORES PROP'!B68","v":0},{"$f":"+'ANTERIORES PROP'!C68","v":0},{"$f":"+'ANTERIORES PROP'!D68","v":"NACIONALIDAD:"},{"$f":"IF('ANTERIORES PROP'!B68>0,'ANTERIORES PROP'!B68,\"INCOMPLETO RECHAZAR\")","v":"INCOMPLETO RECHAZAR"}]
[{"$f":"+'ANTERIORES PROP'!A69","v":"c ANT. PROP PH"},{"$f":"+'ANTERIORES PROP'!B69","v":0},{"$f":"+'ANTERIORES PROP'!C69","v":0},{"$f":"+'ANTERIORES PROP'!D69","v":"PROFESIÓN/OFICIO:"},{"$f":"IF('ANTERIORES PROP'!B69>0,'ANTERIORES PROP'!B69,\"INCOMPLETO RECHAZAR\")","v":"INCOMPLETO RECHAZAR"}]
[{"$f":"+'ANTERIORES PROP'!A70","v":"c ANT. PROP PH"},{"$f":"+'ANTERIORES PROP'!B70","v":0},{"$f":"+'ANTERIORES PROP'!C70","v":0},{"$f":"+'ANTERIORES PROP'!D70","v":"DOMICILIO REAL:"},{"$f":"IF('ANTERIORES PROP'!B70>0,'ANTERIORES PROP'!B70,\"INCOMPLETO RECHAZAR\")","v":"INCOMPLETO RECHAZAR"}]
[{"$f":"+'ANTERIORES PROP'!A71","v":"c ANT. PROP PH"},{"$f":"+'ANTERIORES PROP'!B71","v":0},{"$f":"+'ANTERIORES PROP'!C71","v":0},{"$f":"+'ANTERIORES PROP'!D71","v":"CEL/TEL :"},{"$f":"IF('ANTERIORES PROP'!B71>0,'ANTERIORES PROP'!B71,\"INCOMPLETO RECHAZAR\")","v":"INCOMPLETO RECHAZAR"}]
[{"$f":"+'ANTERIORES PROP'!A72","v":"c ANT. PROP PH"},{"$f":"+'ANTERIORES PROP'!B72","v":0},{"$f":"+'ANTERIORES PROP'!C72","v":0},{"$f":"+'ANTERIORES PROP'!D72","v":"EMAIL:"},{"$f":"IF('ANTERIORES PROP'!B72>0,'ANTERIORES PROP'!B72,\"INCOMPLETO RECHAZAR\")","v":"INCOMPLETO RECHAZAR"}]
[{"$f":"+'ANTERIORES PROP'!A73","v":"c ANT. PROP PH"},{"$f":"+'ANTERIORES PROP'!B73","v":0},{"$f":"+'ANTERIORES PROP'!C73","v":0},{"$f":"+'ANTERIORES PROP'!D73","v":"ESTADO CIVIL:"},{"$f":"IF('ANTERIORES PROP'!B73>0,'ANTERIORES PROP'!B73,\"INCOMPLETO RECHAZAR\")","v":"INCOMPLETO RECHAZAR"}]
[{"$f":"+'ANTERIORES PROP'!A74","v":"c ANT. PROP PH"},{"$f":"+'ANTERIORES PROP'!B74","v":0},{"$f":"+'ANTERIORES PROP'!C74","v":0},{"$f":"+'ANTERIORES PROP'!D74","v":""},{"$f":"IF('ANTERIORES PROP'!B74>0,'ANTERIORES PROP'!B74,\"INCOMPLETO RECHAZAR\")","v":"INCOMPLETO RECHAZAR"}]
[{"$f":"+'ANTERIORES PROP'!A75","v":"c ANT. PROP PH"},{"$f":"+'ANTERIORES PROP'!B75","v":0},{"$f":"+'ANTERIORES PROP'!C75","v":0},{"$f":"+'ANTERIORES PROP'!D75","v":""},{"$f":"IF('ANTERIORES PROP'!B75>0,'ANTERIORES PROP'!B75,\"INCOMPLETO RECHAZAR\")","v":"INCOMPLETO RECHAZAR"}]
[{"$f":"+'ANTERIORES PROP'!A76","v":"c ANT. PROP PH"},{"$f":"+'ANTERIORES PROP'!B76","v":0},{"$f":"+'ANTERIORES PROP'!C76","v":0},{"$f":"+'ANTERIORES PROP'!D76","v":""},{"$f":"IF('ANTERIORES PROP'!B76>0,'ANTERIORES PROP'!B76,\"INCOMPLETO RECHAZAR\")","v":"INCOMPLETO RECHAZAR"}]
[{"$f":"+'ANTERIORES PROP'!A77","v":"c ANT. PROP PH"},{"$f":"+'ANTERIORES PROP'!B77","v":0},{"$f":"+'ANTERIORES PROP'!C77","v":0},{"$f":"+'ANTERIORES PROP'!D77","v":"NOTA/OBSERVACIÓN -en mayúscula-:"},{"$f":"IF('ANTERIORES PROP'!B77>0,'ANTERIORES PROP'!B77,\"INCOMPLETO RECHAZAR\")","v":"INCOMPLETO RECHAZAR"}]
[{"$f":"+'ANTERIORES PROP'!A78","v":"c ANT. PROP PH"},{"$f":"+'ANTERIORES PROP'!B78","v":0},{"$f":"+'ANTERIORES PROP'!C78","v":0},{"$f":"+'ANTERIORES PROP'!D78","v":"DOC. IDENTIDAD –sin puntos-:"},{"$f":"IF('ANTERIORES PROP'!B78>0,'ANTERIORES PROP'!B78,\"INCOMPLETO RECHAZAR\")","v":"INCOMPLETO RECHAZAR"}]
[{"$f":"+'ANTERIORES PROP'!A79","v":"c ANT. PROP PH"},{"$f":"+'ANTERIORES PROP'!B79","v":0},{"$f":"+'ANTERIORES PROP'!C79","v":0},{"$f":"+'ANTERIORES PROP'!D79","v":"CUIT/CUIL –sin puntos ni barras-:"},{"$f":"IF('ANTERIORES PROP'!B79>0,'ANTERIORES PROP'!B79,\"INCOMPLETO RECHAZAR\")","v":"INCOMPLETO RECHAZAR"}]
[{"$f":"+'ANTERIORES PROP'!A80","v":"c ANT. PROP PH"},{"$f":"+'ANTERIORES PROP'!B80","v":0},{"$f":"+'ANTERIORES PROP'!C80","v":0},{"$f":"+'ANTERIORES PROP'!D80","v":"FECHA DE NACIMIENTO –dd/mm/aa-:"},{"$f":"IF('ANTERIORES PROP'!B80>0,'ANTERIORES PROP'!B80,\"INCOMPLETO RECHAZAR\")","v":"INCOMPLETO RECHAZAR"}]
[{"$f":"+'ANTERIORES PROP'!A81","v":"c ANT. PROP PH"},{"$f":"+'ANTERIORES PROP'!B81","v":0},{"$f":"+'ANTERIORES PROP'!C81","v":0},{"$f":"+'ANTERIORES PROP'!D81","v":"LUGAR DE NACIMIENTO:"},{"$f":"IF('ANTERIORES PROP'!B81>0,'ANTERIORES PROP'!B81,\"INCOMPLETO RECHAZAR\")","v":"INCOMPLETO RECHAZAR"}]
[{"$f":"+'ANTERIORES PROP'!A82","v":"c ANT. PROP PH"},{"$f":"+'ANTERIORES PROP'!B82","v":0},{"$f":"+'ANTERIORES PROP'!C82","v":0},{"$f":"+'ANTERIORES PROP'!D82","v":"NACIONALIDAD:"},{"$f":"IF('ANTERIORES PROP'!B82>0,'ANTERIORES PROP'!B82,\"INCOMPLETO RECHAZAR\")","v":"INCOMPLETO RECHAZAR"}]
[{"$f":"+'ANTERIORES PROP'!A83","v":"c ANT. PROP PH"},{"$f":"+'ANTERIORES PROP'!B83","v":0},{"$f":"+'ANTERIORES PROP'!C83","v":0},{"$f":"+'ANTERIORES PROP'!D83","v":"PROFESIÓN/OFICIO:"},{"$f":"IF('ANTERIORES PROP'!B83>0,'ANTERIORES PROP'!B83,\"INCOMPLETO RECHAZAR\")","v":"INCOMPLETO RECHAZAR"}]
[{"$f":"+'ANTERIORES PROP'!A84","v":"c ANT. PROP PH"},{"$f":"+'ANTERIORES PROP'!B84","v":0},{"$f":"+'ANTERIORES PROP'!C84","v":0},{"$f":"+'ANTERIORES PROP'!D84","v":"DOMICILIO REAL:"},{"$f":"IF('ANTERIORES PROP'!B84>0,'ANTERIORES PROP'!B84,\"INCOMPLETO RECHAZAR\")","v":"INCOMPLETO RECHAZAR"}]
[{"$f":"+'ANTERIORES PROP'!A85","v":"c ANT. PROP PH"},{"$f":"+'ANTERIORES PROP'!B85","v":0},{"$f":"+'ANTERIORES PROP'!C85","v":0},{"$f":"+'ANTERIORES PROP'!D85","v":"CEL/TEL :"},{"$f":"IF('ANTERIORES PROP'!B85>0,'ANTERIORES PROP'!B85,\"INCOMPLETO RECHAZAR\")","v":"INCOMPLETO RECHAZAR"}]
[{"$f":"+'ANTERIORES PROP'!A86","v":"c ANT. PROP PH"},{"$f":"+'ANTERIORES PROP'!B86","v":0},{"$f":"+'ANTERIORES PROP'!C86","v":0},{"$f":"+'ANTERIORES PROP'!D86","v":"EMAIL:"},{"$f":"IF('ANTERIORES PROP'!B86>0,'ANTERIORES PROP'!B86,\"INCOMPLETO RECHAZAR\")","v":"INCOMPLETO RECHAZAR"}]
[{"$f":"+'ANTERIORES PROP'!A87","v":"c ANT. PROP PH"},{"$f":"+'ANTERIORES PROP'!B87","v":0},{"$f":"+'ANTERIORES PROP'!C87","v":0},{"$f":"+'ANTERIORES PROP'!D87","v":"ESTADO CIVIL:"},{"$f":"IF('ANTERIORES PROP'!B87>0,'ANTERIORES PROP'!B87,\"INCOMPLETO RECHAZAR\")","v":"INCOMPLETO RECHAZAR"}]
[{"$f":"+'ANTERIORES PROP'!A88","v":"c ANT. PROP PH"},{"$f":"+'ANTERIORES PROP'!B88","v":0},{"$f":"+'ANTERIORES PROP'!C88","v":0},{"$f":"+'ANTERIORES PROP'!D88","v":""},{"$f":"IF('ANTERIORES PROP'!B88>0,'ANTERIORES PROP'!B88,\"INCOMPLETO RECHAZAR\")","v":"INCOMPLETO RECHAZAR"}]
[{"$f":"+'ANTERIORES PROP'!A89","v":"c ANT. PROP PH"},{"$f":"+'ANTERIORES PROP'!B89","v":0},{"$f":"+'ANTERIORES PROP'!C89","v":0},{"$f":"+'ANTERIORES PROP'!D89","v":""},{"$f":"IF('ANTERIORES PROP'!B89>0,'ANTERIORES PROP'!B89,\"INCOMPLETO RECHAZAR\")","v":"INCOMPLETO RECHAZAR"}]
[{"$f":"+'ANTERIORES PROP'!A90","v":"c ANT. PROP PH"},{"$f":"+'ANTERIORES PROP'!B90","v":0},{"$f":"+'ANTERIORES PROP'!C90","v":0},{"$f":"+'ANTERIORES PROP'!D90","v":""},{"$f":"IF('ANTERIORES PROP'!B90>0,'ANTERIORES PROP'!B90,\"INCOMPLETO RECHAZAR\")","v":"INCOMPLETO RECHAZAR"}]
[{"$f":"+'ANTERIORES PROP'!A91","v":"c ANT. PROP PH"},{"$f":"+'ANTERIORES PROP'!B91","v":0},{"$f":"+'ANTERIORES PROP'!C91","v":0},{"$f":"+'ANTERIORES PROP'!D91","v":"NOTA/OBSERVACIÓN -en mayúscula-:"},{"$f":"IF('ANTERIORES PROP'!B91>0,'ANTERIORES PROP'!B91,\"INCOMPLETO RECHAZAR\")","v":"INCOMPLETO RECHAZAR"}]
[{"$f":"+'ANTERIORES PROP'!G8","v":"a ANT. PROP PJ"},{"$f":"+'ANTERIORES PROP'!H8","v":0},{"$f":"+'ANTERIORES PROP'!H8","v":0},{"$f":"+'ANTERIORES PROP'!I8","v":"CUIT –sin puntos ni barras-:"},{"$f":"IF('ANTERIORES PROP'!H8>0,'ANTERIORES PROP'!H8,\"INCOMPLETO RECHAZAR\")","v":"INCOMPLETO RECHAZAR"}]
[{"$f":"+'ANTERIORES PROP'!G9","v":"a ANT. PROP PJ"},{"$f":"+'ANTERIORES PROP'!H9","v":0},{"$f":"+'ANTERIORES PROP'!H9","v":0},{"$f":"+'ANTERIORES PROP'!I9","v":"TIPO DE PERSONA JCA -FONDO DE COMERCIO, asociación, mutual, etc-:"},{"$f":"IF('ANTERIORES PROP'!H9>0,'ANTERIORES PROP'!H9,\"INCOMPLETO RECHAZAR\")","v":"INCOMPLETO RECHAZAR"}]
[{"$f":"+'ANTERIORES PROP'!G10","v":"a ANT. PROP PJ"},{"$f":"+'ANTERIORES PROP'!H10","v":0},{"$f":"+'ANTERIORES PROP'!H10","v":0},{"$f":"+'ANTERIORES PROP'!I10","v":"ORGANISMO /s DONDE SE INSCRIBIÓ CONSTITUCIÓN (INDICAR LOCALIDAD/PCIA DEL ORG) -si no se inscribió poner: NO INSCRIPTO/A:"},{"$f":"IF('ANTERIORES PROP'!H10>0,'ANTERIORES PROP'!H10,\"INCOMPLETO RECHAZAR\")","v":"INCOMPLETO RECHAZAR"}]
[{"$f":"+'ANTERIORES PROP'!G11","v":"a ANT. PROP PJ"},{"$f":"+'ANTERIORES PROP'!H11","v":0},{"$f":"+'ANTERIORES PROP'!H11","v":0},{"$f":"+'ANTERIORES PROP'!I11","v":"DATOS DE RESOLUCIÓN Y FECHA DE INSCRIPCIÓN:"},{"$f":"IF('ANTERIORES PROP'!H11>0,'ANTERIORES PROP'!H11,\"INCOMPLETO RECHAZAR\")","v":"INCOMPLETO RECHAZAR"}]
[{"$f":"+'ANTERIORES PROP'!G12","v":"a ANT. PROP PJ"},{"$f":"+'ANTERIORES PROP'!H12","v":0},{"$f":"+'ANTERIORES PROP'!H12","v":0},{"$f":"+'ANTERIORES PROP'!I12","v":"FECHA DE INSCRIPCION:"},{"$f":"IF('ANTERIORES PROP'!H12>0,'ANTERIORES PROP'!H12,\"INCOMPLETO RECHAZAR\")","v":"INCOMPLETO RECHAZAR"}]
[{"$f":"+'ANTERIORES PROP'!G13","v":"a ANT. PROP PJ"},{"$f":"+'ANTERIORES PROP'!H13","v":0},{"$f":"+'ANTERIORES PROP'!H13","v":0},{"$f":"+'ANTERIORES PROP'!I13","v":"APELLIDO/S, NOMBRE/S,  DNI Y CARGO DE CADA MIEMBRO DE SU ADMINISTRACIÓN:"},{"$f":"IF('ANTERIORES PROP'!H13>0,'ANTERIORES PROP'!H13,\"INCOMPLETO RECHAZAR\")","v":"INCOMPLETO RECHAZAR"}]
[{"$f":"+'ANTERIORES PROP'!G14","v":"a ANT. PROP PJ"},{"$f":"+'ANTERIORES PROP'!H14","v":0},{"$f":"+'ANTERIORES PROP'!H14","v":0},{"$f":"+'ANTERIORES PROP'!I14","v":"DOMICILIO SOCIAL:"},{"$f":"IF('ANTERIORES PROP'!H14>0,'ANTERIORES PROP'!H14,\"INCOMPLETO RECHAZAR\")","v":"INCOMPLETO RECHAZAR"}]
[{"$f":"+'ANTERIORES PROP'!G15","v":"a ANT. PROP PJ"},{"$f":"+'ANTERIORES PROP'!H15","v":0},{"$f":"+'ANTERIORES PROP'!H15","v":0},{"$f":"+'ANTERIORES PROP'!I15","v":"SEDE SOCIAL:"},{"$f":"IF('ANTERIORES PROP'!H15>0,'ANTERIORES PROP'!H15,\"INCOMPLETO RECHAZAR\")","v":"INCOMPLETO RECHAZAR"}]
[{"$f":"+'ANTERIORES PROP'!G16","v":"a ANT. PROP PJ"},{"$f":"+'ANTERIORES PROP'!H16","v":0},{"$f":"+'ANTERIORES PROP'!H16","v":0},{"$f":"+'ANTERIORES PROP'!I16","v":"CEL/TEL :"},{"$f":"IF('ANTERIORES PROP'!H16>0,'ANTERIORES PROP'!H16,\"INCOMPLETO RECHAZAR\")","v":"INCOMPLETO RECHAZAR"}]
[{"$f":"+'ANTERIORES PROP'!G17","v":"a ANT. PROP PJ"},{"$f":"+'ANTERIORES PROP'!H17","v":0},{"$f":"+'ANTERIORES PROP'!H17","v":0},{"$f":"+'ANTERIORES PROP'!I17","v":"OBJETO PRINCIPAL (EN FORMA RESUMIDA):"},{"$f":"IF('ANTERIORES PROP'!H17>0,'ANTERIORES PROP'!H17,\"INCOMPLETO RECHAZAR\")","v":"INCOMPLETO RECHAZAR"}]
[{"$f":"+'ANTERIORES PROP'!G18","v":"a ANT. PROP PJ"},{"$f":"+'ANTERIORES PROP'!H18","v":0},{"$f":"+'ANTERIORES PROP'!H18","v":0},{"$f":"+'ANTERIORES PROP'!I18","v":"NOTA/OBSERVACIÓN -en mayúscula-:"},{"$f":"IF('ANTERIORES PROP'!H18>0,'ANTERIORES PROP'!H18,\"INCOMPLETO RECHAZAR\")","v":"INCOMPLETO RECHAZAR"}]
[{"$f":"+'ANTERIORES PROP'!G19","v":"a ANT. PROP PJ"},{"$f":"+'ANTERIORES PROP'!H19","v":0},{"$f":"+'ANTERIORES PROP'!H19","v":0},{"$f":"+'ANTERIORES PROP'!I19","v":"CUIT –sin puntos ni barras-:"},{"$f":"IF('ANTERIORES PROP'!H19>0,'ANTERIORES PROP'!H19,\"INCOMPLETO RECHAZAR\")","v":"INCOMPLETO RECHAZAR"}]
[{"$f":"+'ANTERIORES PROP'!G20","v":"a ANT. PROP PJ"},{"$f":"+'ANTERIORES PROP'!H20","v":0},{"$f":"+'ANTERIORES PROP'!H20","v":0},{"$f":"+'ANTERIORES PROP'!I20","v":"TIPO DE PERSONA JCA -FONDO DE COMERCIO, asociación, mutual, etc-:"},{"$f":"IF('ANTERIORES PROP'!H20>0,'ANTERIORES PROP'!H20,\"INCOMPLETO RECHAZAR\")","v":"INCOMPLETO RECHAZAR"}]
[{"$f":"+'ANTERIORES PROP'!G21","v":"a ANT. PROP PJ"},{"$f":"+'ANTERIORES PROP'!H21","v":0},{"$f":"+'ANTERIORES PROP'!H21","v":0},{"$f":"+'ANTERIORES PROP'!I21","v":"ORGANISMO /s DONDE SE INSCRIBIÓ CONSTITUCIÓN (INDICAR LOCALIDAD/PCIA DEL ORG) -si no se inscribió poner: NO INSCRIPTO/A:"},{"$f":"IF('ANTERIORES PROP'!H21>0,'ANTERIORES PROP'!H21,\"INCOMPLETO RECHAZAR\")","v":"INCOMPLETO RECHAZAR"}]
[{"$f":"+'ANTERIORES PROP'!G22","v":"a ANT. PROP PJ"},{"$f":"+'ANTERIORES PROP'!H22","v":0},{"$f":"+'ANTERIORES PROP'!H22","v":0},{"$f":"+'ANTERIORES PROP'!I22","v":"DATOS DE RESOLUCIÓN Y FECHA DE INSCRIPCIÓN:"},{"$f":"IF('ANTERIORES PROP'!H22>0,'ANTERIORES PROP'!H22,\"INCOMPLETO RECHAZAR\")","v":"INCOMPLETO RECHAZAR"}]
[{"$f":"+'ANTERIORES PROP'!G23","v":"a ANT. PROP PJ"},{"$f":"+'ANTERIORES PROP'!H23","v":0},{"$f":"+'ANTERIORES PROP'!H23","v":0},{"$f":"+'ANTERIORES PROP'!I23","v":"FECHA DE INSCRIPCION:"},{"$f":"IF('ANTERIORES PROP'!H23>0,'ANTERIORES PROP'!H23,\"INCOMPLETO RECHAZAR\")","v":"INCOMPLETO RECHAZAR"}]
[{"$f":"+'ANTERIORES PROP'!G24","v":"a ANT. PROP PJ"},{"$f":"+'ANTERIORES PROP'!H24","v":0},{"$f":"+'ANTERIORES PROP'!H24","v":0},{"$f":"+'ANTERIORES PROP'!I24","v":"APELLIDO/S, NOMBRE/S,  DNI Y CARGO DE CADA MIEMBRO DE SU ADMINISTRACIÓN:"},{"$f":"IF('ANTERIORES PROP'!H24>0,'ANTERIORES PROP'!H24,\"INCOMPLETO RECHAZAR\")","v":"INCOMPLETO RECHAZAR"}]
[{"$f":"+'ANTERIORES PROP'!G25","v":"a ANT. PROP PJ"},{"$f":"+'ANTERIORES PROP'!H25","v":0},{"$f":"+'ANTERIORES PROP'!H25","v":0},{"$f":"+'ANTERIORES PROP'!I25","v":"DOMICILIO SOCIAL:"},{"$f":"IF('ANTERIORES PROP'!H25>0,'ANTERIORES PROP'!H25,\"INCOMPLETO RECHAZAR\")","v":"INCOMPLETO RECHAZAR"}]
[{"$f":"+'ANTERIORES PROP'!G26","v":"a ANT. PROP PJ"},{"$f":"+'ANTERIORES PROP'!H26","v":0},{"$f":"+'ANTERIORES PROP'!H26","v":0},{"$f":"+'ANTERIORES PROP'!I26","v":"SEDE SOCIAL:"},{"$f":"IF('ANTERIORES PROP'!H26>0,'ANTERIORES PROP'!H26,\"INCOMPLETO RECHAZAR\")","v":"INCOMPLETO RECHAZAR"}]
[{"$f":"+'ANTERIORES PROP'!G27","v":"a ANT. PROP PJ"},{"$f":"+'ANTERIORES PROP'!H27","v":0},{"$f":"+'ANTERIORES PROP'!H27","v":0},{"$f":"+'ANTERIORES PROP'!I27","v":"CEL/TEL :"},{"$f":"IF('ANTERIORES PROP'!H27>0,'ANTERIORES PROP'!H27,\"INCOMPLETO RECHAZAR\")","v":"INCOMPLETO RECHAZAR"}]
[{"$f":"+'ANTERIORES PROP'!G28","v":"a ANT. PROP PJ"},{"$f":"+'ANTERIORES PROP'!H28","v":0},{"$f":"+'ANTERIORES PROP'!H28","v":0},{"$f":"+'ANTERIORES PROP'!I28","v":"OBJETO PRINCIPAL (EN FORMA RESUMIDA):"},{"$f":"IF('ANTERIORES PROP'!H28>0,'ANTERIORES PROP'!H28,\"INCOMPLETO RECHAZAR\")","v":"INCOMPLETO RECHAZAR"}]
[{"$f":"+'ANTERIORES PROP'!G29","v":"a ANT. PROP PJ"},{"$f":"+'ANTERIORES PROP'!H29","v":0},{"$f":"+'ANTERIORES PROP'!H29","v":0},{"$f":"+'ANTERIORES PROP'!I29","v":"NOTA/OBSERVACIÓN -en mayúscula-:"},{"$f":"IF('ANTERIORES PROP'!H29>0,'ANTERIORES PROP'!H29,\"INCOMPLETO RECHAZAR\")","v":"INCOMPLETO RECHAZAR"}]
[{"$f":"+'ANTERIORES PROP'!G30","v":"a ANT. PROP PJ"},{"$f":"+'ANTERIORES PROP'!H30","v":0},{"$f":"+'ANTERIORES PROP'!H30","v":0},{"$f":"+'ANTERIORES PROP'!I30","v":"CUIT –sin puntos ni barras-:"},{"$f":"IF('ANTERIORES PROP'!H30>0,'ANTERIORES PROP'!H30,\"INCOMPLETO RECHAZAR\")","v":"INCOMPLETO RECHAZAR"}]
[{"$f":"+'ANTERIORES PROP'!G31","v":"a ANT. PROP PJ"},{"$f":"+'ANTERIORES PROP'!H31","v":0},{"$f":"+'ANTERIORES PROP'!H31","v":0},{"$f":"+'ANTERIORES PROP'!I31","v":"TIPO DE PERSONA JCA -FONDO DE COMERCIO, asociación, mutual, etc-:"},{"$f":"IF('ANTERIORES PROP'!H31>0,'ANTERIORES PROP'!H31,\"INCOMPLETO RECHAZAR\")","v":"INCOMPLETO RECHAZAR"}]
[{"$f":"+'ANTERIORES PROP'!G32","v":"a ANT. PROP PJ"},{"$f":"+'ANTERIORES PROP'!H32","v":0},{"$f":"+'ANTERIORES PROP'!H32","v":0},{"$f":"+'ANTERIORES PROP'!I32","v":"ORGANISMO /s DONDE SE INSCRIBIÓ CONSTITUCIÓN (INDICAR LOCALIDAD/PCIA DEL ORG) -si no se inscribió poner: NO INSCRIPTO/A:"},{"$f":"IF('ANTERIORES PROP'!H32>0,'ANTERIORES PROP'!H32,\"INCOMPLETO RECHAZAR\")","v":"INCOMPLETO RECHAZAR"}]
[{"$f":"+'ANTERIORES PROP'!G33","v":"a ANT. PROP PJ"},{"$f":"+'ANTERIORES PROP'!H33","v":0},{"$f":"+'ANTERIORES PROP'!H33","v":0},{"$f":"+'ANTERIORES PROP'!I33","v":"DATOS DE RESOLUCIÓN Y FECHA DE INSCRIPCIÓN:"},{"$f":"IF('ANTERIORES PROP'!H33>0,'ANTERIORES PROP'!H33,\"INCOMPLETO RECHAZAR\")","v":"INCOMPLETO RECHAZAR"}]
[{"$f":"+'ANTERIORES PROP'!G34","v":"a ANT. PROP PJ"},{"$f":"+'ANTERIORES PROP'!H34","v":0},{"$f":"+'ANTERIORES PROP'!H34","v":0},{"$f":"+'ANTERIORES PROP'!I34","v":"FECHA DE INSCRIPCION:"},{"$f":"IF('ANTERIORES PROP'!H34>0,'ANTERIORES PROP'!H34,\"INCOMPLETO RECHAZAR\")","v":"INCOMPLETO RECHAZAR"}]
[{"$f":"+'ANTERIORES PROP'!G35","v":"a ANT. PROP PJ"},{"$f":"+'ANTERIORES PROP'!H35","v":0},{"$f":"+'ANTERIORES PROP'!H35","v":0},{"$f":"+'ANTERIORES PROP'!I35","v":"APELLIDO/S, NOMBRE/S,  DNI Y CARGO DE CADA MIEMBRO DE SU ADMINISTRACIÓN:"},{"$f":"IF('ANTERIORES PROP'!H35>0,'ANTERIORES PROP'!H35,\"INCOMPLETO RECHAZAR\")","v":"INCOMPLETO RECHAZAR"}]
[{"$f":"+'ANTERIORES PROP'!G36","v":"a ANT. PROP PJ"},{"$f":"+'ANTERIORES PROP'!H36","v":0},{"$f":"+'ANTERIORES PROP'!H36","v":0},{"$f":"+'ANTERIORES PROP'!I36","v":"DOMICILIO SOCIAL:"},{"$f":"IF('ANTERIORES PROP'!H36>0,'ANTERIORES PROP'!H36,\"INCOMPLETO RECHAZAR\")","v":"INCOMPLETO RECHAZAR"}]
[{"$f":"+'ANTERIORES PROP'!G37","v":"a ANT. PROP PJ"},{"$f":"+'ANTERIORES PROP'!H37","v":0},{"$f":"+'ANTERIORES PROP'!H37","v":0},{"$f":"+'ANTERIORES PROP'!I37","v":"SEDE SOCIAL:"},{"$f":"IF('ANTERIORES PROP'!H37>0,'ANTERIORES PROP'!H37,\"INCOMPLETO RECHAZAR\")","v":"INCOMPLETO RECHAZAR"}]
[{"$f":"+'ANTERIORES PROP'!G38","v":"a ANT. PROP PJ"},{"$f":"+'ANTERIORES PROP'!H38","v":0},{"$f":"+'ANTERIORES PROP'!H38","v":0},{"$f":"+'ANTERIORES PROP'!I38","v":"CEL/TEL :"},{"$f":"IF('ANTERIORES PROP'!H38>0,'ANTERIORES PROP'!H38,\"INCOMPLETO RECHAZAR\")","v":"INCOMPLETO RECHAZAR"}]
[{"$f":"+'ANTERIORES PROP'!G39","v":"a ANT. PROP PJ"},{"$f":"+'ANTERIORES PROP'!H39","v":0},{"$f":"+'ANTERIORES PROP'!H39","v":0},{"$f":"+'ANTERIORES PROP'!I39","v":"OBJETO PRINCIPAL (EN FORMA RESUMIDA):"},{"$f":"IF('ANTERIORES PROP'!H39>0,'ANTERIORES PROP'!H39,\"INCOMPLETO RECHAZAR\")","v":"INCOMPLETO RECHAZAR"}]
[{"$f":"+'ANTERIORES PROP'!G40","v":"a ANT. PROP PJ"},{"$f":"+'ANTERIORES PROP'!H40","v":0},{"$f":"+'ANTERIORES PROP'!H40","v":0},{"$f":"+'ANTERIORES PROP'!I40","v":"NOTA/OBSERVACIÓN -en mayúscula-:"},{"$f":"IF('ANTERIORES PROP'!H40>0,'ANTERIORES PROP'!H40,\"INCOMPLETO RECHAZAR\")","v":"INCOMPLETO RECHAZAR"}]
[{"$f":"+'ANTERIORES PROP'!G41","v":"a ANT. PROP PJ"},{"$f":"+'ANTERIORES PROP'!H41","v":0},{"$f":"+'ANTERIORES PROP'!H41","v":0},{"$f":"+'ANTERIORES PROP'!I41","v":"CUIT –sin puntos ni barras-:"},{"$f":"IF('ANTERIORES PROP'!H41>0,'ANTERIORES PROP'!H41,\"INCOMPLETO RECHAZAR\")","v":"INCOMPLETO RECHAZAR"}]
[{"$f":"+'ANTERIORES PROP'!G42","v":"a ANT. PROP PJ"},{"$f":"+'ANTERIORES PROP'!H42","v":0},{"$f":"+'ANTERIORES PROP'!H42","v":0},{"$f":"+'ANTERIORES PROP'!I42","v":"TIPO DE PERSONA JCA -FONDO DE COMERCIO, asociación, mutual, etc-:"},{"$f":"IF('ANTERIORES PROP'!H42>0,'ANTERIORES PROP'!H42,\"INCOMPLETO RECHAZAR\")","v":"INCOMPLETO RECHAZAR"}]
[{"$f":"+'ANTERIORES PROP'!G43","v":"a ANT. PROP PJ"},{"$f":"+'ANTERIORES PROP'!H43","v":0},{"$f":"+'ANTERIORES PROP'!H43","v":0},{"$f":"+'ANTERIORES PROP'!I43","v":"ORGANISMO /s DONDE SE INSCRIBIÓ CONSTITUCIÓN (INDICAR LOCALIDAD/PCIA DEL ORG) -si no se inscribió poner: NO INSCRIPTO/A:"},{"$f":"IF('ANTERIORES PROP'!H43>0,'ANTERIORES PROP'!H43,\"INCOMPLETO RECHAZAR\")","v":"INCOMPLETO RECHAZAR"}]
[{"$f":"+'ANTERIORES PROP'!G44","v":"a ANT. PROP PJ"},{"$f":"+'ANTERIORES PROP'!H44","v":0},{"$f":"+'ANTERIORES PROP'!H44","v":0},{"$f":"+'ANTERIORES PROP'!I44","v":"DATOS DE RESOLUCIÓN Y FECHA DE INSCRIPCIÓN:"},{"$f":"IF('ANTERIORES PROP'!H44>0,'ANTERIORES PROP'!H44,\"INCOMPLETO RECHAZAR\")","v":"INCOMPLETO RECHAZAR"}]
[{"$f":"+'ANTERIORES PROP'!G45","v":"a ANT. PROP PJ"},{"$f":"+'ANTERIORES PROP'!H45","v":0},{"$f":"+'ANTERIORES PROP'!H45","v":0},{"$f":"+'ANTERIORES PROP'!I45","v":"FECHA DE INSCRIPCION:"},{"$f":"IF('ANTERIORES PROP'!H45>0,'ANTERIORES PROP'!H45,\"INCOMPLETO RECHAZAR\")","v":"INCOMPLETO RECHAZAR"}]
[{"$f":"+'ANTERIORES PROP'!G46","v":"a ANT. PROP PJ"},{"$f":"+'ANTERIORES PROP'!H46","v":0},{"$f":"+'ANTERIORES PROP'!H46","v":0},{"$f":"+'ANTERIORES PROP'!I46","v":"APELLIDO/S, NOMBRE/S,  DNI Y CARGO DE CADA MIEMBRO DE SU ADMINISTRACIÓN:"},{"$f":"IF('ANTERIORES PROP'!H46>0,'ANTERIORES PROP'!H46,\"INCOMPLETO RECHAZAR\")","v":"INCOMPLETO RECHAZAR"}]
[{"$f":"+'ANTERIORES PROP'!G47","v":"a ANT. PROP PJ"},{"$f":"+'ANTERIORES PROP'!H47","v":0},{"$f":"+'ANTERIORES PROP'!H47","v":0},{"$f":"+'ANTERIORES PROP'!I47","v":"DOMICILIO SOCIAL:"},{"$f":"IF('ANTERIORES PROP'!H47>0,'ANTERIORES PROP'!H47,\"INCOMPLETO RECHAZAR\")","v":"INCOMPLETO RECHAZAR"}]
[{"$f":"+'ANTERIORES PROP'!G48","v":"a ANT. PROP PJ"},{"$f":"+'ANTERIORES PROP'!H48","v":0},{"$f":"+'ANTERIORES PROP'!H48","v":0},{"$f":"+'ANTERIORES PROP'!I48","v":"SEDE SOCIAL:"},{"$f":"IF('ANTERIORES PROP'!H48>0,'ANTERIORES PROP'!H48,\"INCOMPLETO RECHAZAR\")","v":"INCOMPLETO RECHAZAR"}]
[{"$f":"+'ANTERIORES PROP'!G49","v":"a ANT. PROP PJ"},{"$f":"+'ANTERIORES PROP'!H49","v":0},{"$f":"+'ANTERIORES PROP'!H49","v":0},{"$f":"+'ANTERIORES PROP'!I49","v":"CEL/TEL :"},{"$f":"IF('ANTERIORES PROP'!H49>0,'ANTERIORES PROP'!H49,\"INCOMPLETO RECHAZAR\")","v":"INCOMPLETO RECHAZAR"}]
[{"$f":"+'ANTERIORES PROP'!G50","v":"a ANT. PROP PJ"},{"$f":"+'ANTERIORES PROP'!H50","v":0},{"$f":"+'ANTERIORES PROP'!H50","v":0},{"$f":"+'ANTERIORES PROP'!I50","v":"OBJETO PRINCIPAL (EN FORMA RESUMIDA):"},{"$f":"IF('ANTERIORES PROP'!H50>0,'ANTERIORES PROP'!H50,\"INCOMPLETO RECHAZAR\")","v":"INCOMPLETO RECHAZAR"}]
[{"$f":"+'ANTERIORES PROP'!G51","v":"a ANT. PROP PJ"},{"$f":"+'ANTERIORES PROP'!H51","v":0},{"$f":"+'ANTERIORES PROP'!H51","v":0},{"$f":"+'ANTERIORES PROP'!I51","v":"NOTA/OBSERVACIÓN -en mayúscula-:"},{"$f":"IF('ANTERIORES PROP'!H51>0,'ANTERIORES PROP'!H51,\"INCOMPLETO RECHAZAR\")","v":"INCOMPLETO RECHAZAR"}]
[{"$f":"+'ANTERIORES PROP'!G52","v":"a ANT. PROP PJ"},{"$f":"+'ANTERIORES PROP'!H52","v":0},{"$f":"+'ANTERIORES PROP'!H52","v":0},{"$f":"+'ANTERIORES PROP'!I52","v":"CUIT –sin puntos ni barras-:"},{"$f":"IF('ANTERIORES PROP'!H52>0,'ANTERIORES PROP'!H52,\"INCOMPLETO RECHAZAR\")","v":"INCOMPLETO RECHAZAR"}]
[{"$f":"+'ANTERIORES PROP'!G53","v":"a ANT. PROP PJ"},{"$f":"+'ANTERIORES PROP'!H53","v":0},{"$f":"+'ANTERIORES PROP'!H53","v":0},{"$f":"+'ANTERIORES PROP'!I53","v":"TIPO DE PERSONA JCA -FONDO DE COMERCIO, asociación, mutual, etc-:"},{"$f":"IF('ANTERIORES PROP'!H53>0,'ANTERIORES PROP'!H53,\"INCOMPLETO RECHAZAR\")","v":"INCOMPLETO RECHAZAR"}]
[{"$f":"+'ANTERIORES PROP'!G54","v":"a ANT. PROP PJ"},{"$f":"+'ANTERIORES PROP'!H54","v":0},{"$f":"+'ANTERIORES PROP'!H54","v":0},{"$f":"+'ANTERIORES PROP'!I54","v":"ORGANISMO /s DONDE SE INSCRIBIÓ CONSTITUCIÓN (INDICAR LOCALIDAD/PCIA DEL ORG) -si no se inscribió poner: NO INSCRIPTO/A:"},{"$f":"IF('ANTERIORES PROP'!H54>0,'ANTERIORES PROP'!H54,\"INCOMPLETO RECHAZAR\")","v":"INCOMPLETO RECHAZAR"}]
[{"$f":"+'ANTERIORES PROP'!G55","v":"a ANT. PROP PJ"},{"$f":"+'ANTERIORES PROP'!H55","v":0},{"$f":"+'ANTERIORES PROP'!H55","v":0},{"$f":"+'ANTERIORES PROP'!I55","v":"DATOS DE RESOLUCIÓN Y FECHA DE INSCRIPCIÓN:"},{"$f":"IF('ANTERIORES PROP'!H55>0,'ANTERIORES PROP'!H55,\"INCOMPLETO RECHAZAR\")","v":"INCOMPLETO RECHAZAR"}]
[{"$f":"+'ANTERIORES PROP'!G56","v":"a ANT. PROP PJ"},{"$f":"+'ANTERIORES PROP'!H56","v":0},{"$f":"+'ANTERIORES PROP'!H56","v":0},{"$f":"+'ANTERIORES PROP'!I56","v":"FECHA DE INSCRIPCION:"},{"$f":"IF('ANTERIORES PROP'!H56>0,'ANTERIORES PROP'!H56,\"INCOMPLETO RECHAZAR\")","v":"INCOMPLETO RECHAZAR"}]
[{"$f":"+'ANTERIORES PROP'!G57","v":"a ANT. PROP PJ"},{"$f":"+'ANTERIORES PROP'!H57","v":0},{"$f":"+'ANTERIORES PROP'!H57","v":0},{"$f":"+'ANTERIORES PROP'!I57","v":"APELLIDO/S, NOMBRE/S,  DNI Y CARGO DE CADA MIEMBRO DE SU ADMINISTRACIÓN:"},{"$f":"IF('ANTERIORES PROP'!H57>0,'ANTERIORES PROP'!H57,\"INCOMPLETO RECHAZAR\")","v":"INCOMPLETO RECHAZAR"}]
[{"$f":"+'ANTERIORES PROP'!G58","v":"a ANT. PROP PJ"},{"$f":"+'ANTERIORES PROP'!H58","v":0},{"$f":"+'ANTERIORES PROP'!H58","v":0},{"$f":"+'ANTERIORES PROP'!I58","v":"DOMICILIO SOCIAL:"},{"$f":"IF('ANTERIORES PROP'!H58>0,'ANTERIORES PROP'!H58,\"INCOMPLETO RECHAZAR\")","v":"INCOMPLETO RECHAZAR"}]
[{"$f":"+'ANTERIORES PROP'!G59","v":"a ANT. PROP PJ"},{"$f":"+'ANTERIORES PROP'!H59","v":0},{"$f":"+'ANTERIORES PROP'!H59","v":0},{"$f":"+'ANTERIORES PROP'!I59","v":"SEDE SOCIAL:"},{"$f":"IF('ANTERIORES PROP'!H59>0,'ANTERIORES PROP'!H59,\"INCOMPLETO RECHAZAR\")","v":"INCOMPLETO RECHAZAR"}]
[{"$f":"+'ANTERIORES PROP'!G60","v":"a ANT. PROP PJ"},{"$f":"+'ANTERIORES PROP'!H60","v":0},{"$f":"+'ANTERIORES PROP'!H60","v":0},{"$f":"+'ANTERIORES PROP'!I60","v":"CEL/TEL :"},{"$f":"IF('ANTERIORES PROP'!H60>0,'ANTERIORES PROP'!H60,\"INCOMPLETO RECHAZAR\")","v":"INCOMPLETO RECHAZAR"}]
[{"$f":"+'ANTERIORES PROP'!G61","v":"a ANT. PROP PJ"},{"$f":"+'ANTERIORES PROP'!H61","v":0},{"$f":"+'ANTERIORES PROP'!H61","v":0},{"$f":"+'ANTERIORES PROP'!I61","v":"OBJETO PRINCIPAL (EN FORMA RESUMIDA):"},{"$f":"IF('ANTERIORES PROP'!H61>0,'ANTERIORES PROP'!H61,\"INCOMPLETO RECHAZAR\")","v":"INCOMPLETO RECHAZAR"}]
[{"$f":"+'ANTERIORES PROP'!G62","v":"a ANT. PROP PJ"},{"$f":"+'ANTERIORES PROP'!H62","v":0},{"$f":"+'ANTERIORES PROP'!H62","v":0},{"$f":"+'ANTERIORES PROP'!I62","v":"NOTA/OBSERVACIÓN -en mayúscula-:"},{"$f":"IF('ANTERIORES PROP'!H62>0,'ANTERIORES PROP'!H62,\"INCOMPLETO RECHAZAR\")","v":"INCOMPLETO RECHAZAR"}]

{"sheet":"LISTADOS","index":6,"n_rows":74,"n_cols":7,"rows_kept":74,"cut":false,"hidden":true,"merged":[]}
["ESTADO CIVIL","ACTIVIDAD PRINCIPAL","ADMINISTRADOR SAS 1 socios","ADMINISTRADOR SAS 1 NO socios"]
["SOLTERO/A","COMERCIAL","SOCIO/A ADM. TITULAR","NO SOCIO/A ADM. TITULAR"]
["CASADO/A","INMOBILIARIA","SOCIO/A ADM. SUPLENTE","NO SOCIO/A ADM. SUPLENTE"]
["VIUDO/A","INDUSTRIAL"]
["DIVORCIADO/A","FINANCIERA",null,"SUMA ADM SUPLENTES SAS 1","SUMA ADM TITULAR SAS 1"]
[null,"TRANSPORTE",null,{"$f":"COUNTIFS(#REF!,\"*\"&\"SUPLENTE\"&\"*\")","v":{"$error":"#REF!"}},{"$f":"COUNTIFS(#REF!,\"*\"&\"TITULAR\"&\"*\")","v":{"$error":"#REF!"}}]
["GESTIONANTE","AGROPECUARIA",null,{"$f":"COUNTIFS(#REF!,\"*\"&\"SUPLENTE\"&\"*\")","v":{"$error":"#REF!"}},{"$f":"COUNTIFS(#REF!,\"*\"&\"TITULAR\"&\"*\")","v":{"$error":"#REF!"}}]
["ELEGIR","MINERA"]
["APODERADO/A LETRADO/A","EXTRACCIÓN PETROLEO Y/O GAS"]
["ESCRIBANO/A","CONSTRUCCIÓN"]
["AUTORIZADO/A","OTRA/S"]
["REP. LEGAL SOC."]
["CONTADOR"]
["CUIT"]
["NO POSEE"]
["POSEE"]
["EN TRAMITE"]
[]
["ADMINISTRADOR","RESOLUCION 70/2011 -SOCIO",null,"PREGUNTAS","UIF SAS 1"]
[0,"SI",null,"SI","SI"]
["ADMINISTRADOR/A TITULAR","NO",null,"NO","NO"]
["ADMINISTRADOR/A SUPLENTE","ORG. FISCALIZACION"]
["PRESIDENTE/A",0,"ADMINISTRADOR NO SOCIO"]
["VICEPRESIDENTE/A","SINDICO/A",0]
["DIRECTOR/A","SINDICO/A SUPLENTE","ADMINISTRADOR/A TITULAR"]
["DIRECTOR/A SUPLENTE","AUDITOR/A","ADMINISTRADOR/A SUPLENTE"]
["SUBDIRECTOR/A","AUDITOR/A SUPLENTE","PRESIDENTE/A"]
["SUBDIRECTOR/A SUPLENTE","SUBAUDITOR/A","VICEPRESIDENTE/A"]
["SOCIO/A GERENTE","CONTRALOR/A","DIRECTOR/A"]
["SOCIO/A GERENTE SUPLENTE","CONTRALOR/A SUPLENTE","DIRECTOR/A SUPLENTE"]
["GERENTE/A","OTRO/A","SUBDIRECTOR/A"]
["GERENTE/A SUPLENTE",null,"SUBDIRECTOR/A SUPLENTE"]
["OTRO/A",null,"GERENTE/A"]
[null,null,"GERENTE/A SUPLENTE"]
[null,null,"OTRO/A"]
[]
[]
["CANTIDAD DE REP. LEGAL/ ADM TITULARES","CANTIDAD DE REP. LEGAL/ ADM SUPLENTES","CANTIDAD DE SOCIOS",null,null,"CANTIDAD DE NO SOCIOS"]
[{"$f":"+IF('PROPIETARIO actuales'!$E29=\"ADMINISTRADOR/A TITULAR\",1,0)","v":0},{"$f":"+IF('PROPIETARIO actuales'!$E29=\"ADMINISTRADOR/A SUPLENTE\",1,0)","v":0},{"$f":"IF('PROPIETARIO actuales'!B16=0,0,1)","v":0},null,null,{"$f":"IF('NO PROPIETARIOS adm actuales'!B8=0,0,1)","v":0}]
[{"$f":"+IF('PROPIETARIO actuales'!$E49=\"ADMINISTRADOR/A TITULAR\",1,0)","v":0},{"$f":"+IF('PROPIETARIO actuales'!$E49=\"ADMINISTRADOR/A SUPLENTE\",1,0)","v":0},{"$f":"IF('PROPIETARIO actuales'!B32=0,0,1)","v":0},null,null,{"$f":"IF('NO PROPIETARIOS adm actuales'!B24=0,0,1)","v":0}]
[{"$f":"+IF('PROPIETARIO actuales'!$E69=\"ADMINISTRADOR/A TITULAR\",1,0)","v":0},{"$f":"+IF('PROPIETARIO actuales'!$E69=\"ADMINISTRADOR/A SUPLENTE\",1,0)","v":0},{"$f":"IF('PROPIETARIO actuales'!B52=0,0,1)","v":0},null,null,{"$f":"IF('NO PROPIETARIOS adm actuales'!B40=0,0,1)","v":0}]
[{"$f":"+IF('PROPIETARIO actuales'!$E89=\"ADMINISTRADOR/A TITULAR\",1,0)","v":0},{"$f":"+IF('PROPIETARIO actuales'!$E89=\"ADMINISTRADOR/A SUPLENTE\",1,0)","v":0},{"$f":"IF('PROPIETARIO actuales'!B72=0,0,1)","v":0},null,null,{"$f":"IF('NO PROPIETARIOS adm actuales'!B56=0,0,1)","v":0}]
[{"$f":"+IF('PROPIETARIO actuales'!#REF!=\"ADMINISTRADOR/A TITULAR\",1,0)","v":{"$error":"#REF!"}},{"$f":"+IF('PROPIETARIO actuales'!#REF!=\"ADMINISTRADOR/A SUPLENTE\",1,0)","v":{"$error":"#REF!"}},{"$f":"IF('PROPIETARIO actuales'!B92=0,0,1)","v":0},null,null,{"$f":"IF('NO PROPIETARIOS adm actuales'!B72=0,0,1)","v":0}]
[{"$f":"+IF('PROPIETARIO actuales'!$E127=\"ADMINISTRADOR/A TITULAR\",1,0)","v":0},{"$f":"+IF('PROPIETARIO actuales'!$E127=\"ADMINISTRADOR/A SUPLENTE\",1,0)","v":0},{"$f":"IF('PROPIETARIO actuales'!B110=0,0,1)","v":0},null,null,{"$f":"IF('NO PROPIETARIOS adm actuales'!B88=0,0,1)","v":0}]
[{"$f":"+IF('PROPIETARIO actuales'!$E147=\"ADMINISTRADOR/A TITULAR\",1,0)","v":0},{"$f":"+IF('PROPIETARIO actuales'!$E147=\"ADMINISTRADOR/A SUPLENTE\",1,0)","v":0},{"$f":"IF('PROPIETARIO actuales'!B130=0,0,1)","v":0},null,null,{"$f":"IF('NO PROPIETARIOS adm actuales'!B104=0,0,1)","v":0}]
[{"$f":"+IF('PROPIETARIO actuales'!$E167=\"ADMINISTRADOR/A TITULAR\",1,0)","v":0},{"$f":"+IF('PROPIETARIO actuales'!$E167=\"ADMINISTRADOR/A SUPLENTE\",1,0)","v":0},{"$f":"IF('PROPIETARIO actuales'!B150=0,0,1)","v":0},null,null,{"$f":"IF('NO PROPIETARIOS adm actuales'!B120=0,0,1)","v":0}]
[{"$f":"+IF('PROPIETARIO actuales'!#REF!=\"ADMINISTRADOR/A TITULAR\",1,0)","v":{"$error":"#REF!"}},{"$f":"+IF('PROPIETARIO actuales'!#REF!=\"ADMINISTRADOR/A SUPLENTE\",1,0)","v":{"$error":"#REF!"}},{"$f":"IF('PROPIETARIO actuales'!B170=0,0,1)","v":0},null,null,{"$f":"IF('NO PROPIETARIOS adm actuales'!B136=0,0,1)","v":0}]
[{"$f":"+IF('PROPIETARIO actuales'!#REF!=\"ADMINISTRADOR/A TITULAR\",1,0)","v":{"$error":"#REF!"}},{"$f":"+IF('PROPIETARIO actuales'!#REF!=\"ADMINISTRADOR/A SUPLENTE\",1,0)","v":{"$error":"#REF!"}},{"$f":"IF('PROPIETARIO actuales'!#REF!=0,0,1)","v":{"$error":"#REF!"}},null,null,{"$f":"IF('NO PROPIETARIOS adm actuales'!B152=0,0,1)","v":0}]
[{"$f":"+IF('PROPIETARIO actuales'!#REF!=\"ADMINISTRADOR/A TITULAR\",1,0)","v":{"$error":"#REF!"}},{"$f":"+IF('PROPIETARIO actuales'!#REF!=\"ADMINISTRADOR/A SUPLENTE\",1,0)","v":{"$error":"#REF!"}},{"$f":"IF('PROPIETARIO actuales'!#REF!=0,0,1)","v":{"$error":"#REF!"}},null,null,{"$f":"IF('NO PROPIETARIOS adm actuales'!B168=0,0,1)","v":0}]
[{"$f":"+IF('PROPIETARIO actuales'!#REF!=\"ADMINISTRADOR/A TITULAR\",1,0)","v":{"$error":"#REF!"}},{"$f":"+IF('PROPIETARIO actuales'!#REF!=\"ADMINISTRADOR/A SUPLENTE\",1,0)","v":{"$error":"#REF!"}},{"$f":"IF('PROPIETARIO actuales'!#REF!=0,0,1)","v":{"$error":"#REF!"}},null,null,{"$f":"IF('NO PROPIETARIOS adm actuales'!B184=0,0,1)","v":0}]
[{"$f":"+IF('PROPIETARIO actuales'!#REF!=\"ADMINISTRADOR/A TITULAR\",1,0)","v":{"$error":"#REF!"}},{"$f":"+IF('PROPIETARIO actuales'!#REF!=\"ADMINISTRADOR/A SUPLENTE\",1,0)","v":{"$error":"#REF!"}},{"$f":"IF('PROPIETARIO actuales'!#REF!=0,0,1)","v":{"$error":"#REF!"}},null,null,{"$f":"IF('NO PROPIETARIOS adm actuales'!B200=0,0,1)","v":0}]
[{"$f":"+IF('PROPIETARIO actuales'!#REF!=\"ADMINISTRADOR/A TITULAR\",1,0)","v":{"$error":"#REF!"}},{"$f":"+IF('PROPIETARIO actuales'!#REF!=\"ADMINISTRADOR/A SUPLENTE\",1,0)","v":{"$error":"#REF!"}},{"$f":"IF('PROPIETARIO actuales'!#REF!=0,0,1)","v":{"$error":"#REF!"}},{"$f":"+SUM(C39:C52)","v":{"$error":"#REF!"}},"TOTAL SOCIOS PH",{"$f":"IF('NO PROPIETARIOS adm actuales'!B216=0,0,1)","v":0}]
[{"$f":"+IF('NO PROPIETARIOS adm actuales'!$E21=\"ADMINISTRADOR/A TITULAR\",1,0)","v":0},{"$f":"+IF('NO PROPIETARIOS adm actuales'!$E21=\"ADMINISTRADOR/A SUPLENTE\",1,0)","v":0},{"$f":"IF('PROPIETARIO actuales'!H16=0,0,1)","v":0},null,null,{"$f":"IF('NO PROPIETARIOS adm actuales'!B232=0,0,1)","v":0}]
[{"$f":"+IF('NO PROPIETARIOS adm actuales'!$E22=\"ADMINISTRADOR/A TITULAR\",1,0)","v":0},{"$f":"+IF('NO PROPIETARIOS adm actuales'!$E22=\"ADMINISTRADOR/A SUPLENTE\",1,0)","v":0},{"$f":"IF('PROPIETARIO actuales'!H27=0,0,1)","v":0},null,{"$f":"'PROPIETARIO actuales'!#REF!+'PROPIETARIO actuales'!E47+'PROPIETARIO actuales'!E67+'PROPIETARIO actuales'!E87+'PROPIETARIO actuales'!E107+'PROPIETARIO actuales'!E125+'PROPIETARIO actuales'!E145+'PROPIETARIO actuales'!E165+'PROPIETARIO actuales'!#REF!+'PROPIETARIO actuales'!#REF!+'PROPIETARIO actuales'!#REF!+'PROPIETARIO actuales'!#REF!+'PROPIETARIO actuales'!#REF!+'PROPIETARIO actuales'!#REF!+'PROPIETARIO actuales'!#REF!+'PROPIETARIO actuales'!J39+'PROPIETARIO actuales'!J56+'PROPIETARIO actuales'!J73+'PROPIETARIO actuales'!J90+'PROPIETARIO actuales'!J107+'PROPIETARIO actuales'!J124+'PROPIETARIO actuales'!#REF!+'PROPIETARIO actuales'!#REF!+'PROPIETARIO actuales'!#REF!","v":{"$error":"#REF!"}},{"$f":"SUM(F39:F53)","v":0},"TOTAL NO SOCIOS"]
[{"$f":"+IF('NO PROPIETARIOS adm actuales'!$E53=\"ADMINISTRADOR/A TITULAR\",1,0)","v":0},{"$f":"+IF('NO PROPIETARIOS adm actuales'!$E53=\"ADMINISTRADOR/A SUPLENTE\",1,0)","v":0},{"$f":"IF('PROPIETARIO actuales'!H42=0,0,1)","v":0}]
[{"$f":"+IF('NO PROPIETARIOS adm actuales'!$E69=\"ADMINISTRADOR/A TITULAR\",1,0)","v":0},{"$f":"+IF('NO PROPIETARIOS adm actuales'!$E69=\"ADMINISTRADOR/A SUPLENTE\",1,0)","v":0},{"$f":"IF('PROPIETARIO actuales'!H59=0,0,1)","v":0}]
[{"$f":"+IF('NO PROPIETARIOS adm actuales'!E85=\"ADMINISTRADOR/A TITULAR\",1,0)","v":0},{"$f":"+IF('NO PROPIETARIOS adm actuales'!F85=\"ADMINISTRADOR/A SUPLENTE\",1,0)","v":0},{"$f":"IF('PROPIETARIO actuales'!H76=0,0,1)","v":0}]
[{"$f":"+IF('NO PROPIETARIOS adm actuales'!E101=\"ADMINISTRADOR/A TITULAR\",1,0)","v":0},{"$f":"+IF('NO PROPIETARIOS adm actuales'!F101=\"ADMINISTRADOR/A SUPLENTE\",1,0)","v":0},{"$f":"IF('PROPIETARIO actuales'!H93=0,0,1)","v":0}]
[{"$f":"+IF('NO PROPIETARIOS adm actuales'!E117=\"ADMINISTRADOR/A TITULAR\",1,0)","v":0},{"$f":"+IF('NO PROPIETARIOS adm actuales'!F117=\"ADMINISTRADOR/A SUPLENTE\",1,0)","v":0},{"$f":"IF('PROPIETARIO actuales'!H110=0,0,1)","v":0}]
[{"$f":"+IF('NO PROPIETARIOS adm actuales'!E133=\"ADMINISTRADOR/A TITULAR\",1,0)","v":0},{"$f":"+IF('NO PROPIETARIOS adm actuales'!F133=\"ADMINISTRADOR/A SUPLENTE\",1,0)","v":0},{"$f":"IF('PROPIETARIO actuales'!#REF!=0,0,1)","v":{"$error":"#REF!"}}]
[{"$f":"+IF('NO PROPIETARIOS adm actuales'!E149=\"ADMINISTRADOR/A TITULAR\",1,0)","v":0},{"$f":"+IF('NO PROPIETARIOS adm actuales'!F149=\"ADMINISTRADOR/A SUPLENTE\",1,0)","v":0},{"$f":"IF('PROPIETARIO actuales'!#REF!=0,0,1)","v":{"$error":"#REF!"}}]
[{"$f":"+IF('NO PROPIETARIOS adm actuales'!E165=\"ADMINISTRADOR/A TITULAR\",1,0)","v":0},{"$f":"+IF('NO PROPIETARIOS adm actuales'!F165=\"ADMINISTRADOR/A SUPLENTE\",1,0)","v":0},{"$f":"IF('PROPIETARIO actuales'!#REF!=0,0,1)","v":{"$error":"#REF!"}},{"$f":"+SUM(C53:C62)","v":{"$error":"#REF!"}},"TOTAL SOCIOS PJ"]
[{"$f":"+IF('NO PROPIETARIOS adm actuales'!E181=\"ADMINISTRADOR/A TITULAR\",1,0)","v":0},{"$f":"+IF('NO PROPIETARIOS adm actuales'!F181=\"ADMINISTRADOR/A SUPLENTE\",1,0)","v":0},{"$f":"SUM(C39:C62)","v":{"$error":"#REF!"}},"TOTAL SOCIOS"]
[{"$f":"+IF('NO PROPIETARIOS adm actuales'!E197=\"ADMINISTRADOR/A TITULAR\",1,0)","v":0},{"$f":"+IF('NO PROPIETARIOS adm actuales'!F197=\"ADMINISTRADOR/A SUPLENTE\",1,0)","v":0}]
[{"$f":"+IF('NO PROPIETARIOS adm actuales'!E213=\"ADMINISTRADOR/A TITULAR\",1,0)","v":0},{"$f":"+IF('NO PROPIETARIOS adm actuales'!F213=\"ADMINISTRADOR/A SUPLENTE\",1,0)","v":0}]
[{"$f":"+IF('NO PROPIETARIOS adm actuales'!E229=\"ADMINISTRADOR/A TITULAR\",1,0)","v":0},{"$f":"+IF('NO PROPIETARIOS adm actuales'!F229=\"ADMINISTRADOR/A SUPLENTE\",1,0)","v":0}]
[{"$f":"+IF('NO PROPIETARIOS adm actuales'!E245=\"ADMINISTRADOR/A TITULAR\",1,0)","v":0},{"$f":"+IF('NO PROPIETARIOS adm actuales'!F245=\"ADMINISTRADOR/A SUPLENTE\",1,0)","v":0}]
[{"$f":"SUM(A39:A67)","v":{"$error":"#REF!"}},{"$f":"SUM(B39:B67)","v":{"$error":"#REF!"}},"TOTALES"]
[]
[]
["TRAMITES"]
["ELEGIR"]
["INSCRIPCIÓN INICIAL"]
["MODIFICACION/ES"]

{"sheet":"BD-GRAL","index":7,"n_rows":667,"n_cols":18,"rows_kept":667,"cut":false,"hidden":true,"merged":[[1,7,1,8],[2,7,2,8],[3,4,3,5],[3,7,3,8],[4,13,4,17],[4,6,4,7],[4,8,5,8],[4,9,5,9],[4,10,5,10],[4,11,5,11],[4,12,5,12],[4,0,5,0],[4,1,5,1],[4,2,4,3],[4,4,5,4],[4,5,5,5]]}
["BASE DE DATOS"]
["FECHA DE CARGA BASE DATOS:",null,null,null,null,null,null,{"$f":"+IF(G2>0,\".\",\"ERROR llene FECHA\")","v":"ERROR llene FECHA"}]
["EXPTE. NRO. DONDE SE DENUNCIÓ DATOS:",null,null,null,null,null,null,{"$f":"+IF(G3>0,\".\",\"ERROR llene NRO. EXPTE.\")","v":"ERROR llene NRO. EXPTE."}]
[null,null,null,null,"NRO. DE LEGAJO",null,null,{"$f":"+IF(G4>0,\".\",\"ERROR llene NRO. LEGAJO\")","v":"ERROR llene NRO. LEGAJO"}]
["COD. Int.","FORM.","DATOS DENUNCIADOS",null,"VINCULADOS","VINCULADOS","DATOS",null,"FECHA","NRO. DE LEGAJO","EXPTE./OTROS","FS.","NOTA/ OTROS","OBSERVACION"]
[null,null,"INSCRIPTO RPC","FECHA ALTA/MO-DIFICACIÓN",null,null,"CONCEPTO","COMPLETAR -EN MAYUSCULA -",null,null,null,null,null,"FECHA","DETALLE","EXPTE./ OTRO/s","FS.","NOTA/ OTROS"]
[]
[null,{"$f":"IF(E8=0,0,IMPRIMIR!A7)","v":0},{"$f":"IF(E8=0,0,IMPRIMIR!$D$3)","v":0},{"$f":"IF(E8=\"0\",0,$G$2)","v":0},{"$f":"IMPRIMIR!B7","v":0},{"$f":"IMPRIMIR!C7","v":0},{"$f":"IF(E8=0,0,IMPRIMIR!D7)","v":0},{"$f":"IF(E8=0,0,IMPRIMIR!E7)","v":0},{"$f":"IF(E8=0,0,$G$2)","v":0},{"$f":"IF(E8=0,0,$G$4)","v":0},{"$f":"IF(E8=0,0,$G$3)","v":0}]
[null,{"$f":"IF(E9=0,0,IMPRIMIR!A8)","v":0},{"$f":"IF(E9=0,0,IMPRIMIR!$D$3)","v":0},{"$f":"IF(E9=\"0\",0,$G$2)","v":0},{"$f":"IMPRIMIR!B8","v":0},{"$f":"IMPRIMIR!C8","v":0},{"$f":"IF(E9=0,0,IMPRIMIR!D8)","v":0},{"$f":"IF(E9=0,0,IMPRIMIR!E8)","v":0},{"$f":"IF(E9=0,0,$G$2)","v":0},{"$f":"IF(E9=0,0,$G$4)","v":0},{"$f":"IF(E9=0,0,$G$3)","v":0}]
[null,{"$f":"IF(E10=0,0,IMPRIMIR!A9)","v":0},{"$f":"IF(E10=0,0,IMPRIMIR!$D$3)","v":0},0,{"$f":"IMPRIMIR!B9","v":0},{"$f":"IMPRIMIR!C9","v":0},{"$f":"IF(E10=0,0,IMPRIMIR!D9)","v":0},{"$f":"IF(E10=0,0,IMPRIMIR!E9)","v":0},0,0,0]
[null,{"$f":"IF(E11=0,0,IMPRIMIR!A10)","v":0},{"$f":"IF(E11=0,0,IMPRIMIR!$D$3)","v":0},0,{"$f":"IMPRIMIR!B10","v":0},{"$f":"IMPRIMIR!C10","v":0},{"$f":"IF(E11=0,0,IMPRIMIR!D10)","v":0},{"$f":"IF(E11=0,0,IMPRIMIR!E10)","v":0},0,0,0]
[null,{"$f":"IF(E12=0,0,IMPRIMIR!A11)","v":0},{"$f":"IF(E12=0,0,IMPRIMIR!$D$3)","v":0},0,{"$f":"IMPRIMIR!B11","v":0},{"$f":"IMPRIMIR!C11","v":0},{"$f":"IF(E12=0,0,IMPRIMIR!D11)","v":0},{"$f":"IF(E12=0,0,IMPRIMIR!E11)","v":0},0,0,0]
[null,{"$f":"IF(E13=0,0,IMPRIMIR!A12)","v":0},{"$f":"IF(E13=0,0,IMPRIMIR!$D$3)","v":0},0,{"$f":"IMPRIMIR!B12","v":0},{"$f":"IMPRIMIR!C12","v":0},{"$f":"IF(E13=0,0,IMPRIMIR!D12)","v":0},{"$f":"IF(E13=0,0,IMPRIMIR!E12)","v":0},0,0,0]
[null,{"$f":"IF(E14=0,0,IMPRIMIR!A13)","v":0},{"$f":"IF(E14=0,0,IMPRIMIR!$D$3)","v":0},0,{"$f":"IMPRIMIR!B13","v":0},{"$f":"IMPRIMIR!C13","v":0},{"$f":"IF(E14=0,0,IMPRIMIR!D13)","v":0},{"$f":"IF(E14=0,0,IMPRIMIR!E13)","v":0},0,0,0]
[null,{"$f":"IF(E15=0,0,IMPRIMIR!A14)","v":0},{"$f":"IF(E15=0,0,IMPRIMIR!$D$3)","v":0},0,{"$f":"IMPRIMIR!B14","v":0},{"$f":"IMPRIMIR!C14","v":0},{"$f":"IF(E15=0,0,IMPRIMIR!D14)","v":0},{"$f":"IF(E15=0,0,IMPRIMIR!E14)","v":0},0,0,0]
[null,{"$f":"IF(E16=0,0,IMPRIMIR!A15)","v":"b FONDO DE COMERCIO"},{"$f":"IF(E16=0,0,IMPRIMIR!$D$3)","v":0},0,{"$f":"IMPRIMIR!B15","v":"0"},{"$f":"IMPRIMIR!C15","v":"0"},{"$f":"IF(E16=0,0,IMPRIMIR!D15)","v":"CEL/TEL (de administración) -en su caso indicar que no posee-:"},{"$f":"IF(E16=0,0,IMPRIMIR!E15)","v":"INCOMPLETO RECHAZAR"},0,0,0]
[null,{"$f":"IF(E17=0,0,IMPRIMIR!A16)","v":"b FONDO DE COMERCIO"},{"$f":"IF(E17=0,0,IMPRIMIR!$D$3)","v":0},0,{"$f":"IMPRIMIR!B16","v":"0"},{"$f":"IMPRIMIR!C16","v":"0"},{"$f":"IF(E17=0,0,IMPRIMIR!D16)","v":"EMAIL (de administración)  -en su caso indicar que no posee-:"},{"$f":"IF(E17=0,0,IMPRIMIR!E16)","v":"INCOMPLETO RECHAZAR"},0,0,0]
[null,{"$f":"IF(E18=0,0,IMPRIMIR!A17)","v":"ba FONDO DE COMERCIO"},{"$f":"IF(E18=0,0,IMPRIMIR!$D$3)","v":0},0,{"$f":"IMPRIMIR!B17","v":"0"},{"$f":"IMPRIMIR!C17","v":"0"},{"$f":"IF(E18=0,0,IMPRIMIR!D17)","v":"DIRECCION domicilio legal:"},{"$f":"IF(E18=0,0,IMPRIMIR!E17)","v":"INCOMPLETO RECHAZAR"},0,0,0]
[null,{"$f":"IF(E19=0,0,IMPRIMIR!A18)","v":"bb FONDO DE COMERCIO"},{"$f":"IF(E19=0,0,IMPRIMIR!$D$3)","v":0},0,{"$f":"IMPRIMIR!B18","v":"0"},{"$f":"IMPRIMIR!C18","v":"0"},{"$f":"IF(E19=0,0,IMPRIMIR!D18)","v":"CUIT –sin puntos ni barras-:"},{"$f":"IF(E19=0,0,IMPRIMIR!E18)","v":"INCOMPLETO RECHAZAR"},0,0,0]
[null,{"$f":"IF(E20=0,0,IMPRIMIR!A19)","v":0},{"$f":"IF(E20=0,0,IMPRIMIR!$D$3)","v":0},0,{"$f":"IMPRIMIR!B19","v":0},{"$f":"IMPRIMIR!C19","v":0},{"$f":"IF(E20=0,0,IMPRIMIR!D19)","v":0},{"$f":"IF(E20=0,0,IMPRIMIR!E19)","v":0},0,0,0]
[null,{"$f":"IF(E21=0,0,IMPRIMIR!A20)","v":0},{"$f":"IF(E21=0,0,IMPRIMIR!$D$3)","v":0},0,{"$f":"IMPRIMIR!B20","v":0},{"$f":"IMPRIMIR!C20","v":0},{"$f":"IF(E21=0,0,IMPRIMIR!D20)","v":0},{"$f":"IF(E21=0,0,IMPRIMIR!E20)","v":0},0,0,0]
[null,{"$f":"IF(E22=0,0,IMPRIMIR!A21)","v":0},{"$f":"IF(E22=0,0,IMPRIMIR!$D$3)","v":0},0,{"$f":"IMPRIMIR!B21","v":0},{"$f":"IMPRIMIR!C21","v":0},{"$f":"IF(E22=0,0,IMPRIMIR!D21)","v":0},{"$f":"IF(E22=0,0,IMPRIMIR!E21)","v":0},0,0,0]
[null,{"$f":"IF(E23=0,0,IMPRIMIR!A22)","v":0},{"$f":"IF(E23=0,0,IMPRIMIR!$D$3)","v":0},0,{"$f":"IMPRIMIR!B22","v":0},{"$f":"IMPRIMIR!C22","v":0},{"$f":"IF(E23=0,0,IMPRIMIR!D22)","v":0},{"$f":"IF(E23=0,0,IMPRIMIR!E22)","v":0},0,0,0]
[null,{"$f":"IF(E24=0,0,IMPRIMIR!A23)","v":0},{"$f":"IF(E24=0,0,IMPRIMIR!$D$3)","v":0},0,{"$f":"IMPRIMIR!B23","v":0},{"$f":"IMPRIMIR!C23","v":0},{"$f":"IF(E24=0,0,IMPRIMIR!D23)","v":0},{"$f":"IF(E24=0,0,IMPRIMIR!E23)","v":0},0,0,0]
[null,{"$f":"IF(E25=0,0,IMPRIMIR!A24)","v":0},{"$f":"IF(E25=0,0,IMPRIMIR!$D$3)","v":0},0,{"$f":"IMPRIMIR!B24","v":0},{"$f":"IMPRIMIR!C24","v":0},{"$f":"IF(E25=0,0,IMPRIMIR!D24)","v":0},{"$f":"IF(E25=0,0,IMPRIMIR!E24)","v":0},0,0,0]
[null,{"$f":"IF(E26=0,0,IMPRIMIR!A25)","v":0},{"$f":"IF(E26=0,0,IMPRIMIR!$D$3)","v":0},0,{"$f":"IMPRIMIR!B25","v":0},{"$f":"IMPRIMIR!C25","v":0},{"$f":"IF(E26=0,0,IMPRIMIR!D25)","v":0},{"$f":"IF(E26=0,0,IMPRIMIR!E25)","v":0},0,0,0]
[null,{"$f":"IF(E27=0,0,IMPRIMIR!A26)","v":0},{"$f":"IF(E27=0,0,IMPRIMIR!$D$3)","v":0},0,{"$f":"IMPRIMIR!B26","v":0},{"$f":"IMPRIMIR!C26","v":0},{"$f":"IF(E27=0,0,IMPRIMIR!D26)","v":0},{"$f":"IF(E27=0,0,IMPRIMIR!E26)","v":0},0,0,0]
[null,{"$f":"IF(E28=0,0,IMPRIMIR!A27)","v":0},{"$f":"IF(E28=0,0,IMPRIMIR!$D$3)","v":0},0,{"$f":"IMPRIMIR!B27","v":0},{"$f":"IMPRIMIR!C27","v":0},{"$f":"IF(E28=0,0,IMPRIMIR!D27)","v":0},{"$f":"IF(E28=0,0,IMPRIMIR!E27)","v":0},0,0,0]
[null,{"$f":"IF(E29=0,0,IMPRIMIR!A28)","v":0},{"$f":"IF(E29=0,0,IMPRIMIR!$D$3)","v":0},0,{"$f":"IMPRIMIR!B28","v":0},{"$f":"IMPRIMIR!C28","v":0},{"$f":"IF(E29=0,0,IMPRIMIR!D28)","v":0},{"$f":"IF(E29=0,0,IMPRIMIR!E28)","v":0},0,0,0]
[null,{"$f":"IF(E30=0,0,IMPRIMIR!A29)","v":0},{"$f":"IF(E30=0,0,IMPRIMIR!$D$3)","v":0},0,{"$f":"IMPRIMIR!B29","v":0},{"$f":"IMPRIMIR!C29","v":0},{"$f":"IF(E30=0,0,IMPRIMIR!D29)","v":0},{"$f":"IF(E30=0,0,IMPRIMIR!E29)","v":0},0,0,0]
[null,{"$f":"IF(E31=0,0,IMPRIMIR!A30)","v":0},{"$f":"IF(E31=0,0,IMPRIMIR!$D$3)","v":0},0,{"$f":"IMPRIMIR!B30","v":0},{"$f":"IMPRIMIR!C30","v":0},{"$f":"IF(E31=0,0,IMPRIMIR!D30)","v":0},{"$f":"IF(E31=0,0,IMPRIMIR!E30)","v":0},0,0,0]
[null,{"$f":"IF(E32=0,0,IMPRIMIR!A31)","v":0},{"$f":"IF(E32=0,0,IMPRIMIR!$D$3)","v":0},0,{"$f":"IMPRIMIR!B31","v":0},{"$f":"IMPRIMIR!C31","v":0},{"$f":"IF(E32=0,0,IMPRIMIR!D31)","v":0},{"$f":"IF(E32=0,0,IMPRIMIR!E31)","v":0},0,0,0]
[null,{"$f":"IF(E33=0,0,IMPRIMIR!A32)","v":0},{"$f":"IF(E33=0,0,IMPRIMIR!$D$3)","v":0},0,{"$f":"IMPRIMIR!B32","v":0},{"$f":"IMPRIMIR!C32","v":0},{"$f":"IF(E33=0,0,IMPRIMIR!D32)","v":0},{"$f":"IF(E33=0,0,IMPRIMIR!E32)","v":0},0,0,0]
[null,{"$f":"IF(E34=0,0,IMPRIMIR!A33)","v":0},{"$f":"IF(E34=0,0,IMPRIMIR!$D$3)","v":0},0,{"$f":"IMPRIMIR!B33","v":0},{"$f":"IMPRIMIR!C33","v":0},{"$f":"IF(E34=0,0,IMPRIMIR!D33)","v":0},{"$f":"IF(E34=0,0,IMPRIMIR!E33)","v":0},0,0,0]
[null,{"$f":"IF(E35=0,0,IMPRIMIR!A34)","v":0},{"$f":"IF(E35=0,0,IMPRIMIR!$D$3)","v":0},0,{"$f":"IMPRIMIR!B34","v":0},{"$f":"IMPRIMIR!C34","v":0},{"$f":"IF(E35=0,0,IMPRIMIR!D34)","v":0},{"$f":"IF(E35=0,0,IMPRIMIR!E34)","v":0},0,0,0]
[null,{"$f":"IF(E36=0,0,IMPRIMIR!A35)","v":0},{"$f":"IF(E36=0,0,IMPRIMIR!$D$3)","v":0},0,{"$f":"IMPRIMIR!B35","v":0},{"$f":"IMPRIMIR!C35","v":0},{"$f":"IF(E36=0,0,IMPRIMIR!D35)","v":0},{"$f":"IF(E36=0,0,IMPRIMIR!E35)","v":0},0,0,0]
[null,{"$f":"IF(E37=0,0,IMPRIMIR!A36)","v":0},{"$f":"IF(E37=0,0,IMPRIMIR!$D$3)","v":0},0,{"$f":"IMPRIMIR!B36","v":0},{"$f":"IMPRIMIR!C36","v":0},{"$f":"IF(E37=0,0,IMPRIMIR!D36)","v":0},{"$f":"IF(E37=0,0,IMPRIMIR!E36)","v":0},0,0,0]
[null,{"$f":"IF(E38=0,0,IMPRIMIR!A37)","v":0},{"$f":"IF(E38=0,0,IMPRIMIR!$D$3)","v":0},0,{"$f":"IMPRIMIR!B37","v":0},{"$f":"IMPRIMIR!C37","v":0},{"$f":"IF(E38=0,0,IMPRIMIR!D37)","v":0},{"$f":"IF(E38=0,0,IMPRIMIR!E37)","v":0},0,0,0]
[null,{"$f":"IF(E39=0,0,IMPRIMIR!A38)","v":0},{"$f":"IF(E39=0,0,IMPRIMIR!$D$3)","v":0},0,{"$f":"IMPRIMIR!B38","v":0},{"$f":"IMPRIMIR!C38","v":0},{"$f":"IF(E39=0,0,IMPRIMIR!D38)","v":0},{"$f":"IF(E39=0,0,IMPRIMIR!E38)","v":0},0,0,0]
[null,{"$f":"IF(E40=0,0,IMPRIMIR!A39)","v":0},{"$f":"IF(E40=0,0,IMPRIMIR!$D$3)","v":0},0,{"$f":"IMPRIMIR!B39","v":0},{"$f":"IMPRIMIR!C39","v":0},{"$f":"IF(E40=0,0,IMPRIMIR!D39)","v":0},{"$f":"IF(E40=0,0,IMPRIMIR!E39)","v":0},0,0,0]
[null,{"$f":"IF(E41=0,0,IMPRIMIR!A40)","v":0},{"$f":"IF(E41=0,0,IMPRIMIR!$D$3)","v":0},0,{"$f":"IMPRIMIR!B40","v":0},{"$f":"IMPRIMIR!C40","v":0},{"$f":"IF(E41=0,0,IMPRIMIR!D40)","v":0},{"$f":"IF(E41=0,0,IMPRIMIR!E40)","v":0},0,0,0]
[null,{"$f":"IF(E42=0,0,IMPRIMIR!A41)","v":0},{"$f":"IF(E42=0,0,IMPRIMIR!$D$3)","v":0},0,{"$f":"IMPRIMIR!B41","v":0},{"$f":"IMPRIMIR!C41","v":0},{"$f":"IF(E42=0,0,IMPRIMIR!D41)","v":0},{"$f":"IF(E42=0,0,IMPRIMIR!E41)","v":0},0,0,0]
[null,{"$f":"IF(E43=0,0,IMPRIMIR!A42)","v":0},{"$f":"IF(E43=0,0,IMPRIMIR!$D$3)","v":0},0,{"$f":"IMPRIMIR!B42","v":0},{"$f":"IMPRIMIR!C42","v":0},{"$f":"IF(E43=0,0,IMPRIMIR!D42)","v":0},{"$f":"IF(E43=0,0,IMPRIMIR!E42)","v":0},0,0,0]
[null,{"$f":"IF(E44=0,0,IMPRIMIR!A43)","v":0},{"$f":"IF(E44=0,0,IMPRIMIR!$D$3)","v":0},0,{"$f":"IMPRIMIR!B43","v":0},{"$f":"IMPRIMIR!C43","v":0},{"$f":"IF(E44=0,0,IMPRIMIR!D43)","v":0},{"$f":"IF(E44=0,0,IMPRIMIR!E43)","v":0},0,0,0]
[null,{"$f":"IF(E45=0,0,IMPRIMIR!A44)","v":0},{"$f":"IF(E45=0,0,IMPRIMIR!$D$3)","v":0},0,{"$f":"IMPRIMIR!B44","v":0},{"$f":"IMPRIMIR!C44","v":0},{"$f":"IF(E45=0,0,IMPRIMIR!D44)","v":0},{"$f":"IF(E45=0,0,IMPRIMIR!E44)","v":0},0,0,0]
[null,{"$f":"IF(E46=0,0,IMPRIMIR!A45)","v":0},{"$f":"IF(E46=0,0,IMPRIMIR!$D$3)","v":0},0,{"$f":"IMPRIMIR!B45","v":0},{"$f":"IMPRIMIR!C45","v":0},{"$f":"IF(E46=0,0,IMPRIMIR!D45)","v":0},{"$f":"IF(E46=0,0,IMPRIMIR!E45)","v":0},0,0,0]
[null,{"$f":"IF(E47=0,0,IMPRIMIR!A46)","v":0},{"$f":"IF(E47=0,0,IMPRIMIR!$D$3)","v":0},0,{"$f":"IMPRIMIR!B46","v":0},{"$f":"IMPRIMIR!C46","v":0},{"$f":"IF(E47=0,0,IMPRIMIR!D46)","v":0},{"$f":"IF(E47=0,0,IMPRIMIR!E46)","v":0},0,0,0]
[null,{"$f":"IF(E48=0,0,IMPRIMIR!A47)","v":0},{"$f":"IF(E48=0,0,IMPRIMIR!$D$3)","v":0},0,{"$f":"IMPRIMIR!B47","v":0},{"$f":"IMPRIMIR!C47","v":0},{"$f":"IF(E48=0,0,IMPRIMIR!D47)","v":0},{"$f":"IF(E48=0,0,IMPRIMIR!E47)","v":0},0,0,0]
[null,{"$f":"IF(E49=0,0,IMPRIMIR!A48)","v":0},{"$f":"IF(E49=0,0,IMPRIMIR!$D$3)","v":0},0,{"$f":"IMPRIMIR!B48","v":0},{"$f":"IMPRIMIR!C48","v":0},{"$f":"IF(E49=0,0,IMPRIMIR!D48)","v":0},{"$f":"IF(E49=0,0,IMPRIMIR!E48)","v":0},0,0,0]
[null,{"$f":"IF(E50=0,0,IMPRIMIR!A49)","v":0},{"$f":"IF(E50=0,0,IMPRIMIR!$D$3)","v":0},0,{"$f":"IMPRIMIR!B49","v":0},{"$f":"IMPRIMIR!C49","v":0},{"$f":"IF(E50=0,0,IMPRIMIR!D49)","v":0},{"$f":"IF(E50=0,0,IMPRIMIR!E49)","v":0},0,0,0]
[null,{"$f":"IF(E51=0,0,IMPRIMIR!A50)","v":0},{"$f":"IF(E51=0,0,IMPRIMIR!$D$3)","v":0},0,{"$f":"IMPRIMIR!B50","v":0},{"$f":"IMPRIMIR!C50","v":0},{"$f":"IF(E51=0,0,IMPRIMIR!D50)","v":0},{"$f":"IF(E51=0,0,IMPRIMIR!E50)","v":0},0,0,0]
[null,{"$f":"IF(E52=0,0,IMPRIMIR!A51)","v":0},{"$f":"IF(E52=0,0,IMPRIMIR!$D$3)","v":0},0,{"$f":"IMPRIMIR!B51","v":0},{"$f":"IMPRIMIR!C51","v":0},{"$f":"IF(E52=0,0,IMPRIMIR!D51)","v":0},{"$f":"IF(E52=0,0,IMPRIMIR!E51)","v":0},0,0,0]
[null,{"$f":"IF(E53=0,0,IMPRIMIR!A52)","v":0},{"$f":"IF(E53=0,0,IMPRIMIR!$D$3)","v":0},0,{"$f":"IMPRIMIR!B52","v":0},{"$f":"IMPRIMIR!C52","v":0},{"$f":"IF(E53=0,0,IMPRIMIR!D52)","v":0},{"$f":"IF(E53=0,0,IMPRIMIR!E52)","v":0},0,0,0]
[null,{"$f":"IF(E54=0,0,IMPRIMIR!A53)","v":0},{"$f":"IF(E54=0,0,IMPRIMIR!$D$3)","v":0},0,{"$f":"IMPRIMIR!B53","v":0},{"$f":"IMPRIMIR!C53","v":0},{"$f":"IF(E54=0,0,IMPRIMIR!D53)","v":0},{"$f":"IF(E54=0,0,IMPRIMIR!E53)","v":0},0,0,0]
[null,{"$f":"IF(E55=0,0,IMPRIMIR!A54)","v":0},{"$f":"IF(E55=0,0,IMPRIMIR!$D$3)","v":0},0,{"$f":"IMPRIMIR!B54","v":0},{"$f":"IMPRIMIR!C54","v":0},{"$f":"IF(E55=0,0,IMPRIMIR!D54)","v":0},{"$f":"IF(E55=0,0,IMPRIMIR!E54)","v":0},0,0,0]
[null,{"$f":"IF(E56=0,0,IMPRIMIR!A55)","v":0},{"$f":"IF(E56=0,0,IMPRIMIR!$D$3)","v":0},0,{"$f":"IMPRIMIR!B55","v":0},{"$f":"IMPRIMIR!C55","v":0},{"$f":"IF(E56=0,0,IMPRIMIR!D55)","v":0},{"$f":"IF(E56=0,0,IMPRIMIR!E55)","v":0},0,0,0]
[null,{"$f":"IF(E57=0,0,IMPRIMIR!A56)","v":0},{"$f":"IF(E57=0,0,IMPRIMIR!$D$3)","v":0},0,{"$f":"IMPRIMIR!B56","v":0},{"$f":"IMPRIMIR!C56","v":0},{"$f":"IF(E57=0,0,IMPRIMIR!D56)","v":0},{"$f":"IF(E57=0,0,IMPRIMIR!E56)","v":0},0,0,0]
[null,{"$f":"IF(E58=0,0,IMPRIMIR!A57)","v":0},{"$f":"IF(E58=0,0,IMPRIMIR!$D$3)","v":0},0,{"$f":"IMPRIMIR!B57","v":0},{"$f":"IMPRIMIR!C57","v":0},{"$f":"IF(E58=0,0,IMPRIMIR!D57)","v":0},{"$f":"IF(E58=0,0,IMPRIMIR!E57)","v":0},0,0,0]
[null,{"$f":"IF(E59=0,0,IMPRIMIR!A58)","v":0},{"$f":"IF(E59=0,0,IMPRIMIR!$D$3)","v":0},0,{"$f":"IMPRIMIR!B58","v":0},{"$f":"IMPRIMIR!C58","v":0},{"$f":"IF(E59=0,0,IMPRIMIR!D58)","v":0},{"$f":"IF(E59=0,0,IMPRIMIR!E58)","v":0},0,0,0]
[null,{"$f":"IF(E60=0,0,IMPRIMIR!A59)","v":0},{"$f":"IF(E60=0,0,IMPRIMIR!$D$3)","v":0},0,{"$f":"IMPRIMIR!B59","v":0},{"$f":"IMPRIMIR!C59","v":0},{"$f":"IF(E60=0,0,IMPRIMIR!D59)","v":0},{"$f":"IF(E60=0,0,IMPRIMIR!E59)","v":0},0,0,0]
[null,{"$f":"IF(E61=0,0,IMPRIMIR!A60)","v":0},{"$f":"IF(E61=0,0,IMPRIMIR!$D$3)","v":0},0,{"$f":"IMPRIMIR!B60","v":0},{"$f":"IMPRIMIR!C60","v":0},{"$f":"IF(E61=0,0,IMPRIMIR!D60)","v":0},{"$f":"IF(E61=0,0,IMPRIMIR!E60)","v":0},0,0,0]
[null,{"$f":"IF(E62=0,0,IMPRIMIR!A61)","v":0},{"$f":"IF(E62=0,0,IMPRIMIR!$D$3)","v":0},0,{"$f":"IMPRIMIR!B61","v":0},{"$f":"IMPRIMIR!C61","v":0},{"$f":"IF(E62=0,0,IMPRIMIR!D61)","v":0},{"$f":"IF(E62=0,0,IMPRIMIR!E61)","v":0},0,0,0]
[null,{"$f":"IF(E63=0,0,IMPRIMIR!A62)","v":0},{"$f":"IF(E63=0,0,IMPRIMIR!$D$3)","v":0},0,{"$f":"IMPRIMIR!B62","v":0},{"$f":"IMPRIMIR!C62","v":0},{"$f":"IF(E63=0,0,IMPRIMIR!D62)","v":0},{"$f":"IF(E63=0,0,IMPRIMIR!E62)","v":0},0,0,0]
[null,{"$f":"IF(E64=0,0,IMPRIMIR!A63)","v":0},{"$f":"IF(E64=0,0,IMPRIMIR!$D$3)","v":0},0,{"$f":"IMPRIMIR!B63","v":0},{"$f":"IMPRIMIR!C63","v":0},{"$f":"IF(E64=0,0,IMPRIMIR!D63)","v":0},{"$f":"IF(E64=0,0,IMPRIMIR!E63)","v":0},0,0,0]
[null,{"$f":"IF(E65=0,0,IMPRIMIR!A64)","v":0},{"$f":"IF(E65=0,0,IMPRIMIR!$D$3)","v":0},0,{"$f":"IMPRIMIR!B64","v":0},{"$f":"IMPRIMIR!C64","v":0},{"$f":"IF(E65=0,0,IMPRIMIR!D64)","v":0},{"$f":"IF(E65=0,0,IMPRIMIR!E64)","v":0},0,0,0]
[null,{"$f":"IF(E66=0,0,IMPRIMIR!A65)","v":0},{"$f":"IF(E66=0,0,IMPRIMIR!$D$3)","v":0},0,{"$f":"IMPRIMIR!B65","v":0},{"$f":"IMPRIMIR!C65","v":0},{"$f":"IF(E66=0,0,IMPRIMIR!D65)","v":0},{"$f":"IF(E66=0,0,IMPRIMIR!E65)","v":0},0,0,0]
[null,{"$f":"IF(E67=0,0,IMPRIMIR!A66)","v":0},{"$f":"IF(E67=0,0,IMPRIMIR!$D$3)","v":0},0,{"$f":"IMPRIMIR!B66","v":0},{"$f":"IMPRIMIR!C66","v":0},{"$f":"IF(E67=0,0,IMPRIMIR!D66)","v":0},{"$f":"IF(E67=0,0,IMPRIMIR!E66)","v":0},0,0,0]
[null,{"$f":"IF(E68=0,0,IMPRIMIR!A67)","v":0},{"$f":"IF(E68=0,0,IMPRIMIR!$D$3)","v":0},0,{"$f":"IMPRIMIR!B67","v":0},{"$f":"IMPRIMIR!C67","v":0},{"$f":"IF(E68=0,0,IMPRIMIR!D67)","v":0},{"$f":"IF(E68=0,0,IMPRIMIR!E67)","v":0},0,0,0]
[null,{"$f":"IF(E69=0,0,IMPRIMIR!A68)","v":0},{"$f":"IF(E69=0,0,IMPRIMIR!$D$3)","v":0},{"$f":"IF(E69=\"0\",0,$G$2)","v":0},{"$f":"IMPRIMIR!B68","v":0},{"$f":"IMPRIMIR!C68","v":0},{"$f":"IF(E69=0,0,IMPRIMIR!D68)","v":0},{"$f":"IF(E69=0,0,IMPRIMIR!E68)","v":0},{"$f":"IF(E69=0,0,$G$2)","v":0},{"$f":"IF(E69=0,0,$G$4)","v":0},{"$f":"IF(E69=0,0,$G$3)","v":0}]
[null,{"$f":"IF(E70=0,0,IMPRIMIR!A69)","v":0},{"$f":"IF(E70=0,0,IMPRIMIR!$D$3)","v":0},0,{"$f":"IMPRIMIR!B69","v":0},{"$f":"IMPRIMIR!C69","v":0},{"$f":"IF(E70=0,0,IMPRIMIR!D69)","v":0},{"$f":"IF(E70=0,0,IMPRIMIR!E69)","v":0},0,0,0]
[null,{"$f":"IF(E71=0,0,IMPRIMIR!A70)","v":0},{"$f":"IF(E71=0,0,IMPRIMIR!$D$3)","v":0},0,{"$f":"IMPRIMIR!B70","v":0},{"$f":"IMPRIMIR!C70","v":0},{"$f":"IF(E71=0,0,IMPRIMIR!D70)","v":0},{"$f":"IF(E71=0,0,IMPRIMIR!E70)","v":0},0,0,0]
[null,{"$f":"IF(E72=0,0,IMPRIMIR!A71)","v":0},{"$f":"IF(E72=0,0,IMPRIMIR!$D$3)","v":0},0,{"$f":"IMPRIMIR!B71","v":0},{"$f":"IMPRIMIR!C71","v":0},{"$f":"IF(E72=0,0,IMPRIMIR!D71)","v":0},{"$f":"IF(E72=0,0,IMPRIMIR!E71)","v":0},0,0,0]
[null,{"$f":"IF(E73=0,0,IMPRIMIR!A72)","v":0},{"$f":"IF(E73=0,0,IMPRIMIR!$D$3)","v":0},0,{"$f":"IMPRIMIR!B72","v":0},{"$f":"IMPRIMIR!C72","v":0},{"$f":"IF(E73=0,0,IMPRIMIR!D72)","v":0},{"$f":"IF(E73=0,0,IMPRIMIR!E72)","v":0},0,0,0]
[null,{"$f":"IF(E74=0,0,IMPRIMIR!A73)","v":0},{"$f":"IF(E74=0,0,IMPRIMIR!$D$3)","v":0},0,{"$f":"IMPRIMIR!B73","v":0},{"$f":"IMPRIMIR!C73","v":0},{"$f":"IF(E74=0,0,IMPRIMIR!D73)","v":0},{"$f":"IF(E74=0,0,IMPRIMIR!E73)","v":0},0,0,0]
[null,{"$f":"IF(E75=0,0,IMPRIMIR!A74)","v":0},{"$f":"IF(E75=0,0,IMPRIMIR!$D$3)","v":0},0,{"$f":"IMPRIMIR!B74","v":0},{"$f":"IMPRIMIR!C74","v":0},{"$f":"IF(E75=0,0,IMPRIMIR!D74)","v":0},{"$f":"IF(E75=0,0,IMPRIMIR!E74)","v":0},0,0,0]
[null,{"$f":"IF(E76=0,0,IMPRIMIR!A75)","v":0},{"$f":"IF(E76=0,0,IMPRIMIR!$D$3)","v":0},0,{"$f":"IMPRIMIR!B75","v":0},{"$f":"IMPRIMIR!C75","v":0},{"$f":"IF(E76=0,0,IMPRIMIR!D75)","v":0},{"$f":"IF(E76=0,0,IMPRIMIR!E75)","v":0},0,0,0]
[null,{"$f":"IF(E77=0,0,IMPRIMIR!A76)","v":0},{"$f":"IF(E77=0,0,IMPRIMIR!$D$3)","v":0},0,{"$f":"IMPRIMIR!B76","v":0},{"$f":"IMPRIMIR!C76","v":0},{"$f":"IF(E77=0,0,IMPRIMIR!D76)","v":0},{"$f":"IF(E77=0,0,IMPRIMIR!E76)","v":0},0,0,0]
[null,{"$f":"IF(E78=0,0,IMPRIMIR!A77)","v":0},{"$f":"IF(E78=0,0,IMPRIMIR!$D$3)","v":0},0,{"$f":"IMPRIMIR!B77","v":0},{"$f":"IMPRIMIR!C77","v":0},{"$f":"IF(E78=0,0,IMPRIMIR!D77)","v":0},{"$f":"IF(E78=0,0,IMPRIMIR!E77)","v":0},0,0,0]
[null,{"$f":"IF(E79=0,0,IMPRIMIR!A78)","v":0},{"$f":"IF(E79=0,0,IMPRIMIR!$D$3)","v":0},0,{"$f":"IMPRIMIR!B78","v":0},{"$f":"IMPRIMIR!C78","v":0},{"$f":"IF(E79=0,0,IMPRIMIR!D78)","v":0},{"$f":"IF(E79=0,0,IMPRIMIR!E78)","v":0},0,0,0]
[null,{"$f":"IF(E80=0,0,IMPRIMIR!A79)","v":0},{"$f":"IF(E80=0,0,IMPRIMIR!$D$3)","v":0},0,{"$f":"IMPRIMIR!B79","v":0},{"$f":"IMPRIMIR!C79","v":0},{"$f":"IF(E80=0,0,IMPRIMIR!D79)","v":0},{"$f":"IF(E80=0,0,IMPRIMIR!E79)","v":0},0,0,0]
[null,{"$f":"IF(E81=0,0,IMPRIMIR!A80)","v":0},{"$f":"IF(E81=0,0,IMPRIMIR!$D$3)","v":0},0,{"$f":"IMPRIMIR!B80","v":0},{"$f":"IMPRIMIR!C80","v":0},{"$f":"IF(E81=0,0,IMPRIMIR!D80)","v":0},{"$f":"IF(E81=0,0,IMPRIMIR!E80)","v":0},0,0,0]
[null,{"$f":"IF(E82=0,0,IMPRIMIR!A81)","v":0},{"$f":"IF(E82=0,0,IMPRIMIR!$D$3)","v":0},0,{"$f":"IMPRIMIR!B81","v":0},{"$f":"IMPRIMIR!C81","v":0},{"$f":"IF(E82=0,0,IMPRIMIR!D81)","v":0},{"$f":"IF(E82=0,0,IMPRIMIR!E81)","v":0},0,0,0]
[null,{"$f":"IF(E83=0,0,IMPRIMIR!A82)","v":0},{"$f":"IF(E83=0,0,IMPRIMIR!$D$3)","v":0},0,{"$f":"IMPRIMIR!B82","v":0},{"$f":"IMPRIMIR!C82","v":0},{"$f":"IF(E83=0,0,IMPRIMIR!D82)","v":0},{"$f":"IF(E83=0,0,IMPRIMIR!E82)","v":0},0,0,0]
[null,{"$f":"IF(E84=0,0,IMPRIMIR!A83)","v":0},{"$f":"IF(E84=0,0,IMPRIMIR!$D$3)","v":0},0,{"$f":"IMPRIMIR!B83","v":0},{"$f":"IMPRIMIR!C83","v":0},{"$f":"IF(E84=0,0,IMPRIMIR!D83)","v":0},{"$f":"IF(E84=0,0,IMPRIMIR!E83)","v":0},0,0,0]
[null,{"$f":"IF(E85=0,0,IMPRIMIR!A84)","v":0},{"$f":"IF(E85=0,0,IMPRIMIR!$D$3)","v":0},0,{"$f":"IMPRIMIR!B84","v":0},{"$f":"IMPRIMIR!C84","v":0},{"$f":"IF(E85=0,0,IMPRIMIR!D84)","v":0},{"$f":"IF(E85=0,0,IMPRIMIR!E84)","v":0},0,0,0]
[null,{"$f":"IF(E86=0,0,IMPRIMIR!A85)","v":0},{"$f":"IF(E86=0,0,IMPRIMIR!$D$3)","v":0},0,{"$f":"IMPRIMIR!B85","v":0},{"$f":"IMPRIMIR!C85","v":0},{"$f":"IF(E86=0,0,IMPRIMIR!D85)","v":0},{"$f":"IF(E86=0,0,IMPRIMIR!E85)","v":0},0,0,0]
[null,{"$f":"IF(E87=0,0,IMPRIMIR!A86)","v":0},{"$f":"IF(E87=0,0,IMPRIMIR!$D$3)","v":0},0,{"$f":"IMPRIMIR!B86","v":0},{"$f":"IMPRIMIR!C86","v":0},{"$f":"IF(E87=0,0,IMPRIMIR!D86)","v":0},{"$f":"IF(E87=0,0,IMPRIMIR!E86)","v":0},0,0,0]
[null,{"$f":"IF(E88=0,0,IMPRIMIR!A87)","v":0},{"$f":"IF(E88=0,0,IMPRIMIR!$D$3)","v":0},0,{"$f":"IMPRIMIR!B87","v":0},{"$f":"IMPRIMIR!C87","v":0},{"$f":"IF(E88=0,0,IMPRIMIR!D87)","v":0},{"$f":"IF(E88=0,0,IMPRIMIR!E87)","v":0},0,0,0]
[null,{"$f":"IF(E89=0,0,IMPRIMIR!A88)","v":0},{"$f":"IF(E89=0,0,IMPRIMIR!$D$3)","v":0},0,{"$f":"IMPRIMIR!B88","v":0},{"$f":"IMPRIMIR!C88","v":0},{"$f":"IF(E89=0,0,IMPRIMIR!D88)","v":0},{"$f":"IF(E89=0,0,IMPRIMIR!E88)","v":0},0,0,0]
[null,{"$f":"IF(E90=0,0,IMPRIMIR!A89)","v":0},{"$f":"IF(E90=0,0,IMPRIMIR!$D$3)","v":0},0,{"$f":"IMPRIMIR!B89","v":0},{"$f":"IMPRIMIR!C89","v":0},{"$f":"IF(E90=0,0,IMPRIMIR!D89)","v":0},{"$f":"IF(E90=0,0,IMPRIMIR!E89)","v":0},0,0,0]
[null,{"$f":"IF(E91=0,0,IMPRIMIR!A90)","v":0},{"$f":"IF(E91=0,0,IMPRIMIR!$D$3)","v":0},0,{"$f":"IMPRIMIR!B90","v":0},{"$f":"IMPRIMIR!C90","v":0},{"$f":"IF(E91=0,0,IMPRIMIR!D90)","v":0},{"$f":"IF(E91=0,0,IMPRIMIR!E90)","v":0},0,0,0]
[null,{"$f":"IF(E92=0,0,IMPRIMIR!A91)","v":0},{"$f":"IF(E92=0,0,IMPRIMIR!$D$3)","v":0},0,{"$f":"IMPRIMIR!B91","v":0},{"$f":"IMPRIMIR!C91","v":0},{"$f":"IF(E92=0,0,IMPRIMIR!D91)","v":0},{"$f":"IF(E92=0,0,IMPRIMIR!E91)","v":0},0,0,0]
[null,{"$f":"IF(E93=0,0,IMPRIMIR!A92)","v":0},{"$f":"IF(E93=0,0,IMPRIMIR!$D$3)","v":0},0,{"$f":"IMPRIMIR!B92","v":0},{"$f":"IMPRIMIR!C92","v":0},{"$f":"IF(E93=0,0,IMPRIMIR!D92)","v":0},{"$f":"IF(E93=0,0,IMPRIMIR!E92)","v":0},0,0,0]
[null,{"$f":"IF(E94=0,0,IMPRIMIR!A93)","v":0},{"$f":"IF(E94=0,0,IMPRIMIR!$D$3)","v":0},0,{"$f":"IMPRIMIR!B93","v":0},{"$f":"IMPRIMIR!C93","v":0},{"$f":"IF(E94=0,0,IMPRIMIR!D93)","v":0},{"$f":"IF(E94=0,0,IMPRIMIR!E93)","v":0},0,0,0]
[null,{"$f":"IF(E95=0,0,IMPRIMIR!A94)","v":0},{"$f":"IF(E95=0,0,IMPRIMIR!$D$3)","v":0},0,{"$f":"IMPRIMIR!B94","v":0},{"$f":"IMPRIMIR!C94","v":0},{"$f":"IF(E95=0,0,IMPRIMIR!D94)","v":0},{"$f":"IF(E95=0,0,IMPRIMIR!E94)","v":0},0,0,0]
[null,{"$f":"IF(E96=0,0,IMPRIMIR!A95)","v":0},{"$f":"IF(E96=0,0,IMPRIMIR!$D$3)","v":0},0,{"$f":"IMPRIMIR!B95","v":0},{"$f":"IMPRIMIR!C95","v":0},{"$f":"IF(E96=0,0,IMPRIMIR!D95)","v":0},{"$f":"IF(E96=0,0,IMPRIMIR!E95)","v":0},0,0,0]
[null,{"$f":"IF(E97=0,0,IMPRIMIR!A96)","v":0},{"$f":"IF(E97=0,0,IMPRIMIR!$D$3)","v":0},0,{"$f":"IMPRIMIR!B96","v":0},{"$f":"IMPRIMIR!C96","v":0},{"$f":"IF(E97=0,0,IMPRIMIR!D96)","v":0},{"$f":"IF(E97=0,0,IMPRIMIR!E96)","v":0},0,0,0]
[null,{"$f":"IF(E98=0,0,IMPRIMIR!A97)","v":0},{"$f":"IF(E98=0,0,IMPRIMIR!$D$3)","v":0},0,{"$f":"IMPRIMIR!B97","v":0},{"$f":"IMPRIMIR!C97","v":0},{"$f":"IF(E98=0,0,IMPRIMIR!D97)","v":0},{"$f":"IF(E98=0,0,IMPRIMIR!E97)","v":0},0,0,0]
[null,{"$f":"IF(E99=0,0,IMPRIMIR!A98)","v":0},{"$f":"IF(E99=0,0,IMPRIMIR!$D$3)","v":0},0,{"$f":"IMPRIMIR!B98","v":0},{"$f":"IMPRIMIR!C98","v":0},{"$f":"IF(E99=0,0,IMPRIMIR!D98)","v":0},{"$f":"IF(E99=0,0,IMPRIMIR!E98)","v":0},0,0,0]
[null,{"$f":"IF(E100=0,0,IMPRIMIR!A99)","v":0},{"$f":"IF(E100=0,0,IMPRIMIR!$D$3)","v":0},0,{"$f":"IMPRIMIR!B99","v":0},{"$f":"IMPRIMIR!C99","v":0},{"$f":"IF(E100=0,0,IMPRIMIR!D99)","v":0},{"$f":"IF(E100=0,0,IMPRIMIR!E99)","v":0},0,0,0]
[null,{"$f":"IF(E101=0,0,IMPRIMIR!A100)","v":0},{"$f":"IF(E101=0,0,IMPRIMIR!$D$3)","v":0},0,{"$f":"IMPRIMIR!B100","v":0},{"$f":"IMPRIMIR!C100","v":0},{"$f":"IF(E101=0,0,IMPRIMIR!D100)","v":0},{"$f":"IF(E101=0,0,IMPRIMIR!E100)","v":0},0,0,0]
[null,{"$f":"IF(E102=0,0,IMPRIMIR!A101)","v":0},{"$f":"IF(E102=0,0,IMPRIMIR!$D$3)","v":0},0,{"$f":"IMPRIMIR!B101","v":0},{"$f":"IMPRIMIR!C101","v":0},{"$f":"IF(E102=0,0,IMPRIMIR!D101)","v":0},{"$f":"IF(E102=0,0,IMPRIMIR!E101)","v":0},0,0,0]
[null,{"$f":"IF(E103=0,0,IMPRIMIR!A102)","v":0},{"$f":"IF(E103=0,0,IMPRIMIR!$D$3)","v":0},0,{"$f":"IMPRIMIR!B102","v":0},{"$f":"IMPRIMIR!C102","v":0},{"$f":"IF(E103=0,0,IMPRIMIR!D102)","v":0},{"$f":"IF(E103=0,0,IMPRIMIR!E102)","v":0},0,0,0]
[null,{"$f":"IF(E104=0,0,IMPRIMIR!A103)","v":0},{"$f":"IF(E104=0,0,IMPRIMIR!$D$3)","v":0},0,{"$f":"IMPRIMIR!B103","v":0},{"$f":"IMPRIMIR!C103","v":0},{"$f":"IF(E104=0,0,IMPRIMIR!D103)","v":0},{"$f":"IF(E104=0,0,IMPRIMIR!E103)","v":0},0,0,0]
[null,{"$f":"IF(E105=0,0,IMPRIMIR!A104)","v":0},{"$f":"IF(E105=0,0,IMPRIMIR!$D$3)","v":0},0,{"$f":"IMPRIMIR!B104","v":0},{"$f":"IMPRIMIR!C104","v":0},{"$f":"IF(E105=0,0,IMPRIMIR!D104)","v":0},{"$f":"IF(E105=0,0,IMPRIMIR!E104)","v":0},0,0,0]
[null,{"$f":"IF(E106=0,0,IMPRIMIR!A105)","v":0},{"$f":"IF(E106=0,0,IMPRIMIR!$D$3)","v":0},0,{"$f":"IMPRIMIR!B105","v":0},{"$f":"IMPRIMIR!C105","v":0},{"$f":"IF(E106=0,0,IMPRIMIR!D105)","v":0},{"$f":"IF(E106=0,0,IMPRIMIR!E105)","v":0},0,0,0]
[null,{"$f":"IF(E107=0,0,IMPRIMIR!A106)","v":0},{"$f":"IF(E107=0,0,IMPRIMIR!$D$3)","v":0},0,{"$f":"IMPRIMIR!B106","v":0},{"$f":"IMPRIMIR!C106","v":0},{"$f":"IF(E107=0,0,IMPRIMIR!D106)","v":0},{"$f":"IF(E107=0,0,IMPRIMIR!E106)","v":0},0,0,0]
[null,{"$f":"IF(E108=0,0,IMPRIMIR!A107)","v":0},{"$f":"IF(E108=0,0,IMPRIMIR!$D$3)","v":0},0,{"$f":"IMPRIMIR!B107","v":0},{"$f":"IMPRIMIR!C107","v":0},{"$f":"IF(E108=0,0,IMPRIMIR!D107)","v":0},{"$f":"IF(E108=0,0,IMPRIMIR!E107)","v":0},0,0,0]
[null,{"$f":"IF(E109=0,0,IMPRIMIR!A108)","v":0},{"$f":"IF(E109=0,0,IMPRIMIR!$D$3)","v":0},0,{"$f":"IMPRIMIR!B108","v":0},{"$f":"IMPRIMIR!C108","v":0},{"$f":"IF(E109=0,0,IMPRIMIR!D108)","v":0},{"$f":"IF(E109=0,0,IMPRIMIR!E108)","v":0},0,0,0]
[null,{"$f":"IF(E110=0,0,IMPRIMIR!A109)","v":0},{"$f":"IF(E110=0,0,IMPRIMIR!$D$3)","v":0},0,{"$f":"IMPRIMIR!B109","v":0},{"$f":"IMPRIMIR!C109","v":0},{"$f":"IF(E110=0,0,IMPRIMIR!D109)","v":0},{"$f":"IF(E110=0,0,IMPRIMIR!E109)","v":0},0,0,0]
[null,{"$f":"IF(E111=0,0,IMPRIMIR!A110)","v":0},{"$f":"IF(E111=0,0,IMPRIMIR!$D$3)","v":0},0,{"$f":"IMPRIMIR!B110","v":0},{"$f":"IMPRIMIR!C110","v":0},{"$f":"IF(E111=0,0,IMPRIMIR!D110)","v":0},{"$f":"IF(E111=0,0,IMPRIMIR!E110)","v":0},0,0,0]
[null,{"$f":"IF(E112=0,0,IMPRIMIR!A111)","v":0},{"$f":"IF(E112=0,0,IMPRIMIR!$D$3)","v":0},0,{"$f":"IMPRIMIR!B111","v":0},{"$f":"IMPRIMIR!C111","v":0},{"$f":"IF(E112=0,0,IMPRIMIR!D111)","v":0},{"$f":"IF(E112=0,0,IMPRIMIR!E111)","v":0},0,0,0]
[null,{"$f":"IF(E113=0,0,IMPRIMIR!A112)","v":0},{"$f":"IF(E113=0,0,IMPRIMIR!$D$3)","v":0},0,{"$f":"IMPRIMIR!B112","v":0},{"$f":"IMPRIMIR!C112","v":0},{"$f":"IF(E113=0,0,IMPRIMIR!D112)","v":0},{"$f":"IF(E113=0,0,IMPRIMIR!E112)","v":0},0,0,0]
[null,{"$f":"IF(E114=0,0,IMPRIMIR!A113)","v":0},{"$f":"IF(E114=0,0,IMPRIMIR!$D$3)","v":0},0,{"$f":"IMPRIMIR!B113","v":0},{"$f":"IMPRIMIR!C113","v":0},{"$f":"IF(E114=0,0,IMPRIMIR!D113)","v":0},{"$f":"IF(E114=0,0,IMPRIMIR!E113)","v":0},0,0,0]
[null,{"$f":"IF(E115=0,0,IMPRIMIR!A114)","v":0},{"$f":"IF(E115=0,0,IMPRIMIR!$D$3)","v":0},0,{"$f":"IMPRIMIR!B114","v":0},{"$f":"IMPRIMIR!C114","v":0},{"$f":"IF(E115=0,0,IMPRIMIR!D114)","v":0},{"$f":"IF(E115=0,0,IMPRIMIR!E114)","v":0},0,0,0]
[null,{"$f":"IF(E116=0,0,IMPRIMIR!A115)","v":0},{"$f":"IF(E116=0,0,IMPRIMIR!$D$3)","v":0},0,{"$f":"IMPRIMIR!B115","v":0},{"$f":"IMPRIMIR!C115","v":0},{"$f":"IF(E116=0,0,IMPRIMIR!D115)","v":0},{"$f":"IF(E116=0,0,IMPRIMIR!E115)","v":0},0,0,0]
[null,{"$f":"IF(E117=0,0,IMPRIMIR!A116)","v":0},{"$f":"IF(E117=0,0,IMPRIMIR!$D$3)","v":0},0,{"$f":"IMPRIMIR!B116","v":0},{"$f":"IMPRIMIR!C116","v":0},{"$f":"IF(E117=0,0,IMPRIMIR!D116)","v":0},{"$f":"IF(E117=0,0,IMPRIMIR!E116)","v":0},0,0,0]
[null,{"$f":"IF(E118=0,0,IMPRIMIR!A117)","v":0},{"$f":"IF(E118=0,0,IMPRIMIR!$D$3)","v":0},0,{"$f":"IMPRIMIR!B117","v":0},{"$f":"IMPRIMIR!C117","v":0},{"$f":"IF(E118=0,0,IMPRIMIR!D117)","v":0},{"$f":"IF(E118=0,0,IMPRIMIR!E117)","v":0},0,0,0]
[null,{"$f":"IF(E119=0,0,IMPRIMIR!A118)","v":0},{"$f":"IF(E119=0,0,IMPRIMIR!$D$3)","v":0},0,{"$f":"IMPRIMIR!B118","v":0},{"$f":"IMPRIMIR!C118","v":0},{"$f":"IF(E119=0,0,IMPRIMIR!D118)","v":0},{"$f":"IF(E119=0,0,IMPRIMIR!E118)","v":0},0,0,0]
[null,{"$f":"IF(E120=0,0,IMPRIMIR!A119)","v":0},{"$f":"IF(E120=0,0,IMPRIMIR!$D$3)","v":0},0,{"$f":"IMPRIMIR!B119","v":0},{"$f":"IMPRIMIR!C119","v":0},{"$f":"IF(E120=0,0,IMPRIMIR!D119)","v":0},{"$f":"IF(E120=0,0,IMPRIMIR!E119)","v":0},0,0,0]
[null,{"$f":"IF(E121=0,0,IMPRIMIR!A120)","v":0},{"$f":"IF(E121=0,0,IMPRIMIR!$D$3)","v":0},0,{"$f":"IMPRIMIR!B120","v":0},{"$f":"IMPRIMIR!C120","v":0},{"$f":"IF(E121=0,0,IMPRIMIR!D120)","v":0},{"$f":"IF(E121=0,0,IMPRIMIR!E120)","v":0},0,0,0]
[null,{"$f":"IF(E122=0,0,IMPRIMIR!A121)","v":0},{"$f":"IF(E122=0,0,IMPRIMIR!$D$3)","v":0},0,{"$f":"IMPRIMIR!B121","v":0},{"$f":"IMPRIMIR!C121","v":0},{"$f":"IF(E122=0,0,IMPRIMIR!D121)","v":0},{"$f":"IF(E122=0,0,IMPRIMIR!E121)","v":0},0,0,0]
[null,{"$f":"IF(E123=0,0,IMPRIMIR!A122)","v":0},{"$f":"IF(E123=0,0,IMPRIMIR!$D$3)","v":0},0,{"$f":"IMPRIMIR!B122","v":0},{"$f":"IMPRIMIR!C122","v":0},{"$f":"IF(E123=0,0,IMPRIMIR!D122)","v":0},{"$f":"IF(E123=0,0,IMPRIMIR!E122)","v":0},0,0,0]
[null,{"$f":"IF(E124=0,0,IMPRIMIR!A123)","v":0},{"$f":"IF(E124=0,0,IMPRIMIR!$D$3)","v":0},{"$f":"IF(E124=\"0\",0,$G$2)","v":0},{"$f":"IMPRIMIR!B123","v":0},{"$f":"IMPRIMIR!C123","v":0},{"$f":"IF(E124=0,0,IMPRIMIR!D123)","v":0},{"$f":"IF(E124=0,0,IMPRIMIR!E123)","v":0},{"$f":"IF(E124=0,0,$G$2)","v":0},{"$f":"IF(E124=0,0,$G$4)","v":0},{"$f":"IF(E124=0,0,$G$3)","v":0}]
[null,{"$f":"IF(E125=0,0,IMPRIMIR!A124)","v":0},{"$f":"IF(E125=0,0,IMPRIMIR!$D$3)","v":0},0,{"$f":"IMPRIMIR!B124","v":0},{"$f":"IMPRIMIR!C124","v":0},{"$f":"IF(E125=0,0,IMPRIMIR!D124)","v":0},{"$f":"IF(E125=0,0,IMPRIMIR!E124)","v":0},0,0,0]
[null,{"$f":"IF(E126=0,0,IMPRIMIR!A125)","v":0},{"$f":"IF(E126=0,0,IMPRIMIR!$D$3)","v":0},0,{"$f":"IMPRIMIR!B125","v":0},{"$f":"IMPRIMIR!C125","v":0},{"$f":"IF(E126=0,0,IMPRIMIR!D125)","v":0},{"$f":"IF(E126=0,0,IMPRIMIR!E125)","v":0},0,0,0]
[null,{"$f":"IF(E127=0,0,IMPRIMIR!A126)","v":0},{"$f":"IF(E127=0,0,IMPRIMIR!$D$3)","v":0},{"$f":"IF(E127=\"0\",0,$G$2)","v":0},{"$f":"IMPRIMIR!B126","v":0},{"$f":"IMPRIMIR!C126","v":0},{"$f":"IF(E127=0,0,IMPRIMIR!D126)","v":0},{"$f":"IF(E127=0,0,IMPRIMIR!E126)","v":0},{"$f":"IF(E127=0,0,$G$2)","v":0},{"$f":"IF(E127=0,0,$G$4)","v":0},{"$f":"IF(E127=0,0,$G$3)","v":0}]
[null,{"$f":"IF(E128=0,0,IMPRIMIR!A127)","v":0},{"$f":"IF(E128=0,0,IMPRIMIR!$D$3)","v":0},0,{"$f":"IMPRIMIR!B127","v":0},{"$f":"IMPRIMIR!C127","v":0},{"$f":"IF(E128=0,0,IMPRIMIR!D127)","v":0},{"$f":"IF(E128=0,0,IMPRIMIR!E127)","v":0},0,0,0]
[null,{"$f":"IF(E129=0,0,IMPRIMIR!A128)","v":0},{"$f":"IF(E129=0,0,IMPRIMIR!$D$3)","v":0},0,{"$f":"IMPRIMIR!B128","v":0},{"$f":"IMPRIMIR!C128","v":0},{"$f":"IF(E129=0,0,IMPRIMIR!D128)","v":0},{"$f":"IF(E129=0,0,IMPRIMIR!E128)","v":0},0,0,0]
[null,{"$f":"IF(E130=0,0,IMPRIMIR!A129)","v":0},{"$f":"IF(E130=0,0,IMPRIMIR!$D$3)","v":0},0,{"$f":"IMPRIMIR!B129","v":0},{"$f":"IMPRIMIR!C129","v":0},{"$f":"IF(E130=0,0,IMPRIMIR!D129)","v":0},{"$f":"IF(E130=0,0,IMPRIMIR!E129)","v":0},0,0,0]
[null,{"$f":"IF(E131=0,0,IMPRIMIR!A130)","v":0},{"$f":"IF(E131=0,0,IMPRIMIR!$D$3)","v":0},0,{"$f":"IMPRIMIR!B130","v":0},{"$f":"IMPRIMIR!C130","v":0},{"$f":"IF(E131=0,0,IMPRIMIR!D130)","v":0},{"$f":"IF(E131=0,0,IMPRIMIR!E130)","v":0},0,0,0]
[null,{"$f":"IF(E132=0,0,IMPRIMIR!A131)","v":0},{"$f":"IF(E132=0,0,IMPRIMIR!$D$3)","v":0},0,{"$f":"IMPRIMIR!B131","v":0},{"$f":"IMPRIMIR!C131","v":0},{"$f":"IF(E132=0,0,IMPRIMIR!D131)","v":0},{"$f":"IF(E132=0,0,IMPRIMIR!E131)","v":0},0,0,0]
[null,{"$f":"IF(E133=0,0,IMPRIMIR!A132)","v":0},{"$f":"IF(E133=0,0,IMPRIMIR!$D$3)","v":0},0,{"$f":"IMPRIMIR!B132","v":0},{"$f":"IMPRIMIR!C132","v":0},{"$f":"IF(E133=0,0,IMPRIMIR!D132)","v":0},{"$f":"IF(E133=0,0,IMPRIMIR!E132)","v":0},0,0,0]
[null,{"$f":"IF(E134=0,0,IMPRIMIR!A133)","v":0},{"$f":"IF(E134=0,0,IMPRIMIR!$D$3)","v":0},0,{"$f":"IMPRIMIR!B133","v":0},{"$f":"IMPRIMIR!C133","v":0},{"$f":"IF(E134=0,0,IMPRIMIR!D133)","v":0},{"$f":"IF(E134=0,0,IMPRIMIR!E133)","v":0},0,0,0]
[null,{"$f":"IF(E135=0,0,IMPRIMIR!A134)","v":0},{"$f":"IF(E135=0,0,IMPRIMIR!$D$3)","v":0},0,{"$f":"IMPRIMIR!B134","v":0},{"$f":"IMPRIMIR!C134","v":0},{"$f":"IF(E135=0,0,IMPRIMIR!D134)","v":0},{"$f":"IF(E135=0,0,IMPRIMIR!E134)","v":0},0,0,0]
[null,{"$f":"IF(E136=0,0,IMPRIMIR!A135)","v":0},{"$f":"IF(E136=0,0,IMPRIMIR!$D$3)","v":0},0,{"$f":"IMPRIMIR!B135","v":0},{"$f":"IMPRIMIR!C135","v":0},{"$f":"IF(E136=0,0,IMPRIMIR!D135)","v":0},{"$f":"IF(E136=0,0,IMPRIMIR!E135)","v":0},0,0,0]
[null,{"$f":"IF(E137=0,0,IMPRIMIR!A136)","v":0},{"$f":"IF(E137=0,0,IMPRIMIR!$D$3)","v":0},0,{"$f":"IMPRIMIR!B136","v":0},{"$f":"IMPRIMIR!C136","v":0},{"$f":"IF(E137=0,0,IMPRIMIR!D136)","v":0},{"$f":"IF(E137=0,0,IMPRIMIR!E136)","v":0},0,0,0]
[null,{"$f":"IF(E138=0,0,IMPRIMIR!A137)","v":0},{"$f":"IF(E138=0,0,IMPRIMIR!$D$3)","v":0},0,{"$f":"IMPRIMIR!B137","v":0},{"$f":"IMPRIMIR!C137","v":0},{"$f":"IF(E138=0,0,IMPRIMIR!D137)","v":0},{"$f":"IF(E138=0,0,IMPRIMIR!E137)","v":0},0,0,0]
[null,{"$f":"IF(E139=0,0,IMPRIMIR!A138)","v":0},{"$f":"IF(E139=0,0,IMPRIMIR!$D$3)","v":0},0,{"$f":"IMPRIMIR!B138","v":0},{"$f":"IMPRIMIR!C138","v":0},{"$f":"IF(E139=0,0,IMPRIMIR!D138)","v":0},{"$f":"IF(E139=0,0,IMPRIMIR!E138)","v":0},0,0,0]
[null,{"$f":"IF(E140=0,0,IMPRIMIR!A139)","v":0},{"$f":"IF(E140=0,0,IMPRIMIR!$D$3)","v":0},0,{"$f":"IMPRIMIR!B139","v":0},{"$f":"IMPRIMIR!C139","v":0},{"$f":"IF(E140=0,0,IMPRIMIR!D139)","v":0},{"$f":"IF(E140=0,0,IMPRIMIR!E139)","v":0},0,0,0]
[null,{"$f":"IF(E141=0,0,IMPRIMIR!A140)","v":0},{"$f":"IF(E141=0,0,IMPRIMIR!$D$3)","v":0},0,{"$f":"IMPRIMIR!B140","v":0},{"$f":"IMPRIMIR!C140","v":0},{"$f":"IF(E141=0,0,IMPRIMIR!D140)","v":0},{"$f":"IF(E141=0,0,IMPRIMIR!E140)","v":0},0,0,0]
[null,{"$f":"IF(E142=0,0,IMPRIMIR!A141)","v":0},{"$f":"IF(E142=0,0,IMPRIMIR!$D$3)","v":0},0,{"$f":"IMPRIMIR!B141","v":0},{"$f":"IMPRIMIR!C141","v":0},{"$f":"IF(E142=0,0,IMPRIMIR!D141)","v":0},{"$f":"IF(E142=0,0,IMPRIMIR!E141)","v":0},0,0,0]
[null,{"$f":"IF(E143=0,0,IMPRIMIR!A142)","v":0},{"$f":"IF(E143=0,0,IMPRIMIR!$D$3)","v":0},0,{"$f":"IMPRIMIR!B142","v":0},{"$f":"IMPRIMIR!C142","v":0},{"$f":"IF(E143=0,0,IMPRIMIR!D142)","v":0},{"$f":"IF(E143=0,0,IMPRIMIR!E142)","v":0},0,0,0]
[null,{"$f":"IF(E144=0,0,IMPRIMIR!A143)","v":0},{"$f":"IF(E144=0,0,IMPRIMIR!$D$3)","v":0},0,{"$f":"IMPRIMIR!B143","v":0},{"$f":"IMPRIMIR!C143","v":0},{"$f":"IF(E144=0,0,IMPRIMIR!D143)","v":0},{"$f":"IF(E144=0,0,IMPRIMIR!E143)","v":0},0,0,0]
[null,{"$f":"IF(E145=0,0,IMPRIMIR!A144)","v":0},{"$f":"IF(E145=0,0,IMPRIMIR!$D$3)","v":0},0,{"$f":"IMPRIMIR!B144","v":0},{"$f":"IMPRIMIR!C144","v":0},{"$f":"IF(E145=0,0,IMPRIMIR!D144)","v":0},{"$f":"IF(E145=0,0,IMPRIMIR!E144)","v":0},0,0,0]
[null,{"$f":"IF(E146=0,0,IMPRIMIR!A145)","v":0},{"$f":"IF(E146=0,0,IMPRIMIR!$D$3)","v":0},0,{"$f":"IMPRIMIR!B145","v":0},{"$f":"IMPRIMIR!C145","v":0},{"$f":"IF(E146=0,0,IMPRIMIR!D145)","v":0},{"$f":"IF(E146=0,0,IMPRIMIR!E145)","v":0},0,0,0]
[null,{"$f":"IF(E147=0,0,IMPRIMIR!A146)","v":0},{"$f":"IF(E147=0,0,IMPRIMIR!$D$3)","v":0},0,{"$f":"IMPRIMIR!B146","v":0},{"$f":"IMPRIMIR!C146","v":0},{"$f":"IF(E147=0,0,IMPRIMIR!D146)","v":0},{"$f":"IF(E147=0,0,IMPRIMIR!E146)","v":0},0,0,0]
[null,{"$f":"IF(E148=0,0,IMPRIMIR!A147)","v":0},{"$f":"IF(E148=0,0,IMPRIMIR!$D$3)","v":0},0,{"$f":"IMPRIMIR!B147","v":0},{"$f":"IMPRIMIR!C147","v":0},{"$f":"IF(E148=0,0,IMPRIMIR!D147)","v":0},{"$f":"IF(E148=0,0,IMPRIMIR!E147)","v":0},0,0,0]
[null,{"$f":"IF(E149=0,0,IMPRIMIR!A148)","v":0},{"$f":"IF(E149=0,0,IMPRIMIR!$D$3)","v":0},0,{"$f":"IMPRIMIR!B148","v":0},{"$f":"IMPRIMIR!C148","v":0},{"$f":"IF(E149=0,0,IMPRIMIR!D148)","v":0},{"$f":"IF(E149=0,0,IMPRIMIR!E148)","v":0},0,0,0]
[null,{"$f":"IF(E150=0,0,IMPRIMIR!A149)","v":0},{"$f":"IF(E150=0,0,IMPRIMIR!$D$3)","v":0},0,{"$f":"IMPRIMIR!B149","v":0},{"$f":"IMPRIMIR!C149","v":0},{"$f":"IF(E150=0,0,IMPRIMIR!D149)","v":0},{"$f":"IF(E150=0,0,IMPRIMIR!E149)","v":0},0,0,0]
[null,{"$f":"IF(E151=0,0,IMPRIMIR!A150)","v":0},{"$f":"IF(E151=0,0,IMPRIMIR!$D$3)","v":0},0,{"$f":"IMPRIMIR!B150","v":0},{"$f":"IMPRIMIR!C150","v":0},{"$f":"IF(E151=0,0,IMPRIMIR!D150)","v":0},{"$f":"IF(E151=0,0,IMPRIMIR!E150)","v":0},0,0,0]
[null,{"$f":"IF(E152=0,0,IMPRIMIR!A151)","v":0},{"$f":"IF(E152=0,0,IMPRIMIR!$D$3)","v":0},0,{"$f":"IMPRIMIR!B151","v":0},{"$f":"IMPRIMIR!C151","v":0},{"$f":"IF(E152=0,0,IMPRIMIR!D151)","v":0},{"$f":"IF(E152=0,0,IMPRIMIR!E151)","v":0},0,0,0]
[null,{"$f":"IF(E153=0,0,IMPRIMIR!A152)","v":0},{"$f":"IF(E153=0,0,IMPRIMIR!$D$3)","v":0},0,{"$f":"IMPRIMIR!B152","v":0},{"$f":"IMPRIMIR!C152","v":0},{"$f":"IF(E153=0,0,IMPRIMIR!D152)","v":0},{"$f":"IF(E153=0,0,IMPRIMIR!E152)","v":0},0,0,0]
[null,{"$f":"IF(E154=0,0,IMPRIMIR!A153)","v":0},{"$f":"IF(E154=0,0,IMPRIMIR!$D$3)","v":0},0,{"$f":"IMPRIMIR!B153","v":0},{"$f":"IMPRIMIR!C153","v":0},{"$f":"IF(E154=0,0,IMPRIMIR!D153)","v":0},{"$f":"IF(E154=0,0,IMPRIMIR!E153)","v":0},0,0,0]
[null,{"$f":"IF(E155=0,0,IMPRIMIR!A154)","v":0},{"$f":"IF(E155=0,0,IMPRIMIR!$D$3)","v":0},0,{"$f":"IMPRIMIR!B154","v":0},{"$f":"IMPRIMIR!C154","v":0},{"$f":"IF(E155=0,0,IMPRIMIR!D154)","v":0},{"$f":"IF(E155=0,0,IMPRIMIR!E154)","v":0},0,0,0]
[null,{"$f":"IF(E156=0,0,IMPRIMIR!A155)","v":0},{"$f":"IF(E156=0,0,IMPRIMIR!$D$3)","v":0},0,{"$f":"IMPRIMIR!B155","v":0},{"$f":"IMPRIMIR!C155","v":0},{"$f":"IF(E156=0,0,IMPRIMIR!D155)","v":0},{"$f":"IF(E156=0,0,IMPRIMIR!E155)","v":0},0,0,0]
[null,{"$f":"IF(E157=0,0,IMPRIMIR!A156)","v":0},{"$f":"IF(E157=0,0,IMPRIMIR!$D$3)","v":0},0,{"$f":"IMPRIMIR!B156","v":0},{"$f":"IMPRIMIR!C156","v":0},{"$f":"IF(E157=0,0,IMPRIMIR!D156)","v":0},{"$f":"IF(E157=0,0,IMPRIMIR!E156)","v":0},0,0,0]
[null,{"$f":"IF(E158=0,0,IMPRIMIR!A157)","v":0},{"$f":"IF(E158=0,0,IMPRIMIR!$D$3)","v":0},0,{"$f":"IMPRIMIR!B157","v":0},{"$f":"IMPRIMIR!C157","v":0},{"$f":"IF(E158=0,0,IMPRIMIR!D157)","v":0},{"$f":"IF(E158=0,0,IMPRIMIR!E157)","v":0},0,0,0]
[null,{"$f":"IF(E159=0,0,IMPRIMIR!A158)","v":0},{"$f":"IF(E159=0,0,IMPRIMIR!$D$3)","v":0},0,{"$f":"IMPRIMIR!B158","v":0},{"$f":"IMPRIMIR!C158","v":0},{"$f":"IF(E159=0,0,IMPRIMIR!D158)","v":0},{"$f":"IF(E159=0,0,IMPRIMIR!E158)","v":0},0,0,0]
[null,{"$f":"IF(E160=0,0,IMPRIMIR!A159)","v":0},{"$f":"IF(E160=0,0,IMPRIMIR!$D$3)","v":0},0,{"$f":"IMPRIMIR!B159","v":0},{"$f":"IMPRIMIR!C159","v":0},{"$f":"IF(E160=0,0,IMPRIMIR!D159)","v":0},{"$f":"IF(E160=0,0,IMPRIMIR!E159)","v":0},0,0,0]
[null,{"$f":"IF(E161=0,0,IMPRIMIR!A160)","v":0},{"$f":"IF(E161=0,0,IMPRIMIR!$D$3)","v":0},0,{"$f":"IMPRIMIR!B160","v":0},{"$f":"IMPRIMIR!C160","v":0},{"$f":"IF(E161=0,0,IMPRIMIR!D160)","v":0},{"$f":"IF(E161=0,0,IMPRIMIR!E160)","v":0},0,0,0]
[null,{"$f":"IF(E162=0,0,IMPRIMIR!A161)","v":0},{"$f":"IF(E162=0,0,IMPRIMIR!$D$3)","v":0},0,{"$f":"IMPRIMIR!B161","v":0},{"$f":"IMPRIMIR!C161","v":0},{"$f":"IF(E162=0,0,IMPRIMIR!D161)","v":0},{"$f":"IF(E162=0,0,IMPRIMIR!E161)","v":0},0,0,0]
[null,{"$f":"IF(E163=0,0,IMPRIMIR!A162)","v":0},{"$f":"IF(E163=0,0,IMPRIMIR!$D$3)","v":0},0,{"$f":"IMPRIMIR!B162","v":0},{"$f":"IMPRIMIR!C162","v":0},{"$f":"IF(E163=0,0,IMPRIMIR!D162)","v":0},{"$f":"IF(E163=0,0,IMPRIMIR!E162)","v":0},0,0,0]
[null,{"$f":"IF(E164=0,0,IMPRIMIR!A163)","v":0},{"$f":"IF(E164=0,0,IMPRIMIR!$D$3)","v":0},0,{"$f":"IMPRIMIR!B163","v":0},{"$f":"IMPRIMIR!C163","v":0},{"$f":"IF(E164=0,0,IMPRIMIR!D163)","v":0},{"$f":"IF(E164=0,0,IMPRIMIR!E163)","v":0},0,0,0]
[null,{"$f":"IF(E165=0,0,IMPRIMIR!A164)","v":0},{"$f":"IF(E165=0,0,IMPRIMIR!$D$3)","v":0},0,{"$f":"IMPRIMIR!B164","v":0},{"$f":"IMPRIMIR!C164","v":0},{"$f":"IF(E165=0,0,IMPRIMIR!D164)","v":0},{"$f":"IF(E165=0,0,IMPRIMIR!E164)","v":0},0,0,0]
[null,{"$f":"IF(E166=0,0,IMPRIMIR!A165)","v":0},{"$f":"IF(E166=0,0,IMPRIMIR!$D$3)","v":0},0,{"$f":"IMPRIMIR!B165","v":0},{"$f":"IMPRIMIR!C165","v":0},{"$f":"IF(E166=0,0,IMPRIMIR!D165)","v":0},{"$f":"IF(E166=0,0,IMPRIMIR!E165)","v":0},0,0,0]
[null,{"$f":"IF(E167=0,0,IMPRIMIR!A166)","v":0},{"$f":"IF(E167=0,0,IMPRIMIR!$D$3)","v":0},0,{"$f":"IMPRIMIR!B166","v":0},{"$f":"IMPRIMIR!C166","v":0},{"$f":"IF(E167=0,0,IMPRIMIR!D166)","v":0},{"$f":"IF(E167=0,0,IMPRIMIR!E166)","v":0},0,0,0]
[null,{"$f":"IF(E168=0,0,IMPRIMIR!A167)","v":0},{"$f":"IF(E168=0,0,IMPRIMIR!$D$3)","v":0},0,{"$f":"IMPRIMIR!B167","v":0},{"$f":"IMPRIMIR!C167","v":0},{"$f":"IF(E168=0,0,IMPRIMIR!D167)","v":0},{"$f":"IF(E168=0,0,IMPRIMIR!E167)","v":0},0,0,0]
[null,{"$f":"IF(E169=0,0,IMPRIMIR!A168)","v":0},{"$f":"IF(E169=0,0,IMPRIMIR!$D$3)","v":0},0,{"$f":"IMPRIMIR!B168","v":0},{"$f":"IMPRIMIR!C168","v":0},{"$f":"IF(E169=0,0,IMPRIMIR!D168)","v":0},{"$f":"IF(E169=0,0,IMPRIMIR!E168)","v":0},0,0,0]
[null,{"$f":"IF(E170=0,0,IMPRIMIR!A169)","v":0},{"$f":"IF(E170=0,0,IMPRIMIR!$D$3)","v":0},0,{"$f":"IMPRIMIR!B169","v":0},{"$f":"IMPRIMIR!C169","v":0},{"$f":"IF(E170=0,0,IMPRIMIR!D169)","v":0},{"$f":"IF(E170=0,0,IMPRIMIR!E169)","v":0},0,0,0]
[null,{"$f":"IF(E171=0,0,IMPRIMIR!A170)","v":0},{"$f":"IF(E171=0,0,IMPRIMIR!$D$3)","v":0},0,{"$f":"IMPRIMIR!B170","v":0},{"$f":"IMPRIMIR!C170","v":0},{"$f":"IF(E171=0,0,IMPRIMIR!D170)","v":0},{"$f":"IF(E171=0,0,IMPRIMIR!E170)","v":0},0,0,0]
[null,{"$f":"IF(E172=0,0,IMPRIMIR!A171)","v":0},{"$f":"IF(E172=0,0,IMPRIMIR!$D$3)","v":0},0,{"$f":"IMPRIMIR!B171","v":0},{"$f":"IMPRIMIR!C171","v":0},{"$f":"IF(E172=0,0,IMPRIMIR!D171)","v":0},{"$f":"IF(E172=0,0,IMPRIMIR!E171)","v":0},0,0,0]
[null,{"$f":"IF(E173=0,0,IMPRIMIR!A172)","v":0},{"$f":"IF(E173=0,0,IMPRIMIR!$D$3)","v":0},0,{"$f":"IMPRIMIR!B172","v":0},{"$f":"IMPRIMIR!C172","v":0},{"$f":"IF(E173=0,0,IMPRIMIR!D172)","v":0},{"$f":"IF(E173=0,0,IMPRIMIR!E172)","v":0},0,0,0]
[null,{"$f":"IF(E174=0,0,IMPRIMIR!A173)","v":0},{"$f":"IF(E174=0,0,IMPRIMIR!$D$3)","v":0},0,{"$f":"IMPRIMIR!B173","v":0},{"$f":"IMPRIMIR!C173","v":0},{"$f":"IF(E174=0,0,IMPRIMIR!D173)","v":0},{"$f":"IF(E174=0,0,IMPRIMIR!E173)","v":0},0,0,0]
[null,{"$f":"IF(E175=0,0,IMPRIMIR!A174)","v":0},{"$f":"IF(E175=0,0,IMPRIMIR!$D$3)","v":0},0,{"$f":"IMPRIMIR!B174","v":0},{"$f":"IMPRIMIR!C174","v":0},{"$f":"IF(E175=0,0,IMPRIMIR!D174)","v":0},{"$f":"IF(E175=0,0,IMPRIMIR!E174)","v":0},0,0,0]
[null,{"$f":"IF(E176=0,0,IMPRIMIR!A175)","v":0},{"$f":"IF(E176=0,0,IMPRIMIR!$D$3)","v":0},{"$f":"IF(E176=\"0\",0,$G$2)","v":0},{"$f":"IMPRIMIR!B175","v":0},{"$f":"IMPRIMIR!C175","v":0},{"$f":"IF(E176=0,0,IMPRIMIR!D175)","v":0},{"$f":"IF(E176=0,0,IMPRIMIR!E175)","v":0},{"$f":"IF(E176=0,0,$G$2)","v":0},{"$f":"IF(E176=0,0,$G$4)","v":0},{"$f":"IF(E176=0,0,$G$3)","v":0}]
[null,{"$f":"IF(E177=0,0,IMPRIMIR!A176)","v":0},{"$f":"IF(E177=0,0,IMPRIMIR!$D$3)","v":0},0,{"$f":"IMPRIMIR!B176","v":0},{"$f":"IMPRIMIR!C176","v":0},{"$f":"IF(E177=0,0,IMPRIMIR!D176)","v":0},{"$f":"IF(E177=0,0,IMPRIMIR!E176)","v":0},0,0,0]
[null,{"$f":"IF(E178=0,0,IMPRIMIR!A177)","v":0},{"$f":"IF(E178=0,0,IMPRIMIR!$D$3)","v":0},0,{"$f":"IMPRIMIR!B177","v":0},{"$f":"IMPRIMIR!C177","v":0},{"$f":"IF(E178=0,0,IMPRIMIR!D177)","v":0},{"$f":"IF(E178=0,0,IMPRIMIR!E177)","v":0},0,0,0]
[null,{"$f":"IF(E179=0,0,IMPRIMIR!A178)","v":0},{"$f":"IF(E179=0,0,IMPRIMIR!$D$3)","v":0},0,{"$f":"IMPRIMIR!B178","v":0},{"$f":"IMPRIMIR!C178","v":0},{"$f":"IF(E179=0,0,IMPRIMIR!D178)","v":0},{"$f":"IF(E179=0,0,IMPRIMIR!E178)","v":0},0,0,0]
[null,{"$f":"IF(E180=0,0,IMPRIMIR!A179)","v":0},{"$f":"IF(E180=0,0,IMPRIMIR!$D$3)","v":0},0,{"$f":"IMPRIMIR!B179","v":0},{"$f":"IMPRIMIR!C179","v":0},{"$f":"IF(E180=0,0,IMPRIMIR!D179)","v":0},{"$f":"IF(E180=0,0,IMPRIMIR!E179)","v":0},0,0,0]
[null,{"$f":"IF(E181=0,0,IMPRIMIR!A180)","v":0},{"$f":"IF(E181=0,0,IMPRIMIR!$D$3)","v":0},0,{"$f":"IMPRIMIR!B180","v":0},{"$f":"IMPRIMIR!C180","v":0},{"$f":"IF(E181=0,0,IMPRIMIR!D180)","v":0},{"$f":"IF(E181=0,0,IMPRIMIR!E180)","v":0},0,0,0]
[null,{"$f":"IF(E182=0,0,IMPRIMIR!A181)","v":0},{"$f":"IF(E182=0,0,IMPRIMIR!$D$3)","v":0},0,{"$f":"IMPRIMIR!B181","v":0},{"$f":"IMPRIMIR!C181","v":0},{"$f":"IF(E182=0,0,IMPRIMIR!D181)","v":0},{"$f":"IF(E182=0,0,IMPRIMIR!E181)","v":0},0,0,0]
[null,{"$f":"IF(E183=0,0,IMPRIMIR!A182)","v":0},{"$f":"IF(E183=0,0,IMPRIMIR!$D$3)","v":0},0,{"$f":"IMPRIMIR!B182","v":0},{"$f":"IMPRIMIR!C182","v":0},{"$f":"IF(E183=0,0,IMPRIMIR!D182)","v":0},{"$f":"IF(E183=0,0,IMPRIMIR!E182)","v":0},0,0,0]
[null,{"$f":"IF(E184=0,0,IMPRIMIR!A183)","v":0},{"$f":"IF(E184=0,0,IMPRIMIR!$D$3)","v":0},0,{"$f":"IMPRIMIR!B183","v":0},{"$f":"IMPRIMIR!C183","v":0},{"$f":"IF(E184=0,0,IMPRIMIR!D183)","v":0},{"$f":"IF(E184=0,0,IMPRIMIR!E183)","v":0},0,0,0]
[null,{"$f":"IF(E185=0,0,IMPRIMIR!A184)","v":0},{"$f":"IF(E185=0,0,IMPRIMIR!$D$3)","v":0},0,{"$f":"IMPRIMIR!B184","v":0},{"$f":"IMPRIMIR!C184","v":0},{"$f":"IF(E185=0,0,IMPRIMIR!D184)","v":0},{"$f":"IF(E185=0,0,IMPRIMIR!E184)","v":0},0,0,0]
[null,{"$f":"IF(E186=0,0,IMPRIMIR!A185)","v":0},{"$f":"IF(E186=0,0,IMPRIMIR!$D$3)","v":0},0,{"$f":"IMPRIMIR!B185","v":0},{"$f":"IMPRIMIR!C185","v":0},{"$f":"IF(E186=0,0,IMPRIMIR!D185)","v":0},{"$f":"IF(E186=0,0,IMPRIMIR!E185)","v":0},0,0,0]
[null,{"$f":"IF(E187=0,0,IMPRIMIR!A186)","v":0},{"$f":"IF(E187=0,0,IMPRIMIR!$D$3)","v":0},0,{"$f":"IMPRIMIR!B186","v":0},{"$f":"IMPRIMIR!C186","v":0},{"$f":"IF(E187=0,0,IMPRIMIR!D186)","v":0},{"$f":"IF(E187=0,0,IMPRIMIR!E186)","v":0},0,0,0]
[null,{"$f":"IF(E188=0,0,IMPRIMIR!A187)","v":0},{"$f":"IF(E188=0,0,IMPRIMIR!$D$3)","v":0},0,{"$f":"IMPRIMIR!B187","v":0},{"$f":"IMPRIMIR!C187","v":0},{"$f":"IF(E188=0,0,IMPRIMIR!D187)","v":0},{"$f":"IF(E188=0,0,IMPRIMIR!E187)","v":0},0,0,0]
[null,{"$f":"IF(E189=0,0,IMPRIMIR!A188)","v":0},{"$f":"IF(E189=0,0,IMPRIMIR!$D$3)","v":0},0,{"$f":"IMPRIMIR!B188","v":0},{"$f":"IMPRIMIR!C188","v":0},{"$f":"IF(E189=0,0,IMPRIMIR!D188)","v":0},{"$f":"IF(E189=0,0,IMPRIMIR!E188)","v":0},0,0,0]
[null,{"$f":"IF(E190=0,0,IMPRIMIR!A189)","v":0},{"$f":"IF(E190=0,0,IMPRIMIR!$D$3)","v":0},0,{"$f":"IMPRIMIR!B189","v":0},{"$f":"IMPRIMIR!C189","v":0},{"$f":"IF(E190=0,0,IMPRIMIR!D189)","v":0},{"$f":"IF(E190=0,0,IMPRIMIR!E189)","v":0},0,0,0]
[null,{"$f":"IF(E191=0,0,IMPRIMIR!A190)","v":0},{"$f":"IF(E191=0,0,IMPRIMIR!$D$3)","v":0},0,{"$f":"IMPRIMIR!B190","v":0},{"$f":"IMPRIMIR!C190","v":0},{"$f":"IF(E191=0,0,IMPRIMIR!D190)","v":0},{"$f":"IF(E191=0,0,IMPRIMIR!E190)","v":0},0,0,0]
[null,{"$f":"IF(E192=0,0,IMPRIMIR!A191)","v":0},{"$f":"IF(E192=0,0,IMPRIMIR!$D$3)","v":0},0,{"$f":"IMPRIMIR!B191","v":0},{"$f":"IMPRIMIR!C191","v":0},{"$f":"IF(E192=0,0,IMPRIMIR!D191)","v":0},{"$f":"IF(E192=0,0,IMPRIMIR!E191)","v":0},0,0,0]
[null,{"$f":"IF(E193=0,0,IMPRIMIR!A192)","v":0},{"$f":"IF(E193=0,0,IMPRIMIR!$D$3)","v":0},0,{"$f":"IMPRIMIR!B192","v":0},{"$f":"IMPRIMIR!C192","v":0},{"$f":"IF(E193=0,0,IMPRIMIR!D192)","v":0},{"$f":"IF(E193=0,0,IMPRIMIR!E192)","v":0},0,0,0]
[null,{"$f":"IF(E194=0,0,IMPRIMIR!A193)","v":0},{"$f":"IF(E194=0,0,IMPRIMIR!$D$3)","v":0},0,{"$f":"IMPRIMIR!B193","v":0},{"$f":"IMPRIMIR!C193","v":0},{"$f":"IF(E194=0,0,IMPRIMIR!D193)","v":0},{"$f":"IF(E194=0,0,IMPRIMIR!E193)","v":0},0,0,0]
[null,{"$f":"IF(E195=0,0,IMPRIMIR!A194)","v":0},{"$f":"IF(E195=0,0,IMPRIMIR!$D$3)","v":0},0,{"$f":"IMPRIMIR!B194","v":0},{"$f":"IMPRIMIR!C194","v":0},{"$f":"IF(E195=0,0,IMPRIMIR!D194)","v":0},{"$f":"IF(E195=0,0,IMPRIMIR!E194)","v":0},0,0,0]
[null,{"$f":"IF(E196=0,0,IMPRIMIR!A195)","v":0},{"$f":"IF(E196=0,0,IMPRIMIR!$D$3)","v":0},0,{"$f":"IMPRIMIR!B195","v":0},{"$f":"IMPRIMIR!C195","v":0},{"$f":"IF(E196=0,0,IMPRIMIR!D195)","v":0},{"$f":"IF(E196=0,0,IMPRIMIR!E195)","v":0},0,0,0]
[null,{"$f":"IF(E197=0,0,IMPRIMIR!A196)","v":0},{"$f":"IF(E197=0,0,IMPRIMIR!$D$3)","v":0},0,{"$f":"IMPRIMIR!B196","v":0},{"$f":"IMPRIMIR!C196","v":0},{"$f":"IF(E197=0,0,IMPRIMIR!D196)","v":0},{"$f":"IF(E197=0,0,IMPRIMIR!E196)","v":0},0,0,0]
[null,{"$f":"IF(E198=0,0,IMPRIMIR!A197)","v":0},{"$f":"IF(E198=0,0,IMPRIMIR!$D$3)","v":0},0,{"$f":"IMPRIMIR!B197","v":0},{"$f":"IMPRIMIR!C197","v":0},{"$f":"IF(E198=0,0,IMPRIMIR!D197)","v":0},{"$f":"IF(E198=0,0,IMPRIMIR!E197)","v":0},0,0,0]
[null,{"$f":"IF(E199=0,0,IMPRIMIR!A198)","v":0},{"$f":"IF(E199=0,0,IMPRIMIR!$D$3)","v":0},0,{"$f":"IMPRIMIR!B198","v":0},{"$f":"IMPRIMIR!C198","v":0},{"$f":"IF(E199=0,0,IMPRIMIR!D198)","v":0},{"$f":"IF(E199=0,0,IMPRIMIR!E198)","v":0},0,0,0]
[null,{"$f":"IF(E200=0,0,IMPRIMIR!A199)","v":0},{"$f":"IF(E200=0,0,IMPRIMIR!$D$3)","v":0},0,{"$f":"IMPRIMIR!B199","v":0},{"$f":"IMPRIMIR!C199","v":0},{"$f":"IF(E200=0,0,IMPRIMIR!D199)","v":0},{"$f":"IF(E200=0,0,IMPRIMIR!E199)","v":0},0,0,0]
[null,{"$f":"IF(E201=0,0,IMPRIMIR!A200)","v":0},{"$f":"IF(E201=0,0,IMPRIMIR!$D$3)","v":0},0,{"$f":"IMPRIMIR!B200","v":0},{"$f":"IMPRIMIR!C200","v":0},{"$f":"IF(E201=0,0,IMPRIMIR!D200)","v":0},{"$f":"IF(E201=0,0,IMPRIMIR!E200)","v":0},0,0,0]
[null,{"$f":"IF(E202=0,0,IMPRIMIR!A201)","v":0},{"$f":"IF(E202=0,0,IMPRIMIR!$D$3)","v":0},0,{"$f":"IMPRIMIR!B201","v":0},{"$f":"IMPRIMIR!C201","v":0},{"$f":"IF(E202=0,0,IMPRIMIR!D201)","v":0},{"$f":"IF(E202=0,0,IMPRIMIR!E201)","v":0},0,0,0]
[null,{"$f":"IF(E203=0,0,IMPRIMIR!A202)","v":0},{"$f":"IF(E203=0,0,IMPRIMIR!$D$3)","v":0},0,{"$f":"IMPRIMIR!B202","v":0},{"$f":"IMPRIMIR!C202","v":0},{"$f":"IF(E203=0,0,IMPRIMIR!D202)","v":0},{"$f":"IF(E203=0,0,IMPRIMIR!E202)","v":0},0,0,0]
[null,{"$f":"IF(E204=0,0,IMPRIMIR!A203)","v":0},{"$f":"IF(E204=0,0,IMPRIMIR!$D$3)","v":0},{"$f":"IF(E204=\"0\",0,$G$2)","v":0},{"$f":"IMPRIMIR!B203","v":0},{"$f":"IMPRIMIR!C203","v":0},{"$f":"IF(E204=0,0,IMPRIMIR!D203)","v":0},{"$f":"IF(E204=0,0,IMPRIMIR!E203)","v":0},{"$f":"IF(E204=0,0,$G$2)","v":0},{"$f":"IF(E204=0,0,$G$4)","v":0},{"$f":"IF(E204=0,0,$G$3)","v":0}]
[null,{"$f":"IF(E205=0,0,IMPRIMIR!A204)","v":0},{"$f":"IF(E205=0,0,IMPRIMIR!$D$3)","v":0},0,{"$f":"IMPRIMIR!B204","v":0},{"$f":"IMPRIMIR!C204","v":0},{"$f":"IF(E205=0,0,IMPRIMIR!D204)","v":0},{"$f":"IF(E205=0,0,IMPRIMIR!E204)","v":0},0,0,0]
[null,{"$f":"IF(E206=0,0,IMPRIMIR!A205)","v":0},{"$f":"IF(E206=0,0,IMPRIMIR!$D$3)","v":0},0,{"$f":"IMPRIMIR!B205","v":0},{"$f":"IMPRIMIR!C205","v":0},{"$f":"IF(E206=0,0,IMPRIMIR!D205)","v":0},{"$f":"IF(E206=0,0,IMPRIMIR!E205)","v":0},0,0,0]
[null,{"$f":"IF(E207=0,0,IMPRIMIR!A206)","v":0},{"$f":"IF(E207=0,0,IMPRIMIR!$D$3)","v":0},0,{"$f":"IMPRIMIR!B206","v":0},{"$f":"IMPRIMIR!C206","v":0},{"$f":"IF(E207=0,0,IMPRIMIR!D206)","v":0},{"$f":"IF(E207=0,0,IMPRIMIR!E206)","v":0},0,0,0]
[null,{"$f":"IF(E208=0,0,IMPRIMIR!A207)","v":0},{"$f":"IF(E208=0,0,IMPRIMIR!$D$3)","v":0},0,{"$f":"IMPRIMIR!B207","v":0},{"$f":"IMPRIMIR!C207","v":0},{"$f":"IF(E208=0,0,IMPRIMIR!D207)","v":0},{"$f":"IF(E208=0,0,IMPRIMIR!E207)","v":0},0,0,0]
[null,{"$f":"IF(E209=0,0,IMPRIMIR!A208)","v":0},{"$f":"IF(E209=0,0,IMPRIMIR!$D$3)","v":0},0,{"$f":"IMPRIMIR!B208","v":0},{"$f":"IMPRIMIR!C208","v":0},{"$f":"IF(E209=0,0,IMPRIMIR!D208)","v":0},{"$f":"IF(E209=0,0,IMPRIMIR!E208)","v":0},0,0,0]
[null,{"$f":"IF(E210=0,0,IMPRIMIR!A209)","v":0},{"$f":"IF(E210=0,0,IMPRIMIR!$D$3)","v":0},0,{"$f":"IMPRIMIR!B209","v":0},{"$f":"IMPRIMIR!C209","v":0},{"$f":"IF(E210=0,0,IMPRIMIR!D209)","v":0},{"$f":"IF(E210=0,0,IMPRIMIR!E209)","v":0},0,0,0]
[null,{"$f":"IF(E211=0,0,IMPRIMIR!A210)","v":0},{"$f":"IF(E211=0,0,IMPRIMIR!$D$3)","v":0},0,{"$f":"IMPRIMIR!B210","v":0},{"$f":"IMPRIMIR!C210","v":0},{"$f":"IF(E211=0,0,IMPRIMIR!D210)","v":0},{"$f":"IF(E211=0,0,IMPRIMIR!E210)","v":0},0,0,0]
[null,{"$f":"IF(E212=0,0,IMPRIMIR!A211)","v":0},{"$f":"IF(E212=0,0,IMPRIMIR!$D$3)","v":0},0,{"$f":"IMPRIMIR!B211","v":0},{"$f":"IMPRIMIR!C211","v":0},{"$f":"IF(E212=0,0,IMPRIMIR!D211)","v":0},{"$f":"IF(E212=0,0,IMPRIMIR!E211)","v":0},0,0,0]
[null,{"$f":"IF(E213=0,0,IMPRIMIR!A212)","v":0},{"$f":"IF(E213=0,0,IMPRIMIR!$D$3)","v":0},0,{"$f":"IMPRIMIR!B212","v":0},{"$f":"IMPRIMIR!C212","v":0},{"$f":"IF(E213=0,0,IMPRIMIR!D212)","v":0},{"$f":"IF(E213=0,0,IMPRIMIR!E212)","v":0},0,0,0]
[null,{"$f":"IF(E214=0,0,IMPRIMIR!A213)","v":0},{"$f":"IF(E214=0,0,IMPRIMIR!$D$3)","v":0},0,{"$f":"IMPRIMIR!B213","v":0},{"$f":"IMPRIMIR!C213","v":0},{"$f":"IF(E214=0,0,IMPRIMIR!D213)","v":0},{"$f":"IF(E214=0,0,IMPRIMIR!E213)","v":0},0,0,0]
[null,{"$f":"IF(E215=0,0,IMPRIMIR!A214)","v":0},{"$f":"IF(E215=0,0,IMPRIMIR!$D$3)","v":0},0,{"$f":"IMPRIMIR!B214","v":0},{"$f":"IMPRIMIR!C214","v":0},{"$f":"IF(E215=0,0,IMPRIMIR!D214)","v":0},{"$f":"IF(E215=0,0,IMPRIMIR!E214)","v":0},0,0,0]
[null,{"$f":"IF(E216=0,0,IMPRIMIR!A215)","v":0},{"$f":"IF(E216=0,0,IMPRIMIR!$D$3)","v":0},0,{"$f":"IMPRIMIR!B215","v":0},{"$f":"IMPRIMIR!C215","v":0},{"$f":"IF(E216=0,0,IMPRIMIR!D215)","v":0},{"$f":"IF(E216=0,0,IMPRIMIR!E215)","v":0},0,0,0]
[null,{"$f":"IF(E217=0,0,IMPRIMIR!A216)","v":0},{"$f":"IF(E217=0,0,IMPRIMIR!$D$3)","v":0},0,{"$f":"IMPRIMIR!B216","v":0},{"$f":"IMPRIMIR!C216","v":0},{"$f":"IF(E217=0,0,IMPRIMIR!D216)","v":0},{"$f":"IF(E217=0,0,IMPRIMIR!E216)","v":0},0,0,0]
[null,{"$f":"IF(E218=0,0,IMPRIMIR!A217)","v":0},{"$f":"IF(E218=0,0,IMPRIMIR!$D$3)","v":0},0,{"$f":"IMPRIMIR!B217","v":0},{"$f":"IMPRIMIR!C217","v":0},{"$f":"IF(E218=0,0,IMPRIMIR!D217)","v":0},{"$f":"IF(E218=0,0,IMPRIMIR!E217)","v":0},0,0,0]
[null,{"$f":"IF(E219=0,0,IMPRIMIR!A218)","v":0},{"$f":"IF(E219=0,0,IMPRIMIR!$D$3)","v":0},0,{"$f":"IMPRIMIR!B218","v":0},{"$f":"IMPRIMIR!C218","v":0},{"$f":"IF(E219=0,0,IMPRIMIR!D218)","v":0},{"$f":"IF(E219=0,0,IMPRIMIR!E218)","v":0},0,0,0]
[null,{"$f":"IF(E220=0,0,IMPRIMIR!A219)","v":0},{"$f":"IF(E220=0,0,IMPRIMIR!$D$3)","v":0},0,{"$f":"IMPRIMIR!B219","v":0},{"$f":"IMPRIMIR!C219","v":0},{"$f":"IF(E220=0,0,IMPRIMIR!D219)","v":0},{"$f":"IF(E220=0,0,IMPRIMIR!E219)","v":0},0,0,0]
[null,{"$f":"IF(E221=0,0,IMPRIMIR!A220)","v":0},{"$f":"IF(E221=0,0,IMPRIMIR!$D$3)","v":0},0,{"$f":"IMPRIMIR!B220","v":0},{"$f":"IMPRIMIR!C220","v":0},{"$f":"IF(E221=0,0,IMPRIMIR!D220)","v":0},{"$f":"IF(E221=0,0,IMPRIMIR!E220)","v":0},0,0,0]
[null,{"$f":"IF(E222=0,0,IMPRIMIR!A221)","v":0},{"$f":"IF(E222=0,0,IMPRIMIR!$D$3)","v":0},0,{"$f":"IMPRIMIR!B221","v":0},{"$f":"IMPRIMIR!C221","v":0},{"$f":"IF(E222=0,0,IMPRIMIR!D221)","v":0},{"$f":"IF(E222=0,0,IMPRIMIR!E221)","v":0},0,0,0]
[null,{"$f":"IF(E223=0,0,IMPRIMIR!A222)","v":0},{"$f":"IF(E223=0,0,IMPRIMIR!$D$3)","v":0},0,{"$f":"IMPRIMIR!B222","v":0},{"$f":"IMPRIMIR!C222","v":0},{"$f":"IF(E223=0,0,IMPRIMIR!D222)","v":0},{"$f":"IF(E223=0,0,IMPRIMIR!E222)","v":0},0,0,0]
[null,{"$f":"IF(E224=0,0,IMPRIMIR!A223)","v":0},{"$f":"IF(E224=0,0,IMPRIMIR!$D$3)","v":0},0,{"$f":"IMPRIMIR!B223","v":0},{"$f":"IMPRIMIR!C223","v":0},{"$f":"IF(E224=0,0,IMPRIMIR!D223)","v":0},{"$f":"IF(E224=0,0,IMPRIMIR!E223)","v":0},0,0,0]
[null,{"$f":"IF(E225=0,0,IMPRIMIR!A224)","v":0},{"$f":"IF(E225=0,0,IMPRIMIR!$D$3)","v":0},0,{"$f":"IMPRIMIR!B224","v":0},{"$f":"IMPRIMIR!C224","v":0},{"$f":"IF(E225=0,0,IMPRIMIR!D224)","v":0},{"$f":"IF(E225=0,0,IMPRIMIR!E224)","v":0},0,0,0]
[null,{"$f":"IF(E226=0,0,IMPRIMIR!A225)","v":0},{"$f":"IF(E226=0,0,IMPRIMIR!$D$3)","v":0},0,{"$f":"IMPRIMIR!B225","v":0},{"$f":"IMPRIMIR!C225","v":0},{"$f":"IF(E226=0,0,IMPRIMIR!D225)","v":0},{"$f":"IF(E226=0,0,IMPRIMIR!E225)","v":0},0,0,0]
[null,{"$f":"IF(E227=0,0,IMPRIMIR!A226)","v":0},{"$f":"IF(E227=0,0,IMPRIMIR!$D$3)","v":0},0,{"$f":"IMPRIMIR!B226","v":0},{"$f":"IMPRIMIR!C226","v":0},{"$f":"IF(E227=0,0,IMPRIMIR!D226)","v":0},{"$f":"IF(E227=0,0,IMPRIMIR!E226)","v":0},0,0,0]
[null,{"$f":"IF(E228=0,0,IMPRIMIR!A227)","v":0},{"$f":"IF(E228=0,0,IMPRIMIR!$D$3)","v":0},0,{"$f":"IMPRIMIR!B227","v":0},{"$f":"IMPRIMIR!C227","v":0},{"$f":"IF(E228=0,0,IMPRIMIR!D227)","v":0},{"$f":"IF(E228=0,0,IMPRIMIR!E227)","v":0},0,0,0]
[null,{"$f":"IF(E229=0,0,IMPRIMIR!A228)","v":0},{"$f":"IF(E229=0,0,IMPRIMIR!$D$3)","v":0},0,{"$f":"IMPRIMIR!B228","v":0},{"$f":"IMPRIMIR!C228","v":0},{"$f":"IF(E229=0,0,IMPRIMIR!D228)","v":0},{"$f":"IF(E229=0,0,IMPRIMIR!E228)","v":0},0,0,0]
[null,{"$f":"IF(E230=0,0,IMPRIMIR!A229)","v":0},{"$f":"IF(E230=0,0,IMPRIMIR!$D$3)","v":0},0,{"$f":"IMPRIMIR!B229","v":0},{"$f":"IMPRIMIR!C229","v":0},{"$f":"IF(E230=0,0,IMPRIMIR!D229)","v":0},{"$f":"IF(E230=0,0,IMPRIMIR!E229)","v":0},0,0,0]
[null,{"$f":"IF(E231=0,0,IMPRIMIR!A230)","v":0},{"$f":"IF(E231=0,0,IMPRIMIR!$D$3)","v":0},0,{"$f":"IMPRIMIR!B230","v":0},{"$f":"IMPRIMIR!C230","v":0},{"$f":"IF(E231=0,0,IMPRIMIR!D230)","v":0},{"$f":"IF(E231=0,0,IMPRIMIR!E230)","v":0},0,0,0]
[null,{"$f":"IF(E232=0,0,IMPRIMIR!A231)","v":0},{"$f":"IF(E232=0,0,IMPRIMIR!$D$3)","v":0},0,{"$f":"IMPRIMIR!B231","v":0},{"$f":"IMPRIMIR!C231","v":0},{"$f":"IF(E232=0,0,IMPRIMIR!D231)","v":0},{"$f":"IF(E232=0,0,IMPRIMIR!E231)","v":0},0,0,0]
[null,{"$f":"IF(E233=0,0,IMPRIMIR!A232)","v":0},{"$f":"IF(E233=0,0,IMPRIMIR!$D$3)","v":0},0,{"$f":"IMPRIMIR!B232","v":0},{"$f":"IMPRIMIR!C232","v":0},{"$f":"IF(E233=0,0,IMPRIMIR!D232)","v":0},{"$f":"IF(E233=0,0,IMPRIMIR!E232)","v":0},0,0,0]
[null,{"$f":"IF(E234=0,0,IMPRIMIR!A233)","v":0},{"$f":"IF(E234=0,0,IMPRIMIR!$D$3)","v":0},0,{"$f":"IMPRIMIR!B233","v":0},{"$f":"IMPRIMIR!C233","v":0},{"$f":"IF(E234=0,0,IMPRIMIR!D233)","v":0},{"$f":"IF(E234=0,0,IMPRIMIR!E233)","v":0},0,0,0]
[null,{"$f":"IF(E235=0,0,IMPRIMIR!A234)","v":0},{"$f":"IF(E235=0,0,IMPRIMIR!$D$3)","v":0},{"$f":"IF(E235=\"0\",0,$G$2)","v":0},{"$f":"IMPRIMIR!B234","v":0},{"$f":"IMPRIMIR!C234","v":0},{"$f":"IF(E235=0,0,IMPRIMIR!D234)","v":0},{"$f":"IF(E235=0,0,IMPRIMIR!E234)","v":0},{"$f":"IF(E235=0,0,$G$2)","v":0},{"$f":"IF(E235=0,0,$G$4)","v":0},{"$f":"IF(E235=0,0,$G$3)","v":0}]
[null,{"$f":"IF(E236=0,0,IMPRIMIR!A235)","v":0},{"$f":"IF(E236=0,0,IMPRIMIR!$D$3)","v":0},0,{"$f":"IMPRIMIR!B235","v":0},{"$f":"IMPRIMIR!C235","v":0},{"$f":"IF(E236=0,0,IMPRIMIR!D235)","v":0},{"$f":"IF(E236=0,0,IMPRIMIR!E235)","v":0},0,0,0]
[null,{"$f":"IF(E237=0,0,IMPRIMIR!A236)","v":0},{"$f":"IF(E237=0,0,IMPRIMIR!$D$3)","v":0},0,{"$f":"IMPRIMIR!B236","v":0},{"$f":"IMPRIMIR!C236","v":0},{"$f":"IF(E237=0,0,IMPRIMIR!D236)","v":0},{"$f":"IF(E237=0,0,IMPRIMIR!E236)","v":0},0,0,0]
[null,{"$f":"IF(E238=0,0,IMPRIMIR!A237)","v":0},{"$f":"IF(E238=0,0,IMPRIMIR!$D$3)","v":0},0,{"$f":"IMPRIMIR!B237","v":0},{"$f":"IMPRIMIR!C237","v":0},{"$f":"IF(E238=0,0,IMPRIMIR!D237)","v":0},{"$f":"IF(E238=0,0,IMPRIMIR!E237)","v":0},0,0,0]
[null,{"$f":"IF(E239=0,0,IMPRIMIR!A238)","v":0},{"$f":"IF(E239=0,0,IMPRIMIR!$D$3)","v":0},0,{"$f":"IMPRIMIR!B238","v":0},{"$f":"IMPRIMIR!C238","v":0},{"$f":"IF(E239=0,0,IMPRIMIR!D238)","v":0},{"$f":"IF(E239=0,0,IMPRIMIR!E238)","v":0},0,0,0]
[null,{"$f":"IF(E240=0,0,IMPRIMIR!A239)","v":0},{"$f":"IF(E240=0,0,IMPRIMIR!$D$3)","v":0},0,{"$f":"IMPRIMIR!B239","v":0},{"$f":"IMPRIMIR!C239","v":0},{"$f":"IF(E240=0,0,IMPRIMIR!D239)","v":0},{"$f":"IF(E240=0,0,IMPRIMIR!E239)","v":0},0,0,0]
[null,{"$f":"IF(E241=0,0,IMPRIMIR!A240)","v":0},{"$f":"IF(E241=0,0,IMPRIMIR!$D$3)","v":0},0,{"$f":"IMPRIMIR!B240","v":0},{"$f":"IMPRIMIR!C240","v":0},{"$f":"IF(E241=0,0,IMPRIMIR!D240)","v":0},{"$f":"IF(E241=0,0,IMPRIMIR!E240)","v":0},0,0,0]
[null,{"$f":"IF(E242=0,0,IMPRIMIR!A241)","v":0},{"$f":"IF(E242=0,0,IMPRIMIR!$D$3)","v":0},0,{"$f":"IMPRIMIR!B241","v":0},{"$f":"IMPRIMIR!C241","v":0},{"$f":"IF(E242=0,0,IMPRIMIR!D241)","v":0},{"$f":"IF(E242=0,0,IMPRIMIR!E241)","v":0},0,0,0]
[null,{"$f":"IF(E243=0,0,IMPRIMIR!A242)","v":0},{"$f":"IF(E243=0,0,IMPRIMIR!$D$3)","v":0},0,{"$f":"IMPRIMIR!B242","v":0},{"$f":"IMPRIMIR!C242","v":0},{"$f":"IF(E243=0,0,IMPRIMIR!D242)","v":0},{"$f":"IF(E243=0,0,IMPRIMIR!E242)","v":0},0,0,0]
[null,{"$f":"IF(E244=0,0,IMPRIMIR!A243)","v":0},{"$f":"IF(E244=0,0,IMPRIMIR!$D$3)","v":0},0,{"$f":"IMPRIMIR!B243","v":0},{"$f":"IMPRIMIR!C243","v":0},{"$f":"IF(E244=0,0,IMPRIMIR!D243)","v":0},{"$f":"IF(E244=0,0,IMPRIMIR!E243)","v":0},0,0,0]
[null,{"$f":"IF(E245=0,0,IMPRIMIR!A244)","v":0},{"$f":"IF(E245=0,0,IMPRIMIR!$D$3)","v":0},0,{"$f":"IMPRIMIR!B244","v":0},{"$f":"IMPRIMIR!C244","v":0},{"$f":"IF(E245=0,0,IMPRIMIR!D244)","v":0},{"$f":"IF(E245=0,0,IMPRIMIR!E244)","v":0},0,0,0]
[null,{"$f":"IF(E246=0,0,IMPRIMIR!A245)","v":0},{"$f":"IF(E246=0,0,IMPRIMIR!$D$3)","v":0},0,{"$f":"IMPRIMIR!B245","v":0},{"$f":"IMPRIMIR!C245","v":0},{"$f":"IF(E246=0,0,IMPRIMIR!D245)","v":0},{"$f":"IF(E246=0,0,IMPRIMIR!E245)","v":0},0,0,0]
[null,{"$f":"IF(E247=0,0,IMPRIMIR!A246)","v":0},{"$f":"IF(E247=0,0,IMPRIMIR!$D$3)","v":0},0,{"$f":"IMPRIMIR!B246","v":0},{"$f":"IMPRIMIR!C246","v":0},{"$f":"IF(E247=0,0,IMPRIMIR!D246)","v":0},{"$f":"IF(E247=0,0,IMPRIMIR!E246)","v":0},0,0,0]
[null,{"$f":"IF(E248=0,0,IMPRIMIR!A247)","v":0},{"$f":"IF(E248=0,0,IMPRIMIR!$D$3)","v":0},0,{"$f":"IMPRIMIR!B247","v":0},{"$f":"IMPRIMIR!C247","v":0},{"$f":"IF(E248=0,0,IMPRIMIR!D247)","v":0},{"$f":"IF(E248=0,0,IMPRIMIR!E247)","v":0},0,0,0]
[null,{"$f":"IF(E249=0,0,IMPRIMIR!A248)","v":0},{"$f":"IF(E249=0,0,IMPRIMIR!$D$3)","v":0},0,{"$f":"IMPRIMIR!B248","v":0},{"$f":"IMPRIMIR!C248","v":0},{"$f":"IF(E249=0,0,IMPRIMIR!D248)","v":0},{"$f":"IF(E249=0,0,IMPRIMIR!E248)","v":0},0,0,0]
[null,{"$f":"IF(E250=0,0,IMPRIMIR!A249)","v":0},{"$f":"IF(E250=0,0,IMPRIMIR!$D$3)","v":0},0,{"$f":"IMPRIMIR!B249","v":0},{"$f":"IMPRIMIR!C249","v":0},{"$f":"IF(E250=0,0,IMPRIMIR!D249)","v":0},{"$f":"IF(E250=0,0,IMPRIMIR!E249)","v":0},0,0,0]
[null,{"$f":"IF(E251=0,0,IMPRIMIR!A250)","v":0},{"$f":"IF(E251=0,0,IMPRIMIR!$D$3)","v":0},0,{"$f":"IMPRIMIR!B250","v":0},{"$f":"IMPRIMIR!C250","v":0},{"$f":"IF(E251=0,0,IMPRIMIR!D250)","v":0},{"$f":"IF(E251=0,0,IMPRIMIR!E250)","v":0},0,0,0]
[null,{"$f":"IF(E252=0,0,IMPRIMIR!A251)","v":0},{"$f":"IF(E252=0,0,IMPRIMIR!$D$3)","v":0},0,{"$f":"IMPRIMIR!B251","v":0},{"$f":"IMPRIMIR!C251","v":0},{"$f":"IF(E252=0,0,IMPRIMIR!D251)","v":0},{"$f":"IF(E252=0,0,IMPRIMIR!E251)","v":0},0,0,0]
[null,{"$f":"IF(E253=0,0,IMPRIMIR!A252)","v":0},{"$f":"IF(E253=0,0,IMPRIMIR!$D$3)","v":0},0,{"$f":"IMPRIMIR!B252","v":0},{"$f":"IMPRIMIR!C252","v":0},{"$f":"IF(E253=0,0,IMPRIMIR!D252)","v":0},{"$f":"IF(E253=0,0,IMPRIMIR!E252)","v":0},0,0,0]
[null,{"$f":"IF(E254=0,0,IMPRIMIR!A253)","v":0},{"$f":"IF(E254=0,0,IMPRIMIR!$D$3)","v":0},0,{"$f":"IMPRIMIR!B253","v":0},{"$f":"IMPRIMIR!C253","v":0},{"$f":"IF(E254=0,0,IMPRIMIR!D253)","v":0},{"$f":"IF(E254=0,0,IMPRIMIR!E253)","v":0},0,0,0]
[null,{"$f":"IF(E255=0,0,IMPRIMIR!A254)","v":0},{"$f":"IF(E255=0,0,IMPRIMIR!$D$3)","v":0},0,{"$f":"IMPRIMIR!B254","v":0},{"$f":"IMPRIMIR!C254","v":0},{"$f":"IF(E255=0,0,IMPRIMIR!D254)","v":0},{"$f":"IF(E255=0,0,IMPRIMIR!E254)","v":0},0,0,0]
[null,{"$f":"IF(E256=0,0,IMPRIMIR!A255)","v":0},{"$f":"IF(E256=0,0,IMPRIMIR!$D$3)","v":0},0,{"$f":"IMPRIMIR!B255","v":0},{"$f":"IMPRIMIR!C255","v":0},{"$f":"IF(E256=0,0,IMPRIMIR!D255)","v":0},{"$f":"IF(E256=0,0,IMPRIMIR!E255)","v":0},0,0,0]
[null,{"$f":"IF(E257=0,0,IMPRIMIR!A256)","v":0},{"$f":"IF(E257=0,0,IMPRIMIR!$D$3)","v":0},0,{"$f":"IMPRIMIR!B256","v":0},{"$f":"IMPRIMIR!C256","v":0},{"$f":"IF(E257=0,0,IMPRIMIR!D256)","v":0},{"$f":"IF(E257=0,0,IMPRIMIR!E256)","v":0},0,0,0]
[null,{"$f":"IF(E258=0,0,IMPRIMIR!A257)","v":0},{"$f":"IF(E258=0,0,IMPRIMIR!$D$3)","v":0},0,{"$f":"IMPRIMIR!B257","v":0},{"$f":"IMPRIMIR!C257","v":0},{"$f":"IF(E258=0,0,IMPRIMIR!D257)","v":0},{"$f":"IF(E258=0,0,IMPRIMIR!E257)","v":0},0,0,0]
[null,{"$f":"IF(E259=0,0,IMPRIMIR!A258)","v":0},{"$f":"IF(E259=0,0,IMPRIMIR!$D$3)","v":0},0,{"$f":"IMPRIMIR!B258","v":0},{"$f":"IMPRIMIR!C258","v":0},{"$f":"IF(E259=0,0,IMPRIMIR!D258)","v":0},{"$f":"IF(E259=0,0,IMPRIMIR!E258)","v":0},0,0,0]
[null,{"$f":"IF(E260=0,0,IMPRIMIR!A259)","v":0},{"$f":"IF(E260=0,0,IMPRIMIR!$D$3)","v":0},0,{"$f":"IMPRIMIR!B259","v":0},{"$f":"IMPRIMIR!C259","v":0},{"$f":"IF(E260=0,0,IMPRIMIR!D259)","v":0},{"$f":"IF(E260=0,0,IMPRIMIR!E259)","v":0},0,0,0]
[null,{"$f":"IF(E261=0,0,IMPRIMIR!A260)","v":0},{"$f":"IF(E261=0,0,IMPRIMIR!$D$3)","v":0},0,{"$f":"IMPRIMIR!B260","v":0},{"$f":"IMPRIMIR!C260","v":0},{"$f":"IF(E261=0,0,IMPRIMIR!D260)","v":0},{"$f":"IF(E261=0,0,IMPRIMIR!E260)","v":0},0,0,0]
[null,{"$f":"IF(E262=0,0,IMPRIMIR!A261)","v":0},{"$f":"IF(E262=0,0,IMPRIMIR!$D$3)","v":0},0,{"$f":"IMPRIMIR!B261","v":0},{"$f":"IMPRIMIR!C261","v":0},{"$f":"IF(E262=0,0,IMPRIMIR!D261)","v":0},{"$f":"IF(E262=0,0,IMPRIMIR!E261)","v":0},0,0,0]
[null,{"$f":"IF(E263=0,0,IMPRIMIR!A262)","v":0},{"$f":"IF(E263=0,0,IMPRIMIR!$D$3)","v":0},0,{"$f":"IMPRIMIR!B262","v":0},{"$f":"IMPRIMIR!C262","v":0},{"$f":"IF(E263=0,0,IMPRIMIR!D262)","v":0},{"$f":"IF(E263=0,0,IMPRIMIR!E262)","v":0},0,0,0]
[null,{"$f":"IF(E264=0,0,IMPRIMIR!A263)","v":0},{"$f":"IF(E264=0,0,IMPRIMIR!$D$3)","v":0},0,{"$f":"IMPRIMIR!B263","v":0},{"$f":"IMPRIMIR!C263","v":0},{"$f":"IF(E264=0,0,IMPRIMIR!D263)","v":0},{"$f":"IF(E264=0,0,IMPRIMIR!E263)","v":0},0,0,0]
[null,{"$f":"IF(E265=0,0,IMPRIMIR!A264)","v":0},{"$f":"IF(E265=0,0,IMPRIMIR!$D$3)","v":0},0,{"$f":"IMPRIMIR!B264","v":0},{"$f":"IMPRIMIR!C264","v":0},{"$f":"IF(E265=0,0,IMPRIMIR!D264)","v":0},{"$f":"IF(E265=0,0,IMPRIMIR!E264)","v":0},0,0,0]
[null,{"$f":"IF(E266=0,0,IMPRIMIR!A265)","v":0},{"$f":"IF(E266=0,0,IMPRIMIR!$D$3)","v":0},0,{"$f":"IMPRIMIR!B265","v":0},{"$f":"IMPRIMIR!C265","v":0},{"$f":"IF(E266=0,0,IMPRIMIR!D265)","v":0},{"$f":"IF(E266=0,0,IMPRIMIR!E265)","v":0},0,0,0]
[null,{"$f":"IF(E267=0,0,IMPRIMIR!A266)","v":0},{"$f":"IF(E267=0,0,IMPRIMIR!$D$3)","v":0},0,{"$f":"IMPRIMIR!B266","v":0},{"$f":"IMPRIMIR!C266","v":0},{"$f":"IF(E267=0,0,IMPRIMIR!D266)","v":0},{"$f":"IF(E267=0,0,IMPRIMIR!E266)","v":0},0,0,0]
[null,{"$f":"IF(E268=0,0,IMPRIMIR!A267)","v":0},{"$f":"IF(E268=0,0,IMPRIMIR!$D$3)","v":0},0,{"$f":"IMPRIMIR!B267","v":0},{"$f":"IMPRIMIR!C267","v":0},{"$f":"IF(E268=0,0,IMPRIMIR!D267)","v":0},{"$f":"IF(E268=0,0,IMPRIMIR!E267)","v":0},0,0,0]
[null,{"$f":"IF(E269=0,0,IMPRIMIR!A268)","v":0},{"$f":"IF(E269=0,0,IMPRIMIR!$D$3)","v":0},{"$f":"IF(E269=\"0\",0,$G$2)","v":0},{"$f":"IMPRIMIR!B268","v":0},{"$f":"IMPRIMIR!C268","v":0},{"$f":"IF(E269=0,0,IMPRIMIR!D268)","v":0},{"$f":"IF(E269=0,0,IMPRIMIR!E268)","v":0},{"$f":"IF(E269=0,0,$G$2)","v":0},{"$f":"IF(E269=0,0,$G$4)","v":0},{"$f":"IF(E269=0,0,$G$3)","v":0}]
[null,{"$f":"IF(E270=0,0,IMPRIMIR!A269)","v":0},{"$f":"IF(E270=0,0,IMPRIMIR!$D$3)","v":0},0,{"$f":"IMPRIMIR!B269","v":0},{"$f":"IMPRIMIR!C269","v":0},{"$f":"IF(E270=0,0,IMPRIMIR!D269)","v":0},{"$f":"IF(E270=0,0,IMPRIMIR!E269)","v":0},0,0,0]
[null,{"$f":"IF(E271=0,0,IMPRIMIR!A270)","v":0},{"$f":"IF(E271=0,0,IMPRIMIR!$D$3)","v":0},0,{"$f":"IMPRIMIR!B270","v":0},{"$f":"IMPRIMIR!C270","v":0},{"$f":"IF(E271=0,0,IMPRIMIR!D270)","v":0},{"$f":"IF(E271=0,0,IMPRIMIR!E270)","v":0},0,0,0]
[null,{"$f":"IF(E272=0,0,IMPRIMIR!A271)","v":0},{"$f":"IF(E272=0,0,IMPRIMIR!$D$3)","v":0},0,{"$f":"IMPRIMIR!B271","v":0},{"$f":"IMPRIMIR!C271","v":0},{"$f":"IF(E272=0,0,IMPRIMIR!D271)","v":0},{"$f":"IF(E272=0,0,IMPRIMIR!E271)","v":0},0,0,0]
[null,{"$f":"IF(E273=0,0,IMPRIMIR!A272)","v":0},{"$f":"IF(E273=0,0,IMPRIMIR!$D$3)","v":0},0,{"$f":"IMPRIMIR!B272","v":0},{"$f":"IMPRIMIR!C272","v":0},{"$f":"IF(E273=0,0,IMPRIMIR!D272)","v":0},{"$f":"IF(E273=0,0,IMPRIMIR!E272)","v":0},0,0,0]
[null,{"$f":"IF(E274=0,0,IMPRIMIR!A273)","v":0},{"$f":"IF(E274=0,0,IMPRIMIR!$D$3)","v":0},0,{"$f":"IMPRIMIR!B273","v":0},{"$f":"IMPRIMIR!C273","v":0},{"$f":"IF(E274=0,0,IMPRIMIR!D273)","v":0},{"$f":"IF(E274=0,0,IMPRIMIR!E273)","v":0},0,0,0]
[null,{"$f":"IF(E275=0,0,IMPRIMIR!A274)","v":0},{"$f":"IF(E275=0,0,IMPRIMIR!$D$3)","v":0},0,{"$f":"IMPRIMIR!B274","v":0},{"$f":"IMPRIMIR!C274","v":0},{"$f":"IF(E275=0,0,IMPRIMIR!D274)","v":0},{"$f":"IF(E275=0,0,IMPRIMIR!E274)","v":0},0,0,0]
[null,{"$f":"IF(E276=0,0,IMPRIMIR!A275)","v":0},{"$f":"IF(E276=0,0,IMPRIMIR!$D$3)","v":0},0,{"$f":"IMPRIMIR!B275","v":0},{"$f":"IMPRIMIR!C275","v":0},{"$f":"IF(E276=0,0,IMPRIMIR!D275)","v":0},{"$f":"IF(E276=0,0,IMPRIMIR!E275)","v":0},0,0,0]
[null,{"$f":"IF(E277=0,0,IMPRIMIR!A276)","v":0},{"$f":"IF(E277=0,0,IMPRIMIR!$D$3)","v":0},0,{"$f":"IMPRIMIR!B276","v":0},{"$f":"IMPRIMIR!C276","v":0},{"$f":"IF(E277=0,0,IMPRIMIR!D276)","v":0},{"$f":"IF(E277=0,0,IMPRIMIR!E276)","v":0},0,0,0]
[null,{"$f":"IF(E278=0,0,IMPRIMIR!A277)","v":0},{"$f":"IF(E278=0,0,IMPRIMIR!$D$3)","v":0},0,{"$f":"IMPRIMIR!B277","v":0},{"$f":"IMPRIMIR!C277","v":0},{"$f":"IF(E278=0,0,IMPRIMIR!D277)","v":0},{"$f":"IF(E278=0,0,IMPRIMIR!E277)","v":0},0,0,0]
[null,{"$f":"IF(E279=0,0,IMPRIMIR!A278)","v":0},{"$f":"IF(E279=0,0,IMPRIMIR!$D$3)","v":0},0,{"$f":"IMPRIMIR!B278","v":0},{"$f":"IMPRIMIR!C278","v":0},{"$f":"IF(E279=0,0,IMPRIMIR!D278)","v":0},{"$f":"IF(E279=0,0,IMPRIMIR!E278)","v":0},0,0,0]
[null,{"$f":"IF(E280=0,0,IMPRIMIR!A279)","v":0},{"$f":"IF(E280=0,0,IMPRIMIR!$D$3)","v":0},0,{"$f":"IMPRIMIR!B279","v":0},{"$f":"IMPRIMIR!C279","v":0},{"$f":"IF(E280=0,0,IMPRIMIR!D279)","v":0},{"$f":"IF(E280=0,0,IMPRIMIR!E279)","v":0},0,0,0]
[null,{"$f":"IF(E281=0,0,IMPRIMIR!A280)","v":0},{"$f":"IF(E281=0,0,IMPRIMIR!$D$3)","v":0},0,{"$f":"IMPRIMIR!B280","v":0},{"$f":"IMPRIMIR!C280","v":0},{"$f":"IF(E281=0,0,IMPRIMIR!D280)","v":0},{"$f":"IF(E281=0,0,IMPRIMIR!E280)","v":0},0,0,0]
[null,{"$f":"IF(E282=0,0,IMPRIMIR!A281)","v":0},{"$f":"IF(E282=0,0,IMPRIMIR!$D$3)","v":0},0,{"$f":"IMPRIMIR!B281","v":0},{"$f":"IMPRIMIR!C281","v":0},{"$f":"IF(E282=0,0,IMPRIMIR!D281)","v":0},{"$f":"IF(E282=0,0,IMPRIMIR!E281)","v":0},0,0,0]
[null,{"$f":"IF(E283=0,0,IMPRIMIR!A282)","v":0},{"$f":"IF(E283=0,0,IMPRIMIR!$D$3)","v":0},0,{"$f":"IMPRIMIR!B282","v":0},{"$f":"IMPRIMIR!C282","v":0},{"$f":"IF(E283=0,0,IMPRIMIR!D282)","v":0},{"$f":"IF(E283=0,0,IMPRIMIR!E282)","v":0},0,0,0]
[null,{"$f":"IF(E284=0,0,IMPRIMIR!A283)","v":0},{"$f":"IF(E284=0,0,IMPRIMIR!$D$3)","v":0},0,{"$f":"IMPRIMIR!B283","v":0},{"$f":"IMPRIMIR!C283","v":0},{"$f":"IF(E284=0,0,IMPRIMIR!D283)","v":0},{"$f":"IF(E284=0,0,IMPRIMIR!E283)","v":0},0,0,0]
[null,{"$f":"IF(E285=0,0,IMPRIMIR!A284)","v":0},{"$f":"IF(E285=0,0,IMPRIMIR!$D$3)","v":0},0,{"$f":"IMPRIMIR!B284","v":0},{"$f":"IMPRIMIR!C284","v":0},{"$f":"IF(E285=0,0,IMPRIMIR!D284)","v":0},{"$f":"IF(E285=0,0,IMPRIMIR!E284)","v":0},0,0,0]
[null,{"$f":"IF(E286=0,0,IMPRIMIR!A285)","v":0},{"$f":"IF(E286=0,0,IMPRIMIR!$D$3)","v":0},0,{"$f":"IMPRIMIR!B285","v":0},{"$f":"IMPRIMIR!C285","v":0},{"$f":"IF(E286=0,0,IMPRIMIR!D285)","v":0},{"$f":"IF(E286=0,0,IMPRIMIR!E285)","v":0},0,0,0]
[null,{"$f":"IF(E287=0,0,IMPRIMIR!A286)","v":0},{"$f":"IF(E287=0,0,IMPRIMIR!$D$3)","v":0},0,{"$f":"IMPRIMIR!B286","v":0},{"$f":"IMPRIMIR!C286","v":0},{"$f":"IF(E287=0,0,IMPRIMIR!D286)","v":0},{"$f":"IF(E287=0,0,IMPRIMIR!E286)","v":0},0,0,0]
[null,{"$f":"IF(E288=0,0,IMPRIMIR!A287)","v":0},{"$f":"IF(E288=0,0,IMPRIMIR!$D$3)","v":0},0,{"$f":"IMPRIMIR!B287","v":0},{"$f":"IMPRIMIR!C287","v":0},{"$f":"IF(E288=0,0,IMPRIMIR!D287)","v":0},{"$f":"IF(E288=0,0,IMPRIMIR!E287)","v":0},0,0,0]
[null,{"$f":"IF(E289=0,0,IMPRIMIR!A288)","v":0},{"$f":"IF(E289=0,0,IMPRIMIR!$D$3)","v":0},0,{"$f":"IMPRIMIR!B288","v":0},{"$f":"IMPRIMIR!C288","v":0},{"$f":"IF(E289=0,0,IMPRIMIR!D288)","v":0},{"$f":"IF(E289=0,0,IMPRIMIR!E288)","v":0},0,0,0]
[null,{"$f":"IF(E290=0,0,IMPRIMIR!A289)","v":0},{"$f":"IF(E290=0,0,IMPRIMIR!$D$3)","v":0},0,{"$f":"IMPRIMIR!B289","v":0},{"$f":"IMPRIMIR!C289","v":0},{"$f":"IF(E290=0,0,IMPRIMIR!D289)","v":0},{"$f":"IF(E290=0,0,IMPRIMIR!E289)","v":0},0,0,0]
[null,{"$f":"IF(E291=0,0,IMPRIMIR!A290)","v":0},{"$f":"IF(E291=0,0,IMPRIMIR!$D$3)","v":0},0,{"$f":"IMPRIMIR!B290","v":0},{"$f":"IMPRIMIR!C290","v":0},{"$f":"IF(E291=0,0,IMPRIMIR!D290)","v":0},{"$f":"IF(E291=0,0,IMPRIMIR!E290)","v":0},0,0,0]
[null,{"$f":"IF(E292=0,0,IMPRIMIR!A291)","v":0},{"$f":"IF(E292=0,0,IMPRIMIR!$D$3)","v":0},0,{"$f":"IMPRIMIR!B291","v":0},{"$f":"IMPRIMIR!C291","v":0},{"$f":"IF(E292=0,0,IMPRIMIR!D291)","v":0},{"$f":"IF(E292=0,0,IMPRIMIR!E291)","v":0},0,0,0]
[null,{"$f":"IF(E293=0,0,IMPRIMIR!A292)","v":0},{"$f":"IF(E293=0,0,IMPRIMIR!$D$3)","v":0},0,{"$f":"IMPRIMIR!B292","v":0},{"$f":"IMPRIMIR!C292","v":0},{"$f":"IF(E293=0,0,IMPRIMIR!D292)","v":0},{"$f":"IF(E293=0,0,IMPRIMIR!E292)","v":0},0,0,0]
[null,{"$f":"IF(E294=0,0,IMPRIMIR!A293)","v":0},{"$f":"IF(E294=0,0,IMPRIMIR!$D$3)","v":0},0,{"$f":"IMPRIMIR!B293","v":0},{"$f":"IMPRIMIR!C293","v":0},{"$f":"IF(E294=0,0,IMPRIMIR!D293)","v":0},{"$f":"IF(E294=0,0,IMPRIMIR!E293)","v":0},0,0,0]
[null,{"$f":"IF(E295=0,0,IMPRIMIR!A294)","v":0},{"$f":"IF(E295=0,0,IMPRIMIR!$D$3)","v":0},0,{"$f":"IMPRIMIR!B294","v":0},{"$f":"IMPRIMIR!C294","v":0},{"$f":"IF(E295=0,0,IMPRIMIR!D294)","v":0},{"$f":"IF(E295=0,0,IMPRIMIR!E294)","v":0},0,0,0]
[null,{"$f":"IF(E296=0,0,IMPRIMIR!A295)","v":0},{"$f":"IF(E296=0,0,IMPRIMIR!$D$3)","v":0},0,{"$f":"IMPRIMIR!B295","v":0},{"$f":"IMPRIMIR!C295","v":0},{"$f":"IF(E296=0,0,IMPRIMIR!D295)","v":0},{"$f":"IF(E296=0,0,IMPRIMIR!E295)","v":0},0,0,0]
[null,{"$f":"IF(E297=0,0,IMPRIMIR!A296)","v":0},{"$f":"IF(E297=0,0,IMPRIMIR!$D$3)","v":0},0,{"$f":"IMPRIMIR!B296","v":0},{"$f":"IMPRIMIR!C296","v":0},{"$f":"IF(E297=0,0,IMPRIMIR!D296)","v":0},{"$f":"IF(E297=0,0,IMPRIMIR!E296)","v":0},0,0,0]
[null,{"$f":"IF(E298=0,0,IMPRIMIR!A297)","v":0},{"$f":"IF(E298=0,0,IMPRIMIR!$D$3)","v":0},0,{"$f":"IMPRIMIR!B297","v":0},{"$f":"IMPRIMIR!C297","v":0},{"$f":"IF(E298=0,0,IMPRIMIR!D297)","v":0},{"$f":"IF(E298=0,0,IMPRIMIR!E297)","v":0},0,0,0]
[null,{"$f":"IF(E299=0,0,IMPRIMIR!A298)","v":0},{"$f":"IF(E299=0,0,IMPRIMIR!$D$3)","v":0},0,{"$f":"IMPRIMIR!B298","v":0},{"$f":"IMPRIMIR!C298","v":0},{"$f":"IF(E299=0,0,IMPRIMIR!D298)","v":0},{"$f":"IF(E299=0,0,IMPRIMIR!E298)","v":0},0,0,0]
[null,{"$f":"IF(E300=0,0,IMPRIMIR!A299)","v":0},{"$f":"IF(E300=0,0,IMPRIMIR!$D$3)","v":0},0,{"$f":"IMPRIMIR!B299","v":0},{"$f":"IMPRIMIR!C299","v":0},{"$f":"IF(E300=0,0,IMPRIMIR!D299)","v":0},{"$f":"IF(E300=0,0,IMPRIMIR!E299)","v":0},0,0,0]
[null,{"$f":"IF(E301=0,0,IMPRIMIR!A300)","v":0},{"$f":"IF(E301=0,0,IMPRIMIR!$D$3)","v":0},0,{"$f":"IMPRIMIR!B300","v":0},{"$f":"IMPRIMIR!C300","v":0},{"$f":"IF(E301=0,0,IMPRIMIR!D300)","v":0},{"$f":"IF(E301=0,0,IMPRIMIR!E300)","v":0},0,0,0]
[null,{"$f":"IF(E302=0,0,IMPRIMIR!A301)","v":0},{"$f":"IF(E302=0,0,IMPRIMIR!$D$3)","v":0},0,{"$f":"IMPRIMIR!B301","v":0},{"$f":"IMPRIMIR!C301","v":0},{"$f":"IF(E302=0,0,IMPRIMIR!D301)","v":0},{"$f":"IF(E302=0,0,IMPRIMIR!E301)","v":0},0,0,0]
[null,{"$f":"IF(E303=0,0,IMPRIMIR!A302)","v":0},{"$f":"IF(E303=0,0,IMPRIMIR!$D$3)","v":0},0,{"$f":"IMPRIMIR!B302","v":0},{"$f":"IMPRIMIR!C302","v":0},{"$f":"IF(E303=0,0,IMPRIMIR!D302)","v":0},{"$f":"IF(E303=0,0,IMPRIMIR!E302)","v":0},0,0,0]
[null,{"$f":"IF(E304=0,0,IMPRIMIR!A303)","v":0},{"$f":"IF(E304=0,0,IMPRIMIR!$D$3)","v":0},0,{"$f":"IMPRIMIR!B303","v":0},{"$f":"IMPRIMIR!C303","v":0},{"$f":"IF(E304=0,0,IMPRIMIR!D303)","v":0},{"$f":"IF(E304=0,0,IMPRIMIR!E303)","v":0},0,0,0]
[null,{"$f":"IF(E305=0,0,IMPRIMIR!A304)","v":0},{"$f":"IF(E305=0,0,IMPRIMIR!$D$3)","v":0},0,{"$f":"IMPRIMIR!B304","v":0},{"$f":"IMPRIMIR!C304","v":0},{"$f":"IF(E305=0,0,IMPRIMIR!D304)","v":0},{"$f":"IF(E305=0,0,IMPRIMIR!E304)","v":0},0,0,0]
[null,{"$f":"IF(E306=0,0,IMPRIMIR!A305)","v":0},{"$f":"IF(E306=0,0,IMPRIMIR!$D$3)","v":0},0,{"$f":"IMPRIMIR!B305","v":0},{"$f":"IMPRIMIR!C305","v":0},{"$f":"IF(E306=0,0,IMPRIMIR!D305)","v":0},{"$f":"IF(E306=0,0,IMPRIMIR!E305)","v":0},0,0,0]
[null,{"$f":"IF(E307=0,0,IMPRIMIR!A306)","v":0},{"$f":"IF(E307=0,0,IMPRIMIR!$D$3)","v":0},0,{"$f":"IMPRIMIR!B306","v":0},{"$f":"IMPRIMIR!C306","v":0},{"$f":"IF(E307=0,0,IMPRIMIR!D306)","v":0},{"$f":"IF(E307=0,0,IMPRIMIR!E306)","v":0},0,0,0]
[null,{"$f":"IF(E308=0,0,IMPRIMIR!A307)","v":0},{"$f":"IF(E308=0,0,IMPRIMIR!$D$3)","v":0},0,{"$f":"IMPRIMIR!B307","v":0},{"$f":"IMPRIMIR!C307","v":0},{"$f":"IF(E308=0,0,IMPRIMIR!D307)","v":0},{"$f":"IF(E308=0,0,IMPRIMIR!E307)","v":0},0,0,0]
[null,{"$f":"IF(E309=0,0,IMPRIMIR!A308)","v":0},{"$f":"IF(E309=0,0,IMPRIMIR!$D$3)","v":0},{"$f":"IF(E309=\"0\",0,$G$2)","v":0},{"$f":"IMPRIMIR!B308","v":0},{"$f":"IMPRIMIR!C308","v":0},{"$f":"IF(E309=0,0,IMPRIMIR!D308)","v":0},{"$f":"IF(E309=0,0,IMPRIMIR!E308)","v":0},{"$f":"IF(E309=0,0,$G$2)","v":0},{"$f":"IF(E309=0,0,$G$4)","v":0},{"$f":"IF(E309=0,0,$G$3)","v":0}]
[null,{"$f":"IF(E310=0,0,IMPRIMIR!A309)","v":0},{"$f":"IF(E310=0,0,IMPRIMIR!$D$3)","v":0},0,{"$f":"IMPRIMIR!B309","v":0},{"$f":"IMPRIMIR!C309","v":0},{"$f":"IF(E310=0,0,IMPRIMIR!D309)","v":0},{"$f":"IF(E310=0,0,IMPRIMIR!E309)","v":0},0,0,0]
[null,{"$f":"IF(E311=0,0,IMPRIMIR!A310)","v":0},{"$f":"IF(E311=0,0,IMPRIMIR!$D$3)","v":0},0,{"$f":"IMPRIMIR!B310","v":0},{"$f":"IMPRIMIR!C310","v":0},{"$f":"IF(E311=0,0,IMPRIMIR!D310)","v":0},{"$f":"IF(E311=0,0,IMPRIMIR!E310)","v":0},0,0,0]
[null,{"$f":"IF(E312=0,0,IMPRIMIR!A311)","v":0},{"$f":"IF(E312=0,0,IMPRIMIR!$D$3)","v":0},0,{"$f":"IMPRIMIR!B311","v":0},{"$f":"IMPRIMIR!C311","v":0},{"$f":"IF(E312=0,0,IMPRIMIR!D311)","v":0},{"$f":"IF(E312=0,0,IMPRIMIR!E311)","v":0},0,0,0]
[null,{"$f":"IF(E313=0,0,IMPRIMIR!A312)","v":0},{"$f":"IF(E313=0,0,IMPRIMIR!$D$3)","v":0},0,{"$f":"IMPRIMIR!B312","v":0},{"$f":"IMPRIMIR!C312","v":0},{"$f":"IF(E313=0,0,IMPRIMIR!D312)","v":0},{"$f":"IF(E313=0,0,IMPRIMIR!E312)","v":0},0,0,0]
[null,{"$f":"IF(E314=0,0,IMPRIMIR!A313)","v":0},{"$f":"IF(E314=0,0,IMPRIMIR!$D$3)","v":0},0,{"$f":"IMPRIMIR!B313","v":0},{"$f":"IMPRIMIR!C313","v":0},{"$f":"IF(E314=0,0,IMPRIMIR!D313)","v":0},{"$f":"IF(E314=0,0,IMPRIMIR!E313)","v":0},0,0,0]
[null,{"$f":"IF(E315=0,0,IMPRIMIR!A314)","v":0},{"$f":"IF(E315=0,0,IMPRIMIR!$D$3)","v":0},0,{"$f":"IMPRIMIR!B314","v":0},{"$f":"IMPRIMIR!C314","v":0},{"$f":"IF(E315=0,0,IMPRIMIR!D314)","v":0},{"$f":"IF(E315=0,0,IMPRIMIR!E314)","v":0},0,0,0]
[null,{"$f":"IF(E316=0,0,IMPRIMIR!A315)","v":0},{"$f":"IF(E316=0,0,IMPRIMIR!$D$3)","v":0},0,{"$f":"IMPRIMIR!B315","v":0},{"$f":"IMPRIMIR!C315","v":0},{"$f":"IF(E316=0,0,IMPRIMIR!D315)","v":0},{"$f":"IF(E316=0,0,IMPRIMIR!E315)","v":0},0,0,0]
[null,{"$f":"IF(E317=0,0,IMPRIMIR!A316)","v":0},{"$f":"IF(E317=0,0,IMPRIMIR!$D$3)","v":0},0,{"$f":"IMPRIMIR!B316","v":0},{"$f":"IMPRIMIR!C316","v":0},{"$f":"IF(E317=0,0,IMPRIMIR!D316)","v":0},{"$f":"IF(E317=0,0,IMPRIMIR!E316)","v":0},0,0,0]
[null,{"$f":"IF(E318=0,0,IMPRIMIR!A317)","v":0},{"$f":"IF(E318=0,0,IMPRIMIR!$D$3)","v":0},0,{"$f":"IMPRIMIR!B317","v":0},{"$f":"IMPRIMIR!C317","v":0},{"$f":"IF(E318=0,0,IMPRIMIR!D317)","v":0},{"$f":"IF(E318=0,0,IMPRIMIR!E317)","v":0},0,0,0]
[null,{"$f":"IF(E319=0,0,IMPRIMIR!A318)","v":0},{"$f":"IF(E319=0,0,IMPRIMIR!$D$3)","v":0},0,{"$f":"IMPRIMIR!B318","v":0},{"$f":"IMPRIMIR!C318","v":0},{"$f":"IF(E319=0,0,IMPRIMIR!D318)","v":0},{"$f":"IF(E319=0,0,IMPRIMIR!E318)","v":0},0,0,0]
[null,{"$f":"IF(E320=0,0,IMPRIMIR!A319)","v":0},{"$f":"IF(E320=0,0,IMPRIMIR!$D$3)","v":0},0,{"$f":"IMPRIMIR!B319","v":0},{"$f":"IMPRIMIR!C319","v":0},{"$f":"IF(E320=0,0,IMPRIMIR!D319)","v":0},{"$f":"IF(E320=0,0,IMPRIMIR!E319)","v":0},0,0,0]
[null,{"$f":"IF(E321=0,0,IMPRIMIR!A320)","v":0},{"$f":"IF(E321=0,0,IMPRIMIR!$D$3)","v":0},0,{"$f":"IMPRIMIR!B320","v":0},{"$f":"IMPRIMIR!C320","v":0},{"$f":"IF(E321=0,0,IMPRIMIR!D320)","v":0},{"$f":"IF(E321=0,0,IMPRIMIR!E320)","v":0},0,0,0]
[null,{"$f":"IF(E322=0,0,IMPRIMIR!A321)","v":0},{"$f":"IF(E322=0,0,IMPRIMIR!$D$3)","v":0},0,{"$f":"IMPRIMIR!B321","v":0},{"$f":"IMPRIMIR!C321","v":0},{"$f":"IF(E322=0,0,IMPRIMIR!D321)","v":0},{"$f":"IF(E322=0,0,IMPRIMIR!E321)","v":0},0,0,0]
[null,{"$f":"IF(E323=0,0,IMPRIMIR!A322)","v":0},{"$f":"IF(E323=0,0,IMPRIMIR!$D$3)","v":0},0,{"$f":"IMPRIMIR!B322","v":0},{"$f":"IMPRIMIR!C322","v":0},{"$f":"IF(E323=0,0,IMPRIMIR!D322)","v":0},{"$f":"IF(E323=0,0,IMPRIMIR!E322)","v":0},0,0,0]
[null,{"$f":"IF(E324=0,0,IMPRIMIR!A323)","v":0},{"$f":"IF(E324=0,0,IMPRIMIR!$D$3)","v":0},0,{"$f":"IMPRIMIR!B323","v":0},{"$f":"IMPRIMIR!C323","v":0},{"$f":"IF(E324=0,0,IMPRIMIR!D323)","v":0},{"$f":"IF(E324=0,0,IMPRIMIR!E323)","v":0},0,0,0]
[null,{"$f":"IF(E325=0,0,IMPRIMIR!A324)","v":0},{"$f":"IF(E325=0,0,IMPRIMIR!$D$3)","v":0},0,{"$f":"IMPRIMIR!B324","v":0},{"$f":"IMPRIMIR!C324","v":0},{"$f":"IF(E325=0,0,IMPRIMIR!D324)","v":0},{"$f":"IF(E325=0,0,IMPRIMIR!E324)","v":0},0,0,0]
[null,{"$f":"IF(E326=0,0,IMPRIMIR!A325)","v":0},{"$f":"IF(E326=0,0,IMPRIMIR!$D$3)","v":0},0,{"$f":"IMPRIMIR!B325","v":0},{"$f":"IMPRIMIR!C325","v":0},{"$f":"IF(E326=0,0,IMPRIMIR!D325)","v":0},{"$f":"IF(E326=0,0,IMPRIMIR!E325)","v":0},0,0,0]
[null,{"$f":"IF(E327=0,0,IMPRIMIR!A326)","v":0},{"$f":"IF(E327=0,0,IMPRIMIR!$D$3)","v":0},0,{"$f":"IMPRIMIR!B326","v":0},{"$f":"IMPRIMIR!C326","v":0},{"$f":"IF(E327=0,0,IMPRIMIR!D326)","v":0},{"$f":"IF(E327=0,0,IMPRIMIR!E326)","v":0},0,0,0]
[null,{"$f":"IF(E328=0,0,IMPRIMIR!A327)","v":0},{"$f":"IF(E328=0,0,IMPRIMIR!$D$3)","v":0},0,{"$f":"IMPRIMIR!B327","v":0},{"$f":"IMPRIMIR!C327","v":0},{"$f":"IF(E328=0,0,IMPRIMIR!D327)","v":0},{"$f":"IF(E328=0,0,IMPRIMIR!E327)","v":0},0,0,0]
[null,{"$f":"IF(E329=0,0,IMPRIMIR!A328)","v":0},{"$f":"IF(E329=0,0,IMPRIMIR!$D$3)","v":0},0,{"$f":"IMPRIMIR!B328","v":0},{"$f":"IMPRIMIR!C328","v":0},{"$f":"IF(E329=0,0,IMPRIMIR!D328)","v":0},{"$f":"IF(E329=0,0,IMPRIMIR!E328)","v":0},0,0,0]
[null,{"$f":"IF(E330=0,0,IMPRIMIR!A329)","v":0},{"$f":"IF(E330=0,0,IMPRIMIR!$D$3)","v":0},0,{"$f":"IMPRIMIR!B329","v":0},{"$f":"IMPRIMIR!C329","v":0},{"$f":"IF(E330=0,0,IMPRIMIR!D329)","v":0},{"$f":"IF(E330=0,0,IMPRIMIR!E329)","v":0},0,0,0]
[null,{"$f":"IF(E331=0,0,IMPRIMIR!A330)","v":0},{"$f":"IF(E331=0,0,IMPRIMIR!$D$3)","v":0},0,{"$f":"IMPRIMIR!B330","v":0},{"$f":"IMPRIMIR!C330","v":0},{"$f":"IF(E331=0,0,IMPRIMIR!D330)","v":0},{"$f":"IF(E331=0,0,IMPRIMIR!E330)","v":0},0,0,0]
[null,{"$f":"IF(E332=0,0,IMPRIMIR!A331)","v":0},{"$f":"IF(E332=0,0,IMPRIMIR!$D$3)","v":0},0,{"$f":"IMPRIMIR!B331","v":0},{"$f":"IMPRIMIR!C331","v":0},{"$f":"IF(E332=0,0,IMPRIMIR!D331)","v":0},{"$f":"IF(E332=0,0,IMPRIMIR!E331)","v":0},0,0,0]
[null,{"$f":"IF(E333=0,0,IMPRIMIR!A332)","v":0},{"$f":"IF(E333=0,0,IMPRIMIR!$D$3)","v":0},0,{"$f":"IMPRIMIR!B332","v":0},{"$f":"IMPRIMIR!C332","v":0},{"$f":"IF(E333=0,0,IMPRIMIR!D332)","v":0},{"$f":"IF(E333=0,0,IMPRIMIR!E332)","v":0},0,0,0]
[null,{"$f":"IF(E334=0,0,IMPRIMIR!A333)","v":0},{"$f":"IF(E334=0,0,IMPRIMIR!$D$3)","v":0},0,{"$f":"IMPRIMIR!B333","v":0},{"$f":"IMPRIMIR!C333","v":0},{"$f":"IF(E334=0,0,IMPRIMIR!D333)","v":0},{"$f":"IF(E334=0,0,IMPRIMIR!E333)","v":0},0,0,0]
[null,{"$f":"IF(E335=0,0,IMPRIMIR!A334)","v":0},{"$f":"IF(E335=0,0,IMPRIMIR!$D$3)","v":0},0,{"$f":"IMPRIMIR!B334","v":0},{"$f":"IMPRIMIR!C334","v":0},{"$f":"IF(E335=0,0,IMPRIMIR!D334)","v":0},{"$f":"IF(E335=0,0,IMPRIMIR!E334)","v":0},0,0,0]
[null,{"$f":"IF(E336=0,0,IMPRIMIR!A335)","v":0},{"$f":"IF(E336=0,0,IMPRIMIR!$D$3)","v":0},0,{"$f":"IMPRIMIR!B335","v":0},{"$f":"IMPRIMIR!C335","v":0},{"$f":"IF(E336=0,0,IMPRIMIR!D335)","v":0},{"$f":"IF(E336=0,0,IMPRIMIR!E335)","v":0},0,0,0]
[null,{"$f":"IF(E337=0,0,IMPRIMIR!A336)","v":0},{"$f":"IF(E337=0,0,IMPRIMIR!$D$3)","v":0},0,{"$f":"IMPRIMIR!B336","v":0},{"$f":"IMPRIMIR!C336","v":0},{"$f":"IF(E337=0,0,IMPRIMIR!D336)","v":0},{"$f":"IF(E337=0,0,IMPRIMIR!E336)","v":0},0,0,0]
[null,{"$f":"IF(E338=0,0,IMPRIMIR!A337)","v":0},{"$f":"IF(E338=0,0,IMPRIMIR!$D$3)","v":0},0,{"$f":"IMPRIMIR!B337","v":0},{"$f":"IMPRIMIR!C337","v":0},{"$f":"IF(E338=0,0,IMPRIMIR!D337)","v":0},{"$f":"IF(E338=0,0,IMPRIMIR!E337)","v":0},0,0,0]
[null,{"$f":"IF(E339=0,0,IMPRIMIR!A338)","v":0},{"$f":"IF(E339=0,0,IMPRIMIR!$D$3)","v":0},0,{"$f":"IMPRIMIR!B338","v":0},{"$f":"IMPRIMIR!C338","v":0},{"$f":"IF(E339=0,0,IMPRIMIR!D338)","v":0},{"$f":"IF(E339=0,0,IMPRIMIR!E338)","v":0},0,0,0]
[null,{"$f":"IF(E340=0,0,IMPRIMIR!A339)","v":0},{"$f":"IF(E340=0,0,IMPRIMIR!$D$3)","v":0},0,{"$f":"IMPRIMIR!B339","v":0},{"$f":"IMPRIMIR!C339","v":0},{"$f":"IF(E340=0,0,IMPRIMIR!D339)","v":0},{"$f":"IF(E340=0,0,IMPRIMIR!E339)","v":0},0,0,0]
[null,{"$f":"IF(E341=0,0,IMPRIMIR!A340)","v":0},{"$f":"IF(E341=0,0,IMPRIMIR!$D$3)","v":0},0,{"$f":"IMPRIMIR!B340","v":0},{"$f":"IMPRIMIR!C340","v":0},{"$f":"IF(E341=0,0,IMPRIMIR!D340)","v":0},{"$f":"IF(E341=0,0,IMPRIMIR!E340)","v":0},0,0,0]
[null,{"$f":"IF(E342=0,0,IMPRIMIR!A341)","v":0},{"$f":"IF(E342=0,0,IMPRIMIR!$D$3)","v":0},0,{"$f":"IMPRIMIR!B341","v":0},{"$f":"IMPRIMIR!C341","v":0},{"$f":"IF(E342=0,0,IMPRIMIR!D341)","v":0},{"$f":"IF(E342=0,0,IMPRIMIR!E341)","v":0},0,0,0]
[null,{"$f":"IF(E343=0,0,IMPRIMIR!A342)","v":0},{"$f":"IF(E343=0,0,IMPRIMIR!$D$3)","v":0},0,{"$f":"IMPRIMIR!B342","v":0},{"$f":"IMPRIMIR!C342","v":0},{"$f":"IF(E343=0,0,IMPRIMIR!D342)","v":0},{"$f":"IF(E343=0,0,IMPRIMIR!E342)","v":0},0,0,0]
[null,{"$f":"IF(E344=0,0,IMPRIMIR!A343)","v":0},{"$f":"IF(E344=0,0,IMPRIMIR!$D$3)","v":0},0,{"$f":"IMPRIMIR!B343","v":0},{"$f":"IMPRIMIR!C343","v":0},{"$f":"IF(E344=0,0,IMPRIMIR!D343)","v":0},{"$f":"IF(E344=0,0,IMPRIMIR!E343)","v":0},0,0,0]
[null,{"$f":"IF(E345=0,0,IMPRIMIR!A344)","v":0},{"$f":"IF(E345=0,0,IMPRIMIR!$D$3)","v":0},0,{"$f":"IMPRIMIR!B344","v":0},{"$f":"IMPRIMIR!C344","v":0},{"$f":"IF(E345=0,0,IMPRIMIR!D344)","v":0},{"$f":"IF(E345=0,0,IMPRIMIR!E344)","v":0},0,0,0]
[null,{"$f":"IF(E346=0,0,IMPRIMIR!A345)","v":0},{"$f":"IF(E346=0,0,IMPRIMIR!$D$3)","v":0},0,{"$f":"IMPRIMIR!B345","v":0},{"$f":"IMPRIMIR!C345","v":0},{"$f":"IF(E346=0,0,IMPRIMIR!D345)","v":0},{"$f":"IF(E346=0,0,IMPRIMIR!E345)","v":0},0,0,0]
[null,{"$f":"IF(E347=0,0,IMPRIMIR!A346)","v":0},{"$f":"IF(E347=0,0,IMPRIMIR!$D$3)","v":0},0,{"$f":"IMPRIMIR!B346","v":0},{"$f":"IMPRIMIR!C346","v":0},{"$f":"IF(E347=0,0,IMPRIMIR!D346)","v":0},{"$f":"IF(E347=0,0,IMPRIMIR!E346)","v":0},0,0,0]
[null,{"$f":"IF(E348=0,0,IMPRIMIR!A347)","v":0},{"$f":"IF(E348=0,0,IMPRIMIR!$D$3)","v":0},0,{"$f":"IMPRIMIR!B347","v":0},{"$f":"IMPRIMIR!C347","v":0},{"$f":"IF(E348=0,0,IMPRIMIR!D347)","v":0},{"$f":"IF(E348=0,0,IMPRIMIR!E347)","v":0},0,0,0]
[null,{"$f":"IF(E349=0,0,IMPRIMIR!A348)","v":0},{"$f":"IF(E349=0,0,IMPRIMIR!$D$3)","v":0},0,{"$f":"IMPRIMIR!B348","v":0},{"$f":"IMPRIMIR!C348","v":0},{"$f":"IF(E349=0,0,IMPRIMIR!D348)","v":0},{"$f":"IF(E349=0,0,IMPRIMIR!E348)","v":0},0,0,0]
[null,{"$f":"IF(E350=0,0,IMPRIMIR!A349)","v":0},{"$f":"IF(E350=0,0,IMPRIMIR!$D$3)","v":0},0,{"$f":"IMPRIMIR!B349","v":0},{"$f":"IMPRIMIR!C349","v":0},{"$f":"IF(E350=0,0,IMPRIMIR!D349)","v":0},{"$f":"IF(E350=0,0,IMPRIMIR!E349)","v":0},0,0,0]
[null,{"$f":"IF(E351=0,0,IMPRIMIR!A350)","v":0},{"$f":"IF(E351=0,0,IMPRIMIR!$D$3)","v":0},0,{"$f":"IMPRIMIR!B350","v":0},{"$f":"IMPRIMIR!C350","v":0},{"$f":"IF(E351=0,0,IMPRIMIR!D350)","v":0},{"$f":"IF(E351=0,0,IMPRIMIR!E350)","v":0},0,0,0]
[null,{"$f":"IF(E352=0,0,IMPRIMIR!A351)","v":0},{"$f":"IF(E352=0,0,IMPRIMIR!$D$3)","v":0},0,{"$f":"IMPRIMIR!B351","v":0},{"$f":"IMPRIMIR!C351","v":0},{"$f":"IF(E352=0,0,IMPRIMIR!D351)","v":0},{"$f":"IF(E352=0,0,IMPRIMIR!E351)","v":0},0,0,0]
[null,{"$f":"IF(E353=0,0,IMPRIMIR!A352)","v":0},{"$f":"IF(E353=0,0,IMPRIMIR!$D$3)","v":0},0,{"$f":"IMPRIMIR!B352","v":0},{"$f":"IMPRIMIR!C352","v":0},{"$f":"IF(E353=0,0,IMPRIMIR!D352)","v":0},{"$f":"IF(E353=0,0,IMPRIMIR!E352)","v":0},0,0,0]
[null,{"$f":"IF(E354=0,0,IMPRIMIR!A353)","v":0},{"$f":"IF(E354=0,0,IMPRIMIR!$D$3)","v":0},0,{"$f":"IMPRIMIR!B353","v":0},{"$f":"IMPRIMIR!C353","v":0},{"$f":"IF(E354=0,0,IMPRIMIR!D353)","v":0},{"$f":"IF(E354=0,0,IMPRIMIR!E353)","v":0},0,0,0]
[null,{"$f":"IF(E355=0,0,IMPRIMIR!A354)","v":0},{"$f":"IF(E355=0,0,IMPRIMIR!$D$3)","v":0},0,{"$f":"IMPRIMIR!B354","v":0},{"$f":"IMPRIMIR!C354","v":0},{"$f":"IF(E355=0,0,IMPRIMIR!D354)","v":0},{"$f":"IF(E355=0,0,IMPRIMIR!E354)","v":0},0,0,0]
[null,{"$f":"IF(E356=0,0,IMPRIMIR!A355)","v":0},{"$f":"IF(E356=0,0,IMPRIMIR!$D$3)","v":0},0,{"$f":"IMPRIMIR!B355","v":0},{"$f":"IMPRIMIR!C355","v":0},{"$f":"IF(E356=0,0,IMPRIMIR!D355)","v":0},{"$f":"IF(E356=0,0,IMPRIMIR!E355)","v":0},0,0,0]
[null,{"$f":"IF(E357=0,0,IMPRIMIR!A356)","v":0},{"$f":"IF(E357=0,0,IMPRIMIR!$D$3)","v":0},0,{"$f":"IMPRIMIR!B356","v":0},{"$f":"IMPRIMIR!C356","v":0},{"$f":"IF(E357=0,0,IMPRIMIR!D356)","v":0},{"$f":"IF(E357=0,0,IMPRIMIR!E356)","v":0},0,0,0]
[null,{"$f":"IF(E358=0,0,IMPRIMIR!A357)","v":0},{"$f":"IF(E358=0,0,IMPRIMIR!$D$3)","v":0},0,{"$f":"IMPRIMIR!B357","v":0},{"$f":"IMPRIMIR!C357","v":0},{"$f":"IF(E358=0,0,IMPRIMIR!D357)","v":0},{"$f":"IF(E358=0,0,IMPRIMIR!E357)","v":0},0,0,0]
[null,{"$f":"IF(E359=0,0,IMPRIMIR!A358)","v":0},{"$f":"IF(E359=0,0,IMPRIMIR!$D$3)","v":0},0,{"$f":"IMPRIMIR!B358","v":0},{"$f":"IMPRIMIR!C358","v":0},{"$f":"IF(E359=0,0,IMPRIMIR!D358)","v":0},{"$f":"IF(E359=0,0,IMPRIMIR!E358)","v":0},0,0,0]
[null,{"$f":"IF(E360=0,0,IMPRIMIR!A359)","v":0},{"$f":"IF(E360=0,0,IMPRIMIR!$D$3)","v":0},0,{"$f":"IMPRIMIR!B359","v":0},{"$f":"IMPRIMIR!C359","v":0},{"$f":"IF(E360=0,0,IMPRIMIR!D359)","v":0},{"$f":"IF(E360=0,0,IMPRIMIR!E359)","v":0},0,0,0]
[null,{"$f":"IF(E361=0,0,IMPRIMIR!A360)","v":0},{"$f":"IF(E361=0,0,IMPRIMIR!$D$3)","v":0},0,{"$f":"IMPRIMIR!B360","v":0},{"$f":"IMPRIMIR!C360","v":0},{"$f":"IF(E361=0,0,IMPRIMIR!D360)","v":0},{"$f":"IF(E361=0,0,IMPRIMIR!E360)","v":0},0,0,0]
[null,{"$f":"IF(E362=0,0,IMPRIMIR!A361)","v":0},{"$f":"IF(E362=0,0,IMPRIMIR!$D$3)","v":0},0,{"$f":"IMPRIMIR!B361","v":0},{"$f":"IMPRIMIR!C361","v":0},{"$f":"IF(E362=0,0,IMPRIMIR!D361)","v":0},{"$f":"IF(E362=0,0,IMPRIMIR!E361)","v":0},0,0,0]
[null,{"$f":"IF(E363=0,0,IMPRIMIR!A362)","v":0},{"$f":"IF(E363=0,0,IMPRIMIR!$D$3)","v":0},0,{"$f":"IMPRIMIR!B362","v":0},{"$f":"IMPRIMIR!C362","v":0},{"$f":"IF(E363=0,0,IMPRIMIR!D362)","v":0},{"$f":"IF(E363=0,0,IMPRIMIR!E362)","v":0},0,0,0]
[null,{"$f":"IF(E364=0,0,IMPRIMIR!A363)","v":0},{"$f":"IF(E364=0,0,IMPRIMIR!$D$3)","v":0},0,{"$f":"IMPRIMIR!B363","v":0},{"$f":"IMPRIMIR!C363","v":0},{"$f":"IF(E364=0,0,IMPRIMIR!D363)","v":0},{"$f":"IF(E364=0,0,IMPRIMIR!E363)","v":0},0,0,0]
[null,{"$f":"IF(E365=0,0,IMPRIMIR!A364)","v":0},{"$f":"IF(E365=0,0,IMPRIMIR!$D$3)","v":0},0,{"$f":"IMPRIMIR!B364","v":0},{"$f":"IMPRIMIR!C364","v":0},{"$f":"IF(E365=0,0,IMPRIMIR!D364)","v":0},{"$f":"IF(E365=0,0,IMPRIMIR!E364)","v":0},0,0,0]
[null,{"$f":"IF(E366=0,0,IMPRIMIR!A365)","v":0},{"$f":"IF(E366=0,0,IMPRIMIR!$D$3)","v":0},0,{"$f":"IMPRIMIR!B365","v":0},{"$f":"IMPRIMIR!C365","v":0},{"$f":"IF(E366=0,0,IMPRIMIR!D365)","v":0},{"$f":"IF(E366=0,0,IMPRIMIR!E365)","v":0},0,0,0]
[null,{"$f":"IF(E367=0,0,IMPRIMIR!A366)","v":0},{"$f":"IF(E367=0,0,IMPRIMIR!$D$3)","v":0},0,{"$f":"IMPRIMIR!B366","v":0},{"$f":"IMPRIMIR!C366","v":0},{"$f":"IF(E367=0,0,IMPRIMIR!D366)","v":0},{"$f":"IF(E367=0,0,IMPRIMIR!E366)","v":0},0,0,0]
[null,{"$f":"IF(E368=0,0,IMPRIMIR!A367)","v":0},{"$f":"IF(E368=0,0,IMPRIMIR!$D$3)","v":0},0,{"$f":"IMPRIMIR!B367","v":0},{"$f":"IMPRIMIR!C367","v":0},{"$f":"IF(E368=0,0,IMPRIMIR!D367)","v":0},{"$f":"IF(E368=0,0,IMPRIMIR!E367)","v":0},0,0,0]
[null,{"$f":"IF(E369=0,0,IMPRIMIR!A368)","v":0},{"$f":"IF(E369=0,0,IMPRIMIR!$D$3)","v":0},0,{"$f":"IMPRIMIR!B368","v":0},{"$f":"IMPRIMIR!C368","v":0},{"$f":"IF(E369=0,0,IMPRIMIR!D368)","v":0},{"$f":"IF(E369=0,0,IMPRIMIR!E368)","v":0},0,0,0]
[null,{"$f":"IF(E370=0,0,IMPRIMIR!A369)","v":0},{"$f":"IF(E370=0,0,IMPRIMIR!$D$3)","v":0},0,{"$f":"IMPRIMIR!B369","v":0},{"$f":"IMPRIMIR!C369","v":0},{"$f":"IF(E370=0,0,IMPRIMIR!D369)","v":0},{"$f":"IF(E370=0,0,IMPRIMIR!E369)","v":0},0,0,0]
[null,{"$f":"IF(E371=0,0,IMPRIMIR!A370)","v":0},{"$f":"IF(E371=0,0,IMPRIMIR!$D$3)","v":0},0,{"$f":"IMPRIMIR!B370","v":0},{"$f":"IMPRIMIR!C370","v":0},{"$f":"IF(E371=0,0,IMPRIMIR!D370)","v":0},{"$f":"IF(E371=0,0,IMPRIMIR!E370)","v":0},0,0,0]
[null,{"$f":"IF(E372=0,0,IMPRIMIR!A371)","v":0},{"$f":"IF(E372=0,0,IMPRIMIR!$D$3)","v":0},0,{"$f":"IMPRIMIR!B371","v":0},{"$f":"IMPRIMIR!C371","v":0},{"$f":"IF(E372=0,0,IMPRIMIR!D371)","v":0},{"$f":"IF(E372=0,0,IMPRIMIR!E371)","v":0},0,0,0]
[null,{"$f":"IF(E373=0,0,IMPRIMIR!A372)","v":0},{"$f":"IF(E373=0,0,IMPRIMIR!$D$3)","v":0},{"$f":"IF(E373=\"0\",0,$G$2)","v":0},{"$f":"IMPRIMIR!B372","v":0},{"$f":"IMPRIMIR!C372","v":0},{"$f":"IF(E373=0,0,IMPRIMIR!D372)","v":0},{"$f":"IF(E373=0,0,IMPRIMIR!E372)","v":0},{"$f":"IF(E373=0,0,$G$2)","v":0},{"$f":"IF(E373=0,0,$G$4)","v":0},{"$f":"IF(E373=0,0,$G$3)","v":0}]
[null,{"$f":"IF(E374=0,0,IMPRIMIR!A373)","v":0},{"$f":"IF(E374=0,0,IMPRIMIR!$D$3)","v":0},0,{"$f":"IMPRIMIR!B373","v":0},{"$f":"IMPRIMIR!C373","v":0},{"$f":"IF(E374=0,0,IMPRIMIR!D373)","v":0},{"$f":"IF(E374=0,0,IMPRIMIR!E373)","v":0},0,0,0]
[null,{"$f":"IF(E375=0,0,IMPRIMIR!A374)","v":0},{"$f":"IF(E375=0,0,IMPRIMIR!$D$3)","v":0},0,{"$f":"IMPRIMIR!B374","v":0},{"$f":"IMPRIMIR!C374","v":0},{"$f":"IF(E375=0,0,IMPRIMIR!D374)","v":0},{"$f":"IF(E375=0,0,IMPRIMIR!E374)","v":0},0,0,0]
[null,{"$f":"IF(E376=0,0,IMPRIMIR!A375)","v":0},{"$f":"IF(E376=0,0,IMPRIMIR!$D$3)","v":0},0,{"$f":"IMPRIMIR!B375","v":0},{"$f":"IMPRIMIR!C375","v":0},{"$f":"IF(E376=0,0,IMPRIMIR!D375)","v":0},{"$f":"IF(E376=0,0,IMPRIMIR!E375)","v":0},0,0,0]
[null,{"$f":"IF(E377=0,0,IMPRIMIR!A376)","v":0},{"$f":"IF(E377=0,0,IMPRIMIR!$D$3)","v":0},0,{"$f":"IMPRIMIR!B376","v":0},{"$f":"IMPRIMIR!C376","v":0},{"$f":"IF(E377=0,0,IMPRIMIR!D376)","v":0},{"$f":"IF(E377=0,0,IMPRIMIR!E376)","v":0},0,0,0]
[null,{"$f":"IF(E378=0,0,IMPRIMIR!A377)","v":0},{"$f":"IF(E378=0,0,IMPRIMIR!$D$3)","v":0},0,{"$f":"IMPRIMIR!B377","v":0},{"$f":"IMPRIMIR!C377","v":0},{"$f":"IF(E378=0,0,IMPRIMIR!D377)","v":0},{"$f":"IF(E378=0,0,IMPRIMIR!E377)","v":0},0,0,0]
[null,{"$f":"IF(E379=0,0,IMPRIMIR!A378)","v":0},{"$f":"IF(E379=0,0,IMPRIMIR!$D$3)","v":0},0,{"$f":"IMPRIMIR!B378","v":0},{"$f":"IMPRIMIR!C378","v":0},{"$f":"IF(E379=0,0,IMPRIMIR!D378)","v":0},{"$f":"IF(E379=0,0,IMPRIMIR!E378)","v":0},0,0,0]
[null,{"$f":"IF(E380=0,0,IMPRIMIR!A379)","v":0},{"$f":"IF(E380=0,0,IMPRIMIR!$D$3)","v":0},0,{"$f":"IMPRIMIR!B379","v":0},{"$f":"IMPRIMIR!C379","v":0},{"$f":"IF(E380=0,0,IMPRIMIR!D379)","v":0},{"$f":"IF(E380=0,0,IMPRIMIR!E379)","v":0},0,0,0]
[null,{"$f":"IF(E381=0,0,IMPRIMIR!A380)","v":0},{"$f":"IF(E381=0,0,IMPRIMIR!$D$3)","v":0},0,{"$f":"IMPRIMIR!B380","v":0},{"$f":"IMPRIMIR!C380","v":0},{"$f":"IF(E381=0,0,IMPRIMIR!D380)","v":0},{"$f":"IF(E381=0,0,IMPRIMIR!E380)","v":0},0,0,0]
[null,{"$f":"IF(E382=0,0,IMPRIMIR!A381)","v":0},{"$f":"IF(E382=0,0,IMPRIMIR!$D$3)","v":0},0,{"$f":"IMPRIMIR!B381","v":0},{"$f":"IMPRIMIR!C381","v":0},{"$f":"IF(E382=0,0,IMPRIMIR!D381)","v":0},{"$f":"IF(E382=0,0,IMPRIMIR!E381)","v":0},0,0,0]
[null,{"$f":"IF(E383=0,0,IMPRIMIR!A382)","v":0},{"$f":"IF(E383=0,0,IMPRIMIR!$D$3)","v":0},0,{"$f":"IMPRIMIR!B382","v":0},{"$f":"IMPRIMIR!C382","v":0},{"$f":"IF(E383=0,0,IMPRIMIR!D382)","v":0},{"$f":"IF(E383=0,0,IMPRIMIR!E382)","v":0},0,0,0]
[null,{"$f":"IF(E384=0,0,IMPRIMIR!A383)","v":0},{"$f":"IF(E384=0,0,IMPRIMIR!$D$3)","v":0},0,{"$f":"IMPRIMIR!B383","v":0},{"$f":"IMPRIMIR!C383","v":0},{"$f":"IF(E384=0,0,IMPRIMIR!D383)","v":0},{"$f":"IF(E384=0,0,IMPRIMIR!E383)","v":0},0,0,0]
[null,{"$f":"IF(E385=0,0,IMPRIMIR!A384)","v":0},{"$f":"IF(E385=0,0,IMPRIMIR!$D$3)","v":0},0,{"$f":"IMPRIMIR!B384","v":0},{"$f":"IMPRIMIR!C384","v":0},{"$f":"IF(E385=0,0,IMPRIMIR!D384)","v":0},{"$f":"IF(E385=0,0,IMPRIMIR!E384)","v":0},0,0,0]
[null,{"$f":"IF(E386=0,0,IMPRIMIR!A385)","v":0},{"$f":"IF(E386=0,0,IMPRIMIR!$D$3)","v":0},0,{"$f":"IMPRIMIR!B385","v":0},{"$f":"IMPRIMIR!C385","v":0},{"$f":"IF(E386=0,0,IMPRIMIR!D385)","v":0},{"$f":"IF(E386=0,0,IMPRIMIR!E385)","v":0},0,0,0]
[null,{"$f":"IF(E387=0,0,IMPRIMIR!A386)","v":0},{"$f":"IF(E387=0,0,IMPRIMIR!$D$3)","v":0},0,{"$f":"IMPRIMIR!B386","v":0},{"$f":"IMPRIMIR!C386","v":0},{"$f":"IF(E387=0,0,IMPRIMIR!D386)","v":0},{"$f":"IF(E387=0,0,IMPRIMIR!E386)","v":0},0,0,0]
[null,{"$f":"IF(E388=0,0,IMPRIMIR!A387)","v":0},{"$f":"IF(E388=0,0,IMPRIMIR!$D$3)","v":0},0,{"$f":"IMPRIMIR!B387","v":0},{"$f":"IMPRIMIR!C387","v":0},{"$f":"IF(E388=0,0,IMPRIMIR!D387)","v":0},{"$f":"IF(E388=0,0,IMPRIMIR!E387)","v":0},0,0,0]
[null,{"$f":"IF(E389=0,0,IMPRIMIR!A388)","v":0},{"$f":"IF(E389=0,0,IMPRIMIR!$D$3)","v":0},0,{"$f":"IMPRIMIR!B388","v":0},{"$f":"IMPRIMIR!C388","v":0},{"$f":"IF(E389=0,0,IMPRIMIR!D388)","v":0},{"$f":"IF(E389=0,0,IMPRIMIR!E388)","v":0},0,0,0]
[null,{"$f":"IF(E390=0,0,IMPRIMIR!A389)","v":0},{"$f":"IF(E390=0,0,IMPRIMIR!$D$3)","v":0},0,{"$f":"IMPRIMIR!B389","v":0},{"$f":"IMPRIMIR!C389","v":0},{"$f":"IF(E390=0,0,IMPRIMIR!D389)","v":0},{"$f":"IF(E390=0,0,IMPRIMIR!E389)","v":0},0,0,0]
[null,{"$f":"IF(E391=0,0,IMPRIMIR!A390)","v":0},{"$f":"IF(E391=0,0,IMPRIMIR!$D$3)","v":0},0,{"$f":"IMPRIMIR!B390","v":0},{"$f":"IMPRIMIR!C390","v":0},{"$f":"IF(E391=0,0,IMPRIMIR!D390)","v":0},{"$f":"IF(E391=0,0,IMPRIMIR!E390)","v":0},0,0,0]
[null,{"$f":"IF(E392=0,0,IMPRIMIR!A391)","v":0},{"$f":"IF(E392=0,0,IMPRIMIR!$D$3)","v":0},0,{"$f":"IMPRIMIR!B391","v":0},{"$f":"IMPRIMIR!C391","v":0},{"$f":"IF(E392=0,0,IMPRIMIR!D391)","v":0},{"$f":"IF(E392=0,0,IMPRIMIR!E391)","v":0},0,0,0]
[null,{"$f":"IF(E393=0,0,IMPRIMIR!A392)","v":0},{"$f":"IF(E393=0,0,IMPRIMIR!$D$3)","v":0},0,{"$f":"IMPRIMIR!B392","v":0},{"$f":"IMPRIMIR!C392","v":0},{"$f":"IF(E393=0,0,IMPRIMIR!D392)","v":0},{"$f":"IF(E393=0,0,IMPRIMIR!E392)","v":0},0,0,0]
[null,{"$f":"IF(E394=0,0,IMPRIMIR!A393)","v":0},{"$f":"IF(E394=0,0,IMPRIMIR!$D$3)","v":0},0,{"$f":"IMPRIMIR!B393","v":0},{"$f":"IMPRIMIR!C393","v":0},{"$f":"IF(E394=0,0,IMPRIMIR!D393)","v":0},{"$f":"IF(E394=0,0,IMPRIMIR!E393)","v":0},0,0,0]
[null,{"$f":"IF(E395=0,0,IMPRIMIR!A394)","v":0},{"$f":"IF(E395=0,0,IMPRIMIR!$D$3)","v":0},0,{"$f":"IMPRIMIR!B394","v":0},{"$f":"IMPRIMIR!C394","v":0},{"$f":"IF(E395=0,0,IMPRIMIR!D394)","v":0},{"$f":"IF(E395=0,0,IMPRIMIR!E394)","v":0},0,0,0]
[null,{"$f":"IF(E396=0,0,IMPRIMIR!A395)","v":0},{"$f":"IF(E396=0,0,IMPRIMIR!$D$3)","v":0},0,{"$f":"IMPRIMIR!B395","v":0},{"$f":"IMPRIMIR!C395","v":0},{"$f":"IF(E396=0,0,IMPRIMIR!D395)","v":0},{"$f":"IF(E396=0,0,IMPRIMIR!E395)","v":0},0,0,0]
[null,{"$f":"IF(E397=0,0,IMPRIMIR!A396)","v":0},{"$f":"IF(E397=0,0,IMPRIMIR!$D$3)","v":0},0,{"$f":"IMPRIMIR!B396","v":0},{"$f":"IMPRIMIR!C396","v":0},{"$f":"IF(E397=0,0,IMPRIMIR!D396)","v":0},{"$f":"IF(E397=0,0,IMPRIMIR!E396)","v":0},0,0,0]
[null,{"$f":"IF(E398=0,0,IMPRIMIR!A397)","v":0},{"$f":"IF(E398=0,0,IMPRIMIR!$D$3)","v":0},0,{"$f":"IMPRIMIR!B397","v":0},{"$f":"IMPRIMIR!C397","v":0},{"$f":"IF(E398=0,0,IMPRIMIR!D397)","v":0},{"$f":"IF(E398=0,0,IMPRIMIR!E397)","v":0},0,0,0]
[null,{"$f":"IF(E399=0,0,IMPRIMIR!A398)","v":0},{"$f":"IF(E399=0,0,IMPRIMIR!$D$3)","v":0},0,{"$f":"IMPRIMIR!B398","v":0},{"$f":"IMPRIMIR!C398","v":0},{"$f":"IF(E399=0,0,IMPRIMIR!D398)","v":0},{"$f":"IF(E399=0,0,IMPRIMIR!E398)","v":0},0,0,0]
[null,{"$f":"IF(E400=0,0,IMPRIMIR!A399)","v":0},{"$f":"IF(E400=0,0,IMPRIMIR!$D$3)","v":0},0,{"$f":"IMPRIMIR!B399","v":0},{"$f":"IMPRIMIR!C399","v":0},{"$f":"IF(E400=0,0,IMPRIMIR!D399)","v":0},{"$f":"IF(E400=0,0,IMPRIMIR!E399)","v":0},0,0,0]
[null,{"$f":"IF(E401=0,0,IMPRIMIR!A400)","v":0},{"$f":"IF(E401=0,0,IMPRIMIR!$D$3)","v":0},0,{"$f":"IMPRIMIR!B400","v":0},{"$f":"IMPRIMIR!C400","v":0},{"$f":"IF(E401=0,0,IMPRIMIR!D400)","v":0},{"$f":"IF(E401=0,0,IMPRIMIR!E400)","v":0},0,0,0]
[null,{"$f":"IF(E402=0,0,IMPRIMIR!A401)","v":0},{"$f":"IF(E402=0,0,IMPRIMIR!$D$3)","v":0},0,{"$f":"IMPRIMIR!B401","v":0},{"$f":"IMPRIMIR!C401","v":0},{"$f":"IF(E402=0,0,IMPRIMIR!D401)","v":0},{"$f":"IF(E402=0,0,IMPRIMIR!E401)","v":0},0,0,0]
[null,{"$f":"IF(E403=0,0,IMPRIMIR!A402)","v":0},{"$f":"IF(E403=0,0,IMPRIMIR!$D$3)","v":0},0,{"$f":"IMPRIMIR!B402","v":0},{"$f":"IMPRIMIR!C402","v":0},{"$f":"IF(E403=0,0,IMPRIMIR!D402)","v":0},{"$f":"IF(E403=0,0,IMPRIMIR!E402)","v":0},0,0,0]
[null,{"$f":"IF(E404=0,0,IMPRIMIR!A403)","v":0},{"$f":"IF(E404=0,0,IMPRIMIR!$D$3)","v":0},0,{"$f":"IMPRIMIR!B403","v":0},{"$f":"IMPRIMIR!C403","v":0},{"$f":"IF(E404=0,0,IMPRIMIR!D403)","v":0},{"$f":"IF(E404=0,0,IMPRIMIR!E403)","v":0},0,0,0]
[null,{"$f":"IF(E405=0,0,IMPRIMIR!A404)","v":0},{"$f":"IF(E405=0,0,IMPRIMIR!$D$3)","v":0},0,{"$f":"IMPRIMIR!B404","v":0},{"$f":"IMPRIMIR!C404","v":0},{"$f":"IF(E405=0,0,IMPRIMIR!D404)","v":0},{"$f":"IF(E405=0,0,IMPRIMIR!E404)","v":0},0,0,0]
[null,{"$f":"IF(E406=0,0,IMPRIMIR!A405)","v":0},{"$f":"IF(E406=0,0,IMPRIMIR!$D$3)","v":0},0,{"$f":"IMPRIMIR!B405","v":0},{"$f":"IMPRIMIR!C405","v":0},{"$f":"IF(E406=0,0,IMPRIMIR!D405)","v":0},{"$f":"IF(E406=0,0,IMPRIMIR!E405)","v":0},0,0,0]
[null,{"$f":"IF(E407=0,0,IMPRIMIR!A406)","v":0},{"$f":"IF(E407=0,0,IMPRIMIR!$D$3)","v":0},0,{"$f":"IMPRIMIR!B406","v":0},{"$f":"IMPRIMIR!C406","v":0},{"$f":"IF(E407=0,0,IMPRIMIR!D406)","v":0},{"$f":"IF(E407=0,0,IMPRIMIR!E406)","v":0},0,0,0]
[null,{"$f":"IF(E408=0,0,IMPRIMIR!A407)","v":0},{"$f":"IF(E408=0,0,IMPRIMIR!$D$3)","v":0},0,{"$f":"IMPRIMIR!B407","v":0},{"$f":"IMPRIMIR!C407","v":0},{"$f":"IF(E408=0,0,IMPRIMIR!D407)","v":0},{"$f":"IF(E408=0,0,IMPRIMIR!E407)","v":0},0,0,0]
[null,{"$f":"IF(E409=0,0,IMPRIMIR!A408)","v":0},{"$f":"IF(E409=0,0,IMPRIMIR!$D$3)","v":0},0,{"$f":"IMPRIMIR!B408","v":0},{"$f":"IMPRIMIR!C408","v":0},{"$f":"IF(E409=0,0,IMPRIMIR!D408)","v":0},{"$f":"IF(E409=0,0,IMPRIMIR!E408)","v":0},0,0,0]
[null,{"$f":"IF(E410=0,0,IMPRIMIR!A409)","v":0},{"$f":"IF(E410=0,0,IMPRIMIR!$D$3)","v":0},0,{"$f":"IMPRIMIR!B409","v":0},{"$f":"IMPRIMIR!C409","v":0},{"$f":"IF(E410=0,0,IMPRIMIR!D409)","v":0},{"$f":"IF(E410=0,0,IMPRIMIR!E409)","v":0},0,0,0]
[null,{"$f":"IF(E411=0,0,IMPRIMIR!A410)","v":0},{"$f":"IF(E411=0,0,IMPRIMIR!$D$3)","v":0},0,{"$f":"IMPRIMIR!B410","v":0},{"$f":"IMPRIMIR!C410","v":0},{"$f":"IF(E411=0,0,IMPRIMIR!D410)","v":0},{"$f":"IF(E411=0,0,IMPRIMIR!E410)","v":0},0,0,0]
[null,{"$f":"IF(E412=0,0,IMPRIMIR!A411)","v":0},{"$f":"IF(E412=0,0,IMPRIMIR!$D$3)","v":0},0,{"$f":"IMPRIMIR!B411","v":0},{"$f":"IMPRIMIR!C411","v":0},{"$f":"IF(E412=0,0,IMPRIMIR!D411)","v":0},{"$f":"IF(E412=0,0,IMPRIMIR!E411)","v":0},0,0,0]
[null,{"$f":"IF(E413=0,0,IMPRIMIR!A412)","v":0},{"$f":"IF(E413=0,0,IMPRIMIR!$D$3)","v":0},0,{"$f":"IMPRIMIR!B412","v":0},{"$f":"IMPRIMIR!C412","v":0},{"$f":"IF(E413=0,0,IMPRIMIR!D412)","v":0},{"$f":"IF(E413=0,0,IMPRIMIR!E412)","v":0},0,0,0]
[null,{"$f":"IF(E414=0,0,IMPRIMIR!A413)","v":0},{"$f":"IF(E414=0,0,IMPRIMIR!$D$3)","v":0},0,{"$f":"IMPRIMIR!B413","v":0},{"$f":"IMPRIMIR!C413","v":0},{"$f":"IF(E414=0,0,IMPRIMIR!D413)","v":0},{"$f":"IF(E414=0,0,IMPRIMIR!E413)","v":0},0,0,0]
[null,{"$f":"IF(E415=0,0,IMPRIMIR!A414)","v":0},{"$f":"IF(E415=0,0,IMPRIMIR!$D$3)","v":0},0,{"$f":"IMPRIMIR!B414","v":0},{"$f":"IMPRIMIR!C414","v":0},{"$f":"IF(E415=0,0,IMPRIMIR!D414)","v":0},{"$f":"IF(E415=0,0,IMPRIMIR!E414)","v":0},0,0,0]
[null,{"$f":"IF(E416=0,0,IMPRIMIR!A415)","v":0},{"$f":"IF(E416=0,0,IMPRIMIR!$D$3)","v":0},0,{"$f":"IMPRIMIR!B415","v":0},{"$f":"IMPRIMIR!C415","v":0},{"$f":"IF(E416=0,0,IMPRIMIR!D415)","v":0},{"$f":"IF(E416=0,0,IMPRIMIR!E415)","v":0},0,0,0]
[null,{"$f":"IF(E417=0,0,IMPRIMIR!A416)","v":0},{"$f":"IF(E417=0,0,IMPRIMIR!$D$3)","v":0},0,{"$f":"IMPRIMIR!B416","v":0},{"$f":"IMPRIMIR!C416","v":0},{"$f":"IF(E417=0,0,IMPRIMIR!D416)","v":0},{"$f":"IF(E417=0,0,IMPRIMIR!E416)","v":0},0,0,0]
[null,{"$f":"IF(E418=0,0,IMPRIMIR!A417)","v":0},{"$f":"IF(E418=0,0,IMPRIMIR!$D$3)","v":0},0,{"$f":"IMPRIMIR!B417","v":0},{"$f":"IMPRIMIR!C417","v":0},{"$f":"IF(E418=0,0,IMPRIMIR!D417)","v":0},{"$f":"IF(E418=0,0,IMPRIMIR!E417)","v":0},0,0,0]
[null,{"$f":"IF(E419=0,0,IMPRIMIR!A418)","v":0},{"$f":"IF(E419=0,0,IMPRIMIR!$D$3)","v":0},0,{"$f":"IMPRIMIR!B418","v":0},{"$f":"IMPRIMIR!C418","v":0},{"$f":"IF(E419=0,0,IMPRIMIR!D418)","v":0},{"$f":"IF(E419=0,0,IMPRIMIR!E418)","v":0},0,0,0]
[null,{"$f":"IF(E420=0,0,IMPRIMIR!A419)","v":0},{"$f":"IF(E420=0,0,IMPRIMIR!$D$3)","v":0},0,{"$f":"IMPRIMIR!B419","v":0},{"$f":"IMPRIMIR!C419","v":0},{"$f":"IF(E420=0,0,IMPRIMIR!D419)","v":0},{"$f":"IF(E420=0,0,IMPRIMIR!E419)","v":0},0,0,0]
[null,{"$f":"IF(E421=0,0,IMPRIMIR!A420)","v":0},{"$f":"IF(E421=0,0,IMPRIMIR!$D$3)","v":0},0,{"$f":"IMPRIMIR!B420","v":0},{"$f":"IMPRIMIR!C420","v":0},{"$f":"IF(E421=0,0,IMPRIMIR!D420)","v":0},{"$f":"IF(E421=0,0,IMPRIMIR!E420)","v":0},0,0,0]
[null,{"$f":"IF(E422=0,0,IMPRIMIR!A421)","v":0},{"$f":"IF(E422=0,0,IMPRIMIR!$D$3)","v":0},0,{"$f":"IMPRIMIR!B421","v":0},{"$f":"IMPRIMIR!C421","v":0},{"$f":"IF(E422=0,0,IMPRIMIR!D421)","v":0},{"$f":"IF(E422=0,0,IMPRIMIR!E421)","v":0},0,0,0]
[null,{"$f":"IF(E423=0,0,IMPRIMIR!A422)","v":0},{"$f":"IF(E423=0,0,IMPRIMIR!$D$3)","v":0},0,{"$f":"IMPRIMIR!B422","v":0},{"$f":"IMPRIMIR!C422","v":0},{"$f":"IF(E423=0,0,IMPRIMIR!D422)","v":0},{"$f":"IF(E423=0,0,IMPRIMIR!E422)","v":0},0,0,0]
[null,{"$f":"IF(E424=0,0,IMPRIMIR!A423)","v":0},{"$f":"IF(E424=0,0,IMPRIMIR!$D$3)","v":0},0,{"$f":"IMPRIMIR!B423","v":0},{"$f":"IMPRIMIR!C423","v":0},{"$f":"IF(E424=0,0,IMPRIMIR!D423)","v":0},{"$f":"IF(E424=0,0,IMPRIMIR!E423)","v":0},0,0,0]
[null,{"$f":"IF(E425=0,0,IMPRIMIR!A424)","v":0},{"$f":"IF(E425=0,0,IMPRIMIR!$D$3)","v":0},0,{"$f":"IMPRIMIR!B424","v":0},{"$f":"IMPRIMIR!C424","v":0},{"$f":"IF(E425=0,0,IMPRIMIR!D424)","v":0},{"$f":"IF(E425=0,0,IMPRIMIR!E424)","v":0},0,0,0]
[null,{"$f":"IF(E426=0,0,IMPRIMIR!A425)","v":0},{"$f":"IF(E426=0,0,IMPRIMIR!$D$3)","v":0},0,{"$f":"IMPRIMIR!B425","v":0},{"$f":"IMPRIMIR!C425","v":0},{"$f":"IF(E426=0,0,IMPRIMIR!D425)","v":0},{"$f":"IF(E426=0,0,IMPRIMIR!E425)","v":0},0,0,0]
[null,{"$f":"IF(E427=0,0,IMPRIMIR!A426)","v":0},{"$f":"IF(E427=0,0,IMPRIMIR!$D$3)","v":0},0,{"$f":"IMPRIMIR!B426","v":0},{"$f":"IMPRIMIR!C426","v":0},{"$f":"IF(E427=0,0,IMPRIMIR!D426)","v":0},{"$f":"IF(E427=0,0,IMPRIMIR!E426)","v":0},0,0,0]
[null,{"$f":"IF(E428=0,0,IMPRIMIR!A427)","v":0},{"$f":"IF(E428=0,0,IMPRIMIR!$D$3)","v":0},0,{"$f":"IMPRIMIR!B427","v":0},{"$f":"IMPRIMIR!C427","v":0},{"$f":"IF(E428=0,0,IMPRIMIR!D427)","v":0},{"$f":"IF(E428=0,0,IMPRIMIR!E427)","v":0},0,0,0]
[null,{"$f":"IF(E429=0,0,IMPRIMIR!A428)","v":0},{"$f":"IF(E429=0,0,IMPRIMIR!$D$3)","v":0},0,{"$f":"IMPRIMIR!B428","v":0},{"$f":"IMPRIMIR!C428","v":0},{"$f":"IF(E429=0,0,IMPRIMIR!D428)","v":0},{"$f":"IF(E429=0,0,IMPRIMIR!E428)","v":0},0,0,0]
[null,{"$f":"IF(E430=0,0,IMPRIMIR!A429)","v":0},{"$f":"IF(E430=0,0,IMPRIMIR!$D$3)","v":0},0,{"$f":"IMPRIMIR!B429","v":0},{"$f":"IMPRIMIR!C429","v":0},{"$f":"IF(E430=0,0,IMPRIMIR!D429)","v":0},{"$f":"IF(E430=0,0,IMPRIMIR!E429)","v":0},0,0,0]
[null,{"$f":"IF(E431=0,0,IMPRIMIR!A430)","v":0},{"$f":"IF(E431=0,0,IMPRIMIR!$D$3)","v":0},0,{"$f":"IMPRIMIR!B430","v":0},{"$f":"IMPRIMIR!C430","v":0},{"$f":"IF(E431=0,0,IMPRIMIR!D430)","v":0},{"$f":"IF(E431=0,0,IMPRIMIR!E430)","v":0},0,0,0]
[null,{"$f":"IF(E432=0,0,IMPRIMIR!A431)","v":0},{"$f":"IF(E432=0,0,IMPRIMIR!$D$3)","v":0},0,{"$f":"IMPRIMIR!B431","v":0},{"$f":"IMPRIMIR!C431","v":0},{"$f":"IF(E432=0,0,IMPRIMIR!D431)","v":0},{"$f":"IF(E432=0,0,IMPRIMIR!E431)","v":0},0,0,0]
[null,{"$f":"IF(E433=0,0,IMPRIMIR!A432)","v":0},{"$f":"IF(E433=0,0,IMPRIMIR!$D$3)","v":0},0,{"$f":"IMPRIMIR!B432","v":0},{"$f":"IMPRIMIR!C432","v":0},{"$f":"IF(E433=0,0,IMPRIMIR!D432)","v":0},{"$f":"IF(E433=0,0,IMPRIMIR!E432)","v":0},0,0,0]
[null,{"$f":"IF(E434=0,0,IMPRIMIR!A433)","v":0},{"$f":"IF(E434=0,0,IMPRIMIR!$D$3)","v":0},0,{"$f":"IMPRIMIR!B433","v":0},{"$f":"IMPRIMIR!C433","v":0},{"$f":"IF(E434=0,0,IMPRIMIR!D433)","v":0},{"$f":"IF(E434=0,0,IMPRIMIR!E433)","v":0},0,0,0]
[null,{"$f":"IF(E435=0,0,IMPRIMIR!A434)","v":0},{"$f":"IF(E435=0,0,IMPRIMIR!$D$3)","v":0},0,{"$f":"IMPRIMIR!B434","v":0},{"$f":"IMPRIMIR!C434","v":0},{"$f":"IF(E435=0,0,IMPRIMIR!D434)","v":0},{"$f":"IF(E435=0,0,IMPRIMIR!E434)","v":0},0,0,0]
[null,{"$f":"IF(E436=0,0,IMPRIMIR!A435)","v":0},{"$f":"IF(E436=0,0,IMPRIMIR!$D$3)","v":0},0,{"$f":"IMPRIMIR!B435","v":0},{"$f":"IMPRIMIR!C435","v":0},{"$f":"IF(E436=0,0,IMPRIMIR!D435)","v":0},{"$f":"IF(E436=0,0,IMPRIMIR!E435)","v":0},0,0,0]
[null,{"$f":"IF(E437=0,0,IMPRIMIR!A436)","v":0},{"$f":"IF(E437=0,0,IMPRIMIR!$D$3)","v":0},{"$f":"IF(E437=\"0\",0,$G$2)","v":0},{"$f":"IMPRIMIR!B436","v":0},{"$f":"IMPRIMIR!C436","v":0},{"$f":"IF(E437=0,0,IMPRIMIR!D436)","v":0},{"$f":"IF(E437=0,0,IMPRIMIR!E436)","v":0},{"$f":"IF(E437=0,0,$G$2)","v":0},{"$f":"IF(E437=0,0,$G$4)","v":0},{"$f":"IF(E437=0,0,$G$3)","v":0}]
[null,{"$f":"IF(E438=0,0,IMPRIMIR!A437)","v":0},{"$f":"IF(E438=0,0,IMPRIMIR!$D$3)","v":0},0,{"$f":"IMPRIMIR!B437","v":0},{"$f":"IMPRIMIR!C437","v":0},{"$f":"IF(E438=0,0,IMPRIMIR!D437)","v":0},{"$f":"IF(E438=0,0,IMPRIMIR!E437)","v":0},0,0,0]
[null,{"$f":"IF(E439=0,0,IMPRIMIR!A438)","v":0},{"$f":"IF(E439=0,0,IMPRIMIR!$D$3)","v":0},0,{"$f":"IMPRIMIR!B438","v":0},{"$f":"IMPRIMIR!C438","v":0},{"$f":"IF(E439=0,0,IMPRIMIR!D438)","v":0},{"$f":"IF(E439=0,0,IMPRIMIR!E438)","v":0},0,0,0]
[null,{"$f":"IF(E440=0,0,IMPRIMIR!A439)","v":0},{"$f":"IF(E440=0,0,IMPRIMIR!$D$3)","v":0},0,{"$f":"IMPRIMIR!B439","v":0},{"$f":"IMPRIMIR!C439","v":0},{"$f":"IF(E440=0,0,IMPRIMIR!D439)","v":0},{"$f":"IF(E440=0,0,IMPRIMIR!E439)","v":0},0,0,0]
[null,{"$f":"IF(E441=0,0,IMPRIMIR!A440)","v":0},{"$f":"IF(E441=0,0,IMPRIMIR!$D$3)","v":0},0,{"$f":"IMPRIMIR!B440","v":0},{"$f":"IMPRIMIR!C440","v":0},{"$f":"IF(E441=0,0,IMPRIMIR!D440)","v":0},{"$f":"IF(E441=0,0,IMPRIMIR!E440)","v":0},0,0,0]
[null,{"$f":"IF(E442=0,0,IMPRIMIR!A441)","v":0},{"$f":"IF(E442=0,0,IMPRIMIR!$D$3)","v":0},0,{"$f":"IMPRIMIR!B441","v":0},{"$f":"IMPRIMIR!C441","v":0},{"$f":"IF(E442=0,0,IMPRIMIR!D441)","v":0},{"$f":"IF(E442=0,0,IMPRIMIR!E441)","v":0},0,0,0]
[null,{"$f":"IF(E443=0,0,IMPRIMIR!A442)","v":0},{"$f":"IF(E443=0,0,IMPRIMIR!$D$3)","v":0},0,{"$f":"IMPRIMIR!B442","v":0},{"$f":"IMPRIMIR!C442","v":0},{"$f":"IF(E443=0,0,IMPRIMIR!D442)","v":0},{"$f":"IF(E443=0,0,IMPRIMIR!E442)","v":0},0,0,0]
[null,{"$f":"IF(E444=0,0,IMPRIMIR!A443)","v":0},{"$f":"IF(E444=0,0,IMPRIMIR!$D$3)","v":0},0,{"$f":"IMPRIMIR!B443","v":0},{"$f":"IMPRIMIR!C443","v":0},{"$f":"IF(E444=0,0,IMPRIMIR!D443)","v":0},{"$f":"IF(E444=0,0,IMPRIMIR!E443)","v":0},0,0,0]
[null,{"$f":"IF(E445=0,0,IMPRIMIR!A444)","v":0},{"$f":"IF(E445=0,0,IMPRIMIR!$D$3)","v":0},0,{"$f":"IMPRIMIR!B444","v":0},{"$f":"IMPRIMIR!C444","v":0},{"$f":"IF(E445=0,0,IMPRIMIR!D444)","v":0},{"$f":"IF(E445=0,0,IMPRIMIR!E444)","v":0},0,0,0]
[null,{"$f":"IF(E446=0,0,IMPRIMIR!A445)","v":0},{"$f":"IF(E446=0,0,IMPRIMIR!$D$3)","v":0},0,{"$f":"IMPRIMIR!B445","v":0},{"$f":"IMPRIMIR!C445","v":0},{"$f":"IF(E446=0,0,IMPRIMIR!D445)","v":0},{"$f":"IF(E446=0,0,IMPRIMIR!E445)","v":0},0,0,0]
[null,{"$f":"IF(E447=0,0,IMPRIMIR!A446)","v":0},{"$f":"IF(E447=0,0,IMPRIMIR!$D$3)","v":0},0,{"$f":"IMPRIMIR!B446","v":0},{"$f":"IMPRIMIR!C446","v":0},{"$f":"IF(E447=0,0,IMPRIMIR!D446)","v":0},{"$f":"IF(E447=0,0,IMPRIMIR!E446)","v":0},0,0,0]
[null,{"$f":"IF(E448=0,0,IMPRIMIR!A447)","v":0},{"$f":"IF(E448=0,0,IMPRIMIR!$D$3)","v":0},0,{"$f":"IMPRIMIR!B447","v":0},{"$f":"IMPRIMIR!C447","v":0},{"$f":"IF(E448=0,0,IMPRIMIR!D447)","v":0},{"$f":"IF(E448=0,0,IMPRIMIR!E447)","v":0},0,0,0]
[null,{"$f":"IF(E449=0,0,IMPRIMIR!A448)","v":0},{"$f":"IF(E449=0,0,IMPRIMIR!$D$3)","v":0},0,{"$f":"IMPRIMIR!B448","v":0},{"$f":"IMPRIMIR!C448","v":0},{"$f":"IF(E449=0,0,IMPRIMIR!D448)","v":0},{"$f":"IF(E449=0,0,IMPRIMIR!E448)","v":0},0,0,0]
[null,{"$f":"IF(E450=0,0,IMPRIMIR!A449)","v":0},{"$f":"IF(E450=0,0,IMPRIMIR!$D$3)","v":0},0,{"$f":"IMPRIMIR!B449","v":0},{"$f":"IMPRIMIR!C449","v":0},{"$f":"IF(E450=0,0,IMPRIMIR!D449)","v":0},{"$f":"IF(E450=0,0,IMPRIMIR!E449)","v":0},0,0,0]
[null,{"$f":"IF(E451=0,0,IMPRIMIR!A450)","v":0},{"$f":"IF(E451=0,0,IMPRIMIR!$D$3)","v":0},0,{"$f":"IMPRIMIR!B450","v":0},{"$f":"IMPRIMIR!C450","v":0},{"$f":"IF(E451=0,0,IMPRIMIR!D450)","v":0},{"$f":"IF(E451=0,0,IMPRIMIR!E450)","v":0},0,0,0]
[null,{"$f":"IF(E452=0,0,IMPRIMIR!A451)","v":0},{"$f":"IF(E452=0,0,IMPRIMIR!$D$3)","v":0},0,{"$f":"IMPRIMIR!B451","v":0},{"$f":"IMPRIMIR!C451","v":0},{"$f":"IF(E452=0,0,IMPRIMIR!D451)","v":0},{"$f":"IF(E452=0,0,IMPRIMIR!E451)","v":0},0,0,0]
[null,{"$f":"IF(E453=0,0,IMPRIMIR!A452)","v":0},{"$f":"IF(E453=0,0,IMPRIMIR!$D$3)","v":0},0,{"$f":"IMPRIMIR!B452","v":0},{"$f":"IMPRIMIR!C452","v":0},{"$f":"IF(E453=0,0,IMPRIMIR!D452)","v":0},{"$f":"IF(E453=0,0,IMPRIMIR!E452)","v":0},0,0,0]
[null,{"$f":"IF(E454=0,0,IMPRIMIR!A453)","v":0},{"$f":"IF(E454=0,0,IMPRIMIR!$D$3)","v":0},0,{"$f":"IMPRIMIR!B453","v":0},{"$f":"IMPRIMIR!C453","v":0},{"$f":"IF(E454=0,0,IMPRIMIR!D453)","v":0},{"$f":"IF(E454=0,0,IMPRIMIR!E453)","v":0},0,0,0]
[null,{"$f":"IF(E455=0,0,IMPRIMIR!A454)","v":0},{"$f":"IF(E455=0,0,IMPRIMIR!$D$3)","v":0},0,{"$f":"IMPRIMIR!B454","v":0},{"$f":"IMPRIMIR!C454","v":0},{"$f":"IF(E455=0,0,IMPRIMIR!D454)","v":0},{"$f":"IF(E455=0,0,IMPRIMIR!E454)","v":0},0,0,0]
[null,{"$f":"IF(E456=0,0,IMPRIMIR!A455)","v":0},{"$f":"IF(E456=0,0,IMPRIMIR!$D$3)","v":0},0,{"$f":"IMPRIMIR!B455","v":0},{"$f":"IMPRIMIR!C455","v":0},{"$f":"IF(E456=0,0,IMPRIMIR!D455)","v":0},{"$f":"IF(E456=0,0,IMPRIMIR!E455)","v":0},0,0,0]
[null,{"$f":"IF(E457=0,0,IMPRIMIR!A456)","v":0},{"$f":"IF(E457=0,0,IMPRIMIR!$D$3)","v":0},0,{"$f":"IMPRIMIR!B456","v":0},{"$f":"IMPRIMIR!C456","v":0},{"$f":"IF(E457=0,0,IMPRIMIR!D456)","v":0},{"$f":"IF(E457=0,0,IMPRIMIR!E456)","v":0},0,0,0]
[null,{"$f":"IF(E458=0,0,IMPRIMIR!A457)","v":0},{"$f":"IF(E458=0,0,IMPRIMIR!$D$3)","v":0},0,{"$f":"IMPRIMIR!B457","v":0},{"$f":"IMPRIMIR!C457","v":0},{"$f":"IF(E458=0,0,IMPRIMIR!D457)","v":0},{"$f":"IF(E458=0,0,IMPRIMIR!E457)","v":0},0,0,0]
[null,{"$f":"IF(E459=0,0,IMPRIMIR!A458)","v":0},{"$f":"IF(E459=0,0,IMPRIMIR!$D$3)","v":0},0,{"$f":"IMPRIMIR!B458","v":0},{"$f":"IMPRIMIR!C458","v":0},{"$f":"IF(E459=0,0,IMPRIMIR!D458)","v":0},{"$f":"IF(E459=0,0,IMPRIMIR!E458)","v":0},0,0,0]
[null,{"$f":"IF(E460=0,0,IMPRIMIR!A459)","v":0},{"$f":"IF(E460=0,0,IMPRIMIR!$D$3)","v":0},0,{"$f":"IMPRIMIR!B459","v":0},{"$f":"IMPRIMIR!C459","v":0},{"$f":"IF(E460=0,0,IMPRIMIR!D459)","v":0},{"$f":"IF(E460=0,0,IMPRIMIR!E459)","v":0},0,0,0]
[null,{"$f":"IF(E461=0,0,IMPRIMIR!A460)","v":0},{"$f":"IF(E461=0,0,IMPRIMIR!$D$3)","v":0},0,{"$f":"IMPRIMIR!B460","v":0},{"$f":"IMPRIMIR!C460","v":0},{"$f":"IF(E461=0,0,IMPRIMIR!D460)","v":0},{"$f":"IF(E461=0,0,IMPRIMIR!E460)","v":0},0,0,0]
[null,{"$f":"IF(E462=0,0,IMPRIMIR!A461)","v":0},{"$f":"IF(E462=0,0,IMPRIMIR!$D$3)","v":0},0,{"$f":"IMPRIMIR!B461","v":0},{"$f":"IMPRIMIR!C461","v":0},{"$f":"IF(E462=0,0,IMPRIMIR!D461)","v":0},{"$f":"IF(E462=0,0,IMPRIMIR!E461)","v":0},0,0,0]
[null,{"$f":"IF(E463=0,0,IMPRIMIR!A462)","v":0},{"$f":"IF(E463=0,0,IMPRIMIR!$D$3)","v":0},0,{"$f":"IMPRIMIR!B462","v":0},{"$f":"IMPRIMIR!C462","v":0},{"$f":"IF(E463=0,0,IMPRIMIR!D462)","v":0},{"$f":"IF(E463=0,0,IMPRIMIR!E462)","v":0},0,0,0]
[null,{"$f":"IF(E464=0,0,IMPRIMIR!A463)","v":0},{"$f":"IF(E464=0,0,IMPRIMIR!$D$3)","v":0},0,{"$f":"IMPRIMIR!B463","v":0},{"$f":"IMPRIMIR!C463","v":0},{"$f":"IF(E464=0,0,IMPRIMIR!D463)","v":0},{"$f":"IF(E464=0,0,IMPRIMIR!E463)","v":0},0,0,0]
[null,{"$f":"IF(E465=0,0,IMPRIMIR!A464)","v":0},{"$f":"IF(E465=0,0,IMPRIMIR!$D$3)","v":0},0,{"$f":"IMPRIMIR!B464","v":0},{"$f":"IMPRIMIR!C464","v":0},{"$f":"IF(E465=0,0,IMPRIMIR!D464)","v":0},{"$f":"IF(E465=0,0,IMPRIMIR!E464)","v":0},0,0,0]
[null,{"$f":"IF(E466=0,0,IMPRIMIR!A465)","v":0},{"$f":"IF(E466=0,0,IMPRIMIR!$D$3)","v":0},0,{"$f":"IMPRIMIR!B465","v":0},{"$f":"IMPRIMIR!C465","v":0},{"$f":"IF(E466=0,0,IMPRIMIR!D465)","v":0},{"$f":"IF(E466=0,0,IMPRIMIR!E465)","v":0},0,0,0]
[null,{"$f":"IF(E467=0,0,IMPRIMIR!A466)","v":0},{"$f":"IF(E467=0,0,IMPRIMIR!$D$3)","v":0},0,{"$f":"IMPRIMIR!B466","v":0},{"$f":"IMPRIMIR!C466","v":0},{"$f":"IF(E467=0,0,IMPRIMIR!D466)","v":0},{"$f":"IF(E467=0,0,IMPRIMIR!E466)","v":0},0,0,0]
[null,{"$f":"IF(E468=0,0,IMPRIMIR!A467)","v":0},{"$f":"IF(E468=0,0,IMPRIMIR!$D$3)","v":0},0,{"$f":"IMPRIMIR!B467","v":0},{"$f":"IMPRIMIR!C467","v":0},{"$f":"IF(E468=0,0,IMPRIMIR!D467)","v":0},{"$f":"IF(E468=0,0,IMPRIMIR!E467)","v":0},0,0,0]
[null,{"$f":"IF(E469=0,0,IMPRIMIR!A468)","v":0},{"$f":"IF(E469=0,0,IMPRIMIR!$D$3)","v":0},0,{"$f":"IMPRIMIR!B468","v":0},{"$f":"IMPRIMIR!C468","v":0},{"$f":"IF(E469=0,0,IMPRIMIR!D468)","v":0},{"$f":"IF(E469=0,0,IMPRIMIR!E468)","v":0},0,0,0]
[null,{"$f":"IF(E470=0,0,IMPRIMIR!A469)","v":0},{"$f":"IF(E470=0,0,IMPRIMIR!$D$3)","v":0},0,{"$f":"IMPRIMIR!B469","v":0},{"$f":"IMPRIMIR!C469","v":0},{"$f":"IF(E470=0,0,IMPRIMIR!D469)","v":0},{"$f":"IF(E470=0,0,IMPRIMIR!E469)","v":0},0,0,0]
[null,{"$f":"IF(E471=0,0,IMPRIMIR!A470)","v":0},{"$f":"IF(E471=0,0,IMPRIMIR!$D$3)","v":0},0,{"$f":"IMPRIMIR!B470","v":0},{"$f":"IMPRIMIR!C470","v":0},{"$f":"IF(E471=0,0,IMPRIMIR!D470)","v":0},{"$f":"IF(E471=0,0,IMPRIMIR!E470)","v":0},0,0,0]
[null,{"$f":"IF(E472=0,0,IMPRIMIR!A471)","v":0},{"$f":"IF(E472=0,0,IMPRIMIR!$D$3)","v":0},0,{"$f":"IMPRIMIR!B471","v":0},{"$f":"IMPRIMIR!C471","v":0},{"$f":"IF(E472=0,0,IMPRIMIR!D471)","v":0},{"$f":"IF(E472=0,0,IMPRIMIR!E471)","v":0},0,0,0]
[null,{"$f":"IF(E473=0,0,IMPRIMIR!A472)","v":0},{"$f":"IF(E473=0,0,IMPRIMIR!$D$3)","v":0},0,{"$f":"IMPRIMIR!B472","v":0},{"$f":"IMPRIMIR!C472","v":0},{"$f":"IF(E473=0,0,IMPRIMIR!D472)","v":0},{"$f":"IF(E473=0,0,IMPRIMIR!E472)","v":0},0,0,0]
[null,{"$f":"IF(E474=0,0,IMPRIMIR!A473)","v":0},{"$f":"IF(E474=0,0,IMPRIMIR!$D$3)","v":0},0,{"$f":"IMPRIMIR!B473","v":0},{"$f":"IMPRIMIR!C473","v":0},{"$f":"IF(E474=0,0,IMPRIMIR!D473)","v":0},{"$f":"IF(E474=0,0,IMPRIMIR!E473)","v":0},0,0,0]
[null,{"$f":"IF(E475=0,0,IMPRIMIR!A474)","v":0},{"$f":"IF(E475=0,0,IMPRIMIR!$D$3)","v":0},0,{"$f":"IMPRIMIR!B474","v":0},{"$f":"IMPRIMIR!C474","v":0},{"$f":"IF(E475=0,0,IMPRIMIR!D474)","v":0},{"$f":"IF(E475=0,0,IMPRIMIR!E474)","v":0},0,0,0]
[null,{"$f":"IF(E476=0,0,IMPRIMIR!A475)","v":0},{"$f":"IF(E476=0,0,IMPRIMIR!$D$3)","v":0},0,{"$f":"IMPRIMIR!B475","v":0},{"$f":"IMPRIMIR!C475","v":0},{"$f":"IF(E476=0,0,IMPRIMIR!D475)","v":0},{"$f":"IF(E476=0,0,IMPRIMIR!E475)","v":0},0,0,0]
[null,{"$f":"IF(E477=0,0,IMPRIMIR!A476)","v":0},{"$f":"IF(E477=0,0,IMPRIMIR!$D$3)","v":0},0,{"$f":"IMPRIMIR!B476","v":0},{"$f":"IMPRIMIR!C476","v":0},{"$f":"IF(E477=0,0,IMPRIMIR!D476)","v":0},{"$f":"IF(E477=0,0,IMPRIMIR!E476)","v":0},0,0,0]
[null,{"$f":"IF(E478=0,0,IMPRIMIR!A477)","v":0},{"$f":"IF(E478=0,0,IMPRIMIR!$D$3)","v":0},0,{"$f":"IMPRIMIR!B477","v":0},{"$f":"IMPRIMIR!C477","v":0},{"$f":"IF(E478=0,0,IMPRIMIR!D477)","v":0},{"$f":"IF(E478=0,0,IMPRIMIR!E477)","v":0},0,0,0]
[null,{"$f":"IF(E479=0,0,IMPRIMIR!A478)","v":0},{"$f":"IF(E479=0,0,IMPRIMIR!$D$3)","v":0},0,{"$f":"IMPRIMIR!B478","v":0},{"$f":"IMPRIMIR!C478","v":0},{"$f":"IF(E479=0,0,IMPRIMIR!D478)","v":0},{"$f":"IF(E479=0,0,IMPRIMIR!E478)","v":0},0,0,0]
[null,{"$f":"IF(E480=0,0,IMPRIMIR!A479)","v":0},{"$f":"IF(E480=0,0,IMPRIMIR!$D$3)","v":0},0,{"$f":"IMPRIMIR!B479","v":0},{"$f":"IMPRIMIR!C479","v":0},{"$f":"IF(E480=0,0,IMPRIMIR!D479)","v":0},{"$f":"IF(E480=0,0,IMPRIMIR!E479)","v":0},0,0,0]
[null,{"$f":"IF(E481=0,0,IMPRIMIR!A480)","v":0},{"$f":"IF(E481=0,0,IMPRIMIR!$D$3)","v":0},0,{"$f":"IMPRIMIR!B480","v":0},{"$f":"IMPRIMIR!C480","v":0},{"$f":"IF(E481=0,0,IMPRIMIR!D480)","v":0},{"$f":"IF(E481=0,0,IMPRIMIR!E480)","v":0},0,0,0]
[null,{"$f":"IF(E482=0,0,IMPRIMIR!A481)","v":0},{"$f":"IF(E482=0,0,IMPRIMIR!$D$3)","v":0},0,{"$f":"IMPRIMIR!B481","v":0},{"$f":"IMPRIMIR!C481","v":0},{"$f":"IF(E482=0,0,IMPRIMIR!D481)","v":0},{"$f":"IF(E482=0,0,IMPRIMIR!E481)","v":0},0,0,0]
[null,{"$f":"IF(E483=0,0,IMPRIMIR!A482)","v":0},{"$f":"IF(E483=0,0,IMPRIMIR!$D$3)","v":0},0,{"$f":"IMPRIMIR!B482","v":0},{"$f":"IMPRIMIR!C482","v":0},{"$f":"IF(E483=0,0,IMPRIMIR!D482)","v":0},{"$f":"IF(E483=0,0,IMPRIMIR!E482)","v":0},0,0,0]
[null,{"$f":"IF(E484=0,0,IMPRIMIR!A483)","v":0},{"$f":"IF(E484=0,0,IMPRIMIR!$D$3)","v":0},0,{"$f":"IMPRIMIR!B483","v":0},{"$f":"IMPRIMIR!C483","v":0},{"$f":"IF(E484=0,0,IMPRIMIR!D483)","v":0},{"$f":"IF(E484=0,0,IMPRIMIR!E483)","v":0},0,0,0]
[null,{"$f":"IF(E485=0,0,IMPRIMIR!A484)","v":0},{"$f":"IF(E485=0,0,IMPRIMIR!$D$3)","v":0},0,{"$f":"IMPRIMIR!B484","v":0},{"$f":"IMPRIMIR!C484","v":0},{"$f":"IF(E485=0,0,IMPRIMIR!D484)","v":0},{"$f":"IF(E485=0,0,IMPRIMIR!E484)","v":0},0,0,0]
[null,{"$f":"IF(E486=0,0,IMPRIMIR!A485)","v":0},{"$f":"IF(E486=0,0,IMPRIMIR!$D$3)","v":0},0,{"$f":"IMPRIMIR!B485","v":0},{"$f":"IMPRIMIR!C485","v":0},{"$f":"IF(E486=0,0,IMPRIMIR!D485)","v":0},{"$f":"IF(E486=0,0,IMPRIMIR!E485)","v":0},0,0,0]
[null,{"$f":"IF(E487=0,0,IMPRIMIR!A486)","v":0},{"$f":"IF(E487=0,0,IMPRIMIR!$D$3)","v":0},0,{"$f":"IMPRIMIR!B486","v":0},{"$f":"IMPRIMIR!C486","v":0},{"$f":"IF(E487=0,0,IMPRIMIR!D486)","v":0},{"$f":"IF(E487=0,0,IMPRIMIR!E486)","v":0},0,0,0]
[null,{"$f":"IF(E488=0,0,IMPRIMIR!A487)","v":0},{"$f":"IF(E488=0,0,IMPRIMIR!$D$3)","v":0},0,{"$f":"IMPRIMIR!B487","v":0},{"$f":"IMPRIMIR!C487","v":0},{"$f":"IF(E488=0,0,IMPRIMIR!D487)","v":0},{"$f":"IF(E488=0,0,IMPRIMIR!E487)","v":0},0,0,0]
[null,{"$f":"IF(E489=0,0,IMPRIMIR!A488)","v":0},{"$f":"IF(E489=0,0,IMPRIMIR!$D$3)","v":0},0,{"$f":"IMPRIMIR!B488","v":0},{"$f":"IMPRIMIR!C488","v":0},{"$f":"IF(E489=0,0,IMPRIMIR!D488)","v":0},{"$f":"IF(E489=0,0,IMPRIMIR!E488)","v":0},0,0,0]
[null,{"$f":"IF(E490=0,0,IMPRIMIR!A489)","v":0},{"$f":"IF(E490=0,0,IMPRIMIR!$D$3)","v":0},0,{"$f":"IMPRIMIR!B489","v":0},{"$f":"IMPRIMIR!C489","v":0},{"$f":"IF(E490=0,0,IMPRIMIR!D489)","v":0},{"$f":"IF(E490=0,0,IMPRIMIR!E489)","v":0},0,0,0]
[null,{"$f":"IF(E491=0,0,IMPRIMIR!A490)","v":0},{"$f":"IF(E491=0,0,IMPRIMIR!$D$3)","v":0},0,{"$f":"IMPRIMIR!B490","v":0},{"$f":"IMPRIMIR!C490","v":0},{"$f":"IF(E491=0,0,IMPRIMIR!D490)","v":0},{"$f":"IF(E491=0,0,IMPRIMIR!E490)","v":0},0,0,0]
[null,{"$f":"IF(E492=0,0,IMPRIMIR!A491)","v":0},{"$f":"IF(E492=0,0,IMPRIMIR!$D$3)","v":0},0,{"$f":"IMPRIMIR!B491","v":0},{"$f":"IMPRIMIR!C491","v":0},{"$f":"IF(E492=0,0,IMPRIMIR!D491)","v":0},{"$f":"IF(E492=0,0,IMPRIMIR!E491)","v":0},0,0,0]
[null,{"$f":"IF(E493=0,0,IMPRIMIR!A492)","v":0},{"$f":"IF(E493=0,0,IMPRIMIR!$D$3)","v":0},0,{"$f":"IMPRIMIR!B492","v":0},{"$f":"IMPRIMIR!C492","v":0},{"$f":"IF(E493=0,0,IMPRIMIR!D492)","v":0},{"$f":"IF(E493=0,0,IMPRIMIR!E492)","v":0},0,0,0]
[null,{"$f":"IF(E494=0,0,IMPRIMIR!A493)","v":0},{"$f":"IF(E494=0,0,IMPRIMIR!$D$3)","v":0},0,{"$f":"IMPRIMIR!B493","v":0},{"$f":"IMPRIMIR!C493","v":0},{"$f":"IF(E494=0,0,IMPRIMIR!D493)","v":0},{"$f":"IF(E494=0,0,IMPRIMIR!E493)","v":0},0,0,0]
[null,{"$f":"IF(E495=0,0,IMPRIMIR!A494)","v":0},{"$f":"IF(E495=0,0,IMPRIMIR!$D$3)","v":0},0,{"$f":"IMPRIMIR!B494","v":0},{"$f":"IMPRIMIR!C494","v":0},{"$f":"IF(E495=0,0,IMPRIMIR!D494)","v":0},{"$f":"IF(E495=0,0,IMPRIMIR!E494)","v":0},0,0,0]
[null,{"$f":"IF(E496=0,0,IMPRIMIR!A495)","v":0},{"$f":"IF(E496=0,0,IMPRIMIR!$D$3)","v":0},0,{"$f":"IMPRIMIR!B495","v":0},{"$f":"IMPRIMIR!C495","v":0},{"$f":"IF(E496=0,0,IMPRIMIR!D495)","v":0},{"$f":"IF(E496=0,0,IMPRIMIR!E495)","v":0},0,0,0]
[null,{"$f":"IF(E497=0,0,IMPRIMIR!A496)","v":0},{"$f":"IF(E497=0,0,IMPRIMIR!$D$3)","v":0},0,{"$f":"IMPRIMIR!B496","v":0},{"$f":"IMPRIMIR!C496","v":0},{"$f":"IF(E497=0,0,IMPRIMIR!D496)","v":0},{"$f":"IF(E497=0,0,IMPRIMIR!E496)","v":0},0,0,0]
[null,{"$f":"IF(E498=0,0,IMPRIMIR!A497)","v":0},{"$f":"IF(E498=0,0,IMPRIMIR!$D$3)","v":0},0,{"$f":"IMPRIMIR!B497","v":0},{"$f":"IMPRIMIR!C497","v":0},{"$f":"IF(E498=0,0,IMPRIMIR!D497)","v":0},{"$f":"IF(E498=0,0,IMPRIMIR!E497)","v":0},0,0,0]
[null,{"$f":"IF(E499=0,0,IMPRIMIR!A498)","v":0},{"$f":"IF(E499=0,0,IMPRIMIR!$D$3)","v":0},0,{"$f":"IMPRIMIR!B498","v":0},{"$f":"IMPRIMIR!C498","v":0},{"$f":"IF(E499=0,0,IMPRIMIR!D498)","v":0},{"$f":"IF(E499=0,0,IMPRIMIR!E498)","v":0},0,0,0]
[null,{"$f":"IF(E500=0,0,IMPRIMIR!A499)","v":0},{"$f":"IF(E500=0,0,IMPRIMIR!$D$3)","v":0},0,{"$f":"IMPRIMIR!B499","v":0},{"$f":"IMPRIMIR!C499","v":0},{"$f":"IF(E500=0,0,IMPRIMIR!D499)","v":0},{"$f":"IF(E500=0,0,IMPRIMIR!E499)","v":0},0,0,0]
[null,{"$f":"IF(E501=0,0,IMPRIMIR!A500)","v":0},{"$f":"IF(E501=0,0,IMPRIMIR!$D$3)","v":0},{"$f":"IF(E501=\"0\",0,$G$2)","v":0},{"$f":"IMPRIMIR!B500","v":0},{"$f":"IMPRIMIR!C500","v":0},{"$f":"IF(E501=0,0,IMPRIMIR!D500)","v":0},{"$f":"IF(E501=0,0,IMPRIMIR!E500)","v":0},{"$f":"IF(E501=0,0,$G$2)","v":0},{"$f":"IF(E501=0,0,$G$4)","v":0},{"$f":"IF(E501=0,0,$G$3)","v":0}]
[null,{"$f":"IF(E502=0,0,IMPRIMIR!A501)","v":0},{"$f":"IF(E502=0,0,IMPRIMIR!$D$3)","v":0},0,{"$f":"IMPRIMIR!B501","v":0},{"$f":"IMPRIMIR!C501","v":0},{"$f":"IF(E502=0,0,IMPRIMIR!D501)","v":0},{"$f":"IF(E502=0,0,IMPRIMIR!E501)","v":0},0,0,0]
[null,{"$f":"IF(E503=0,0,IMPRIMIR!A502)","v":0},{"$f":"IF(E503=0,0,IMPRIMIR!$D$3)","v":0},0,{"$f":"IMPRIMIR!B502","v":0},{"$f":"IMPRIMIR!C502","v":0},{"$f":"IF(E503=0,0,IMPRIMIR!D502)","v":0},{"$f":"IF(E503=0,0,IMPRIMIR!E502)","v":0},0,0,0]
[null,{"$f":"IF(E504=0,0,IMPRIMIR!A503)","v":0},{"$f":"IF(E504=0,0,IMPRIMIR!$D$3)","v":0},0,{"$f":"IMPRIMIR!B503","v":0},{"$f":"IMPRIMIR!C503","v":0},{"$f":"IF(E504=0,0,IMPRIMIR!D503)","v":0},{"$f":"IF(E504=0,0,IMPRIMIR!E503)","v":0},0,0,0]
[null,{"$f":"IF(E505=0,0,IMPRIMIR!A504)","v":0},{"$f":"IF(E505=0,0,IMPRIMIR!$D$3)","v":0},0,{"$f":"IMPRIMIR!B504","v":0},{"$f":"IMPRIMIR!C504","v":0},{"$f":"IF(E505=0,0,IMPRIMIR!D504)","v":0},{"$f":"IF(E505=0,0,IMPRIMIR!E504)","v":0},0,0,0]
[null,{"$f":"IF(E506=0,0,IMPRIMIR!A505)","v":0},{"$f":"IF(E506=0,0,IMPRIMIR!$D$3)","v":0},0,{"$f":"IMPRIMIR!B505","v":0},{"$f":"IMPRIMIR!C505","v":0},{"$f":"IF(E506=0,0,IMPRIMIR!D505)","v":0},{"$f":"IF(E506=0,0,IMPRIMIR!E505)","v":0},0,0,0]
[null,{"$f":"IF(E507=0,0,IMPRIMIR!A506)","v":0},{"$f":"IF(E507=0,0,IMPRIMIR!$D$3)","v":0},0,{"$f":"IMPRIMIR!B506","v":0},{"$f":"IMPRIMIR!C506","v":0},{"$f":"IF(E507=0,0,IMPRIMIR!D506)","v":0},{"$f":"IF(E507=0,0,IMPRIMIR!E506)","v":0},0,0,0]
[null,{"$f":"IF(E508=0,0,IMPRIMIR!A507)","v":0},{"$f":"IF(E508=0,0,IMPRIMIR!$D$3)","v":0},0,{"$f":"IMPRIMIR!B507","v":0},{"$f":"IMPRIMIR!C507","v":0},{"$f":"IF(E508=0,0,IMPRIMIR!D507)","v":0},{"$f":"IF(E508=0,0,IMPRIMIR!E507)","v":0},0,0,0]
[null,{"$f":"IF(E509=0,0,IMPRIMIR!A508)","v":0},{"$f":"IF(E509=0,0,IMPRIMIR!$D$3)","v":0},0,{"$f":"IMPRIMIR!B508","v":0},{"$f":"IMPRIMIR!C508","v":0},{"$f":"IF(E509=0,0,IMPRIMIR!D508)","v":0},{"$f":"IF(E509=0,0,IMPRIMIR!E508)","v":0},0,0,0]
[null,{"$f":"IF(E510=0,0,IMPRIMIR!A509)","v":0},{"$f":"IF(E510=0,0,IMPRIMIR!$D$3)","v":0},0,{"$f":"IMPRIMIR!B509","v":0},{"$f":"IMPRIMIR!C509","v":0},{"$f":"IF(E510=0,0,IMPRIMIR!D509)","v":0},{"$f":"IF(E510=0,0,IMPRIMIR!E509)","v":0},0,0,0]
[null,{"$f":"IF(E511=0,0,IMPRIMIR!A510)","v":0},{"$f":"IF(E511=0,0,IMPRIMIR!$D$3)","v":0},0,{"$f":"IMPRIMIR!B510","v":0},{"$f":"IMPRIMIR!C510","v":0},{"$f":"IF(E511=0,0,IMPRIMIR!D510)","v":0},{"$f":"IF(E511=0,0,IMPRIMIR!E510)","v":0},0,0,0]
[null,{"$f":"IF(E512=0,0,IMPRIMIR!A511)","v":0},{"$f":"IF(E512=0,0,IMPRIMIR!$D$3)","v":0},0,{"$f":"IMPRIMIR!B511","v":0},{"$f":"IMPRIMIR!C511","v":0},{"$f":"IF(E512=0,0,IMPRIMIR!D511)","v":0},{"$f":"IF(E512=0,0,IMPRIMIR!E511)","v":0},0,0,0]
[null,{"$f":"IF(E513=0,0,IMPRIMIR!A512)","v":0},{"$f":"IF(E513=0,0,IMPRIMIR!$D$3)","v":0},0,{"$f":"IMPRIMIR!B512","v":0},{"$f":"IMPRIMIR!C512","v":0},{"$f":"IF(E513=0,0,IMPRIMIR!D512)","v":0},{"$f":"IF(E513=0,0,IMPRIMIR!E512)","v":0},0,0,0]
[null,{"$f":"IF(E514=0,0,IMPRIMIR!A513)","v":0},{"$f":"IF(E514=0,0,IMPRIMIR!$D$3)","v":0},0,{"$f":"IMPRIMIR!B513","v":0},{"$f":"IMPRIMIR!C513","v":0},{"$f":"IF(E514=0,0,IMPRIMIR!D513)","v":0},{"$f":"IF(E514=0,0,IMPRIMIR!E513)","v":0},0,0,0]
[null,{"$f":"IF(E515=0,0,IMPRIMIR!A514)","v":0},{"$f":"IF(E515=0,0,IMPRIMIR!$D$3)","v":0},0,{"$f":"IMPRIMIR!B514","v":0},{"$f":"IMPRIMIR!C514","v":0},{"$f":"IF(E515=0,0,IMPRIMIR!D514)","v":0},{"$f":"IF(E515=0,0,IMPRIMIR!E514)","v":0},0,0,0]
[null,{"$f":"IF(E516=0,0,IMPRIMIR!A515)","v":0},{"$f":"IF(E516=0,0,IMPRIMIR!$D$3)","v":0},0,{"$f":"IMPRIMIR!B515","v":0},{"$f":"IMPRIMIR!C515","v":0},{"$f":"IF(E516=0,0,IMPRIMIR!D515)","v":0},{"$f":"IF(E516=0,0,IMPRIMIR!E515)","v":0},0,0,0]
[null,{"$f":"IF(E517=0,0,IMPRIMIR!A516)","v":0},{"$f":"IF(E517=0,0,IMPRIMIR!$D$3)","v":0},0,{"$f":"IMPRIMIR!B516","v":0},{"$f":"IMPRIMIR!C516","v":0},{"$f":"IF(E517=0,0,IMPRIMIR!D516)","v":0},{"$f":"IF(E517=0,0,IMPRIMIR!E516)","v":0},0,0,0]
[null,{"$f":"IF(E518=0,0,IMPRIMIR!A517)","v":0},{"$f":"IF(E518=0,0,IMPRIMIR!$D$3)","v":0},0,{"$f":"IMPRIMIR!B517","v":0},{"$f":"IMPRIMIR!C517","v":0},{"$f":"IF(E518=0,0,IMPRIMIR!D517)","v":0},{"$f":"IF(E518=0,0,IMPRIMIR!E517)","v":0},0,0,0]
[null,{"$f":"IF(E519=0,0,IMPRIMIR!A518)","v":0},{"$f":"IF(E519=0,0,IMPRIMIR!$D$3)","v":0},0,{"$f":"IMPRIMIR!B518","v":0},{"$f":"IMPRIMIR!C518","v":0},{"$f":"IF(E519=0,0,IMPRIMIR!D518)","v":0},{"$f":"IF(E519=0,0,IMPRIMIR!E518)","v":0},0,0,0]
[null,{"$f":"IF(E520=0,0,IMPRIMIR!A519)","v":0},{"$f":"IF(E520=0,0,IMPRIMIR!$D$3)","v":0},0,{"$f":"IMPRIMIR!B519","v":0},{"$f":"IMPRIMIR!C519","v":0},{"$f":"IF(E520=0,0,IMPRIMIR!D519)","v":0},{"$f":"IF(E520=0,0,IMPRIMIR!E519)","v":0},0,0,0]
[null,{"$f":"IF(E521=0,0,IMPRIMIR!A520)","v":0},{"$f":"IF(E521=0,0,IMPRIMIR!$D$3)","v":0},0,{"$f":"IMPRIMIR!B520","v":0},{"$f":"IMPRIMIR!C520","v":0},{"$f":"IF(E521=0,0,IMPRIMIR!D520)","v":0},{"$f":"IF(E521=0,0,IMPRIMIR!E520)","v":0},0,0,0]
[null,{"$f":"IF(E522=0,0,IMPRIMIR!A521)","v":0},{"$f":"IF(E522=0,0,IMPRIMIR!$D$3)","v":0},0,{"$f":"IMPRIMIR!B521","v":0},{"$f":"IMPRIMIR!C521","v":0},{"$f":"IF(E522=0,0,IMPRIMIR!D521)","v":0},{"$f":"IF(E522=0,0,IMPRIMIR!E521)","v":0},0,0,0]
[null,{"$f":"IF(E523=0,0,IMPRIMIR!A522)","v":0},{"$f":"IF(E523=0,0,IMPRIMIR!$D$3)","v":0},0,{"$f":"IMPRIMIR!B522","v":0},{"$f":"IMPRIMIR!C522","v":0},{"$f":"IF(E523=0,0,IMPRIMIR!D522)","v":0},{"$f":"IF(E523=0,0,IMPRIMIR!E522)","v":0},0,0,0]
[null,{"$f":"IF(E524=0,0,IMPRIMIR!A523)","v":0},{"$f":"IF(E524=0,0,IMPRIMIR!$D$3)","v":0},0,{"$f":"IMPRIMIR!B523","v":0},{"$f":"IMPRIMIR!C523","v":0},{"$f":"IF(E524=0,0,IMPRIMIR!D523)","v":0},{"$f":"IF(E524=0,0,IMPRIMIR!E523)","v":0},0,0,0]
[null,{"$f":"IF(E525=0,0,IMPRIMIR!A524)","v":0},{"$f":"IF(E525=0,0,IMPRIMIR!$D$3)","v":0},0,{"$f":"IMPRIMIR!B524","v":0},{"$f":"IMPRIMIR!C524","v":0},{"$f":"IF(E525=0,0,IMPRIMIR!D524)","v":0},{"$f":"IF(E525=0,0,IMPRIMIR!E524)","v":0},0,0,0]
[null,{"$f":"IF(E526=0,0,IMPRIMIR!A525)","v":0},{"$f":"IF(E526=0,0,IMPRIMIR!$D$3)","v":0},0,{"$f":"IMPRIMIR!B525","v":0},{"$f":"IMPRIMIR!C525","v":0},{"$f":"IF(E526=0,0,IMPRIMIR!D525)","v":0},{"$f":"IF(E526=0,0,IMPRIMIR!E525)","v":0},0,0,0]
[null,{"$f":"IF(E527=0,0,IMPRIMIR!A526)","v":0},{"$f":"IF(E527=0,0,IMPRIMIR!$D$3)","v":0},{"$f":"IF(E527=\"0\",0,$G$2)","v":0},{"$f":"IMPRIMIR!B526","v":0},{"$f":"IMPRIMIR!C526","v":0},{"$f":"IF(E527=0,0,IMPRIMIR!D526)","v":0},{"$f":"IF(E527=0,0,IMPRIMIR!E526)","v":0},{"$f":"IF(E527=0,0,$G$2)","v":0},{"$f":"IF(E527=0,0,$G$4)","v":0},{"$f":"IF(E527=0,0,$G$3)","v":0}]
[null,{"$f":"IF(E528=0,0,IMPRIMIR!A527)","v":0},{"$f":"IF(E528=0,0,IMPRIMIR!$D$3)","v":0},0,{"$f":"IMPRIMIR!B527","v":0},{"$f":"IMPRIMIR!C527","v":0},{"$f":"IF(E528=0,0,IMPRIMIR!D527)","v":0},{"$f":"IF(E528=0,0,IMPRIMIR!E527)","v":0},0,0,0]
[null,{"$f":"IF(E529=0,0,IMPRIMIR!A528)","v":0},{"$f":"IF(E529=0,0,IMPRIMIR!$D$3)","v":0},0,{"$f":"IMPRIMIR!B528","v":0},{"$f":"IMPRIMIR!C528","v":0},{"$f":"IF(E529=0,0,IMPRIMIR!D528)","v":0},{"$f":"IF(E529=0,0,IMPRIMIR!E528)","v":0},0,0,0]
[null,{"$f":"IF(E530=0,0,IMPRIMIR!A529)","v":0},{"$f":"IF(E530=0,0,IMPRIMIR!$D$3)","v":0},0,{"$f":"IMPRIMIR!B529","v":0},{"$f":"IMPRIMIR!C529","v":0},{"$f":"IF(E530=0,0,IMPRIMIR!D529)","v":0},{"$f":"IF(E530=0,0,IMPRIMIR!E529)","v":0},0,0,0]
[null,{"$f":"IF(E531=0,0,IMPRIMIR!A530)","v":0},{"$f":"IF(E531=0,0,IMPRIMIR!$D$3)","v":0},0,{"$f":"IMPRIMIR!B530","v":0},{"$f":"IMPRIMIR!C530","v":0},{"$f":"IF(E531=0,0,IMPRIMIR!D530)","v":0},{"$f":"IF(E531=0,0,IMPRIMIR!E530)","v":0},0,0,0]
[null,{"$f":"IF(E532=0,0,IMPRIMIR!A531)","v":0},{"$f":"IF(E532=0,0,IMPRIMIR!$D$3)","v":0},0,{"$f":"IMPRIMIR!B531","v":0},{"$f":"IMPRIMIR!C531","v":0},{"$f":"IF(E532=0,0,IMPRIMIR!D531)","v":0},{"$f":"IF(E532=0,0,IMPRIMIR!E531)","v":0},0,0,0]
[null,{"$f":"IF(E533=0,0,IMPRIMIR!A532)","v":0},{"$f":"IF(E533=0,0,IMPRIMIR!$D$3)","v":0},0,{"$f":"IMPRIMIR!B532","v":0},{"$f":"IMPRIMIR!C532","v":0},{"$f":"IF(E533=0,0,IMPRIMIR!D532)","v":0},{"$f":"IF(E533=0,0,IMPRIMIR!E532)","v":0},0,0,0]
[null,{"$f":"IF(E534=0,0,IMPRIMIR!A533)","v":0},{"$f":"IF(E534=0,0,IMPRIMIR!$D$3)","v":0},0,{"$f":"IMPRIMIR!B533","v":0},{"$f":"IMPRIMIR!C533","v":0},{"$f":"IF(E534=0,0,IMPRIMIR!D533)","v":0},{"$f":"IF(E534=0,0,IMPRIMIR!E533)","v":0},0,0,0]
[null,{"$f":"IF(E535=0,0,IMPRIMIR!A534)","v":0},{"$f":"IF(E535=0,0,IMPRIMIR!$D$3)","v":0},0,{"$f":"IMPRIMIR!B534","v":0},{"$f":"IMPRIMIR!C534","v":0},{"$f":"IF(E535=0,0,IMPRIMIR!D534)","v":0},{"$f":"IF(E535=0,0,IMPRIMIR!E534)","v":0},0,0,0]
[null,{"$f":"IF(E536=0,0,IMPRIMIR!A535)","v":0},{"$f":"IF(E536=0,0,IMPRIMIR!$D$3)","v":0},0,{"$f":"IMPRIMIR!B535","v":0},{"$f":"IMPRIMIR!C535","v":0},{"$f":"IF(E536=0,0,IMPRIMIR!D535)","v":0},{"$f":"IF(E536=0,0,IMPRIMIR!E535)","v":0},0,0,0]
[null,{"$f":"IF(E537=0,0,IMPRIMIR!A536)","v":0},{"$f":"IF(E537=0,0,IMPRIMIR!$D$3)","v":0},0,{"$f":"IMPRIMIR!B536","v":0},{"$f":"IMPRIMIR!C536","v":0},{"$f":"IF(E537=0,0,IMPRIMIR!D536)","v":0},{"$f":"IF(E537=0,0,IMPRIMIR!E536)","v":0},0,0,0]
[null,{"$f":"IF(E538=0,0,IMPRIMIR!A537)","v":0},{"$f":"IF(E538=0,0,IMPRIMIR!$D$3)","v":0},0,{"$f":"IMPRIMIR!B537","v":0},{"$f":"IMPRIMIR!C537","v":0},{"$f":"IF(E538=0,0,IMPRIMIR!D537)","v":0},{"$f":"IF(E538=0,0,IMPRIMIR!E537)","v":0},0,0,0]
[null,{"$f":"IF(E539=0,0,IMPRIMIR!A538)","v":0},{"$f":"IF(E539=0,0,IMPRIMIR!$D$3)","v":0},0,{"$f":"IMPRIMIR!B538","v":0},{"$f":"IMPRIMIR!C538","v":0},{"$f":"IF(E539=0,0,IMPRIMIR!D538)","v":0},{"$f":"IF(E539=0,0,IMPRIMIR!E538)","v":0},0,0,0]
[null,{"$f":"IF(E540=0,0,IMPRIMIR!A539)","v":0},{"$f":"IF(E540=0,0,IMPRIMIR!$D$3)","v":0},0,{"$f":"IMPRIMIR!B539","v":0},{"$f":"IMPRIMIR!C539","v":0},{"$f":"IF(E540=0,0,IMPRIMIR!D539)","v":0},{"$f":"IF(E540=0,0,IMPRIMIR!E539)","v":0},0,0,0]
[null,{"$f":"IF(E541=0,0,IMPRIMIR!A540)","v":0},{"$f":"IF(E541=0,0,IMPRIMIR!$D$3)","v":0},0,{"$f":"IMPRIMIR!B540","v":0},{"$f":"IMPRIMIR!C540","v":0},{"$f":"IF(E541=0,0,IMPRIMIR!D540)","v":0},{"$f":"IF(E541=0,0,IMPRIMIR!E540)","v":0},0,0,0]
[null,{"$f":"IF(E542=0,0,IMPRIMIR!A541)","v":0},{"$f":"IF(E542=0,0,IMPRIMIR!$D$3)","v":0},0,{"$f":"IMPRIMIR!B541","v":0},{"$f":"IMPRIMIR!C541","v":0},{"$f":"IF(E542=0,0,IMPRIMIR!D541)","v":0},{"$f":"IF(E542=0,0,IMPRIMIR!E541)","v":0},0,0,0]
[null,{"$f":"IF(E543=0,0,IMPRIMIR!A542)","v":0},{"$f":"IF(E543=0,0,IMPRIMIR!$D$3)","v":0},0,{"$f":"IMPRIMIR!B542","v":0},{"$f":"IMPRIMIR!C542","v":0},{"$f":"IF(E543=0,0,IMPRIMIR!D542)","v":0},{"$f":"IF(E543=0,0,IMPRIMIR!E542)","v":0},0,0,0]
[null,{"$f":"IF(E544=0,0,IMPRIMIR!A543)","v":0},{"$f":"IF(E544=0,0,IMPRIMIR!$D$3)","v":0},0,{"$f":"IMPRIMIR!B543","v":0},{"$f":"IMPRIMIR!C543","v":0},{"$f":"IF(E544=0,0,IMPRIMIR!D543)","v":0},{"$f":"IF(E544=0,0,IMPRIMIR!E543)","v":0},0,0,0]
[null,{"$f":"IF(E545=0,0,IMPRIMIR!A544)","v":0},{"$f":"IF(E545=0,0,IMPRIMIR!$D$3)","v":0},0,{"$f":"IMPRIMIR!B544","v":0},{"$f":"IMPRIMIR!C544","v":0},{"$f":"IF(E545=0,0,IMPRIMIR!D544)","v":0},{"$f":"IF(E545=0,0,IMPRIMIR!E544)","v":0},0,0,0]
[null,{"$f":"IF(E546=0,0,IMPRIMIR!A545)","v":0},{"$f":"IF(E546=0,0,IMPRIMIR!$D$3)","v":0},0,{"$f":"IMPRIMIR!B545","v":0},{"$f":"IMPRIMIR!C545","v":0},{"$f":"IF(E546=0,0,IMPRIMIR!D545)","v":0},{"$f":"IF(E546=0,0,IMPRIMIR!E545)","v":0},0,0,0]
[null,{"$f":"IF(E547=0,0,IMPRIMIR!A546)","v":0},{"$f":"IF(E547=0,0,IMPRIMIR!$D$3)","v":0},0,{"$f":"IMPRIMIR!B546","v":0},{"$f":"IMPRIMIR!C546","v":0},{"$f":"IF(E547=0,0,IMPRIMIR!D546)","v":0},{"$f":"IF(E547=0,0,IMPRIMIR!E546)","v":0},0,0,0]
[null,{"$f":"IF(E548=0,0,IMPRIMIR!A547)","v":0},{"$f":"IF(E548=0,0,IMPRIMIR!$D$3)","v":0},0,{"$f":"IMPRIMIR!B547","v":0},{"$f":"IMPRIMIR!C547","v":0},{"$f":"IF(E548=0,0,IMPRIMIR!D547)","v":0},{"$f":"IF(E548=0,0,IMPRIMIR!E547)","v":0},0,0,0]
[null,{"$f":"IF(E549=0,0,IMPRIMIR!A548)","v":0},{"$f":"IF(E549=0,0,IMPRIMIR!$D$3)","v":0},0,{"$f":"IMPRIMIR!B548","v":0},{"$f":"IMPRIMIR!C548","v":0},{"$f":"IF(E549=0,0,IMPRIMIR!D548)","v":0},{"$f":"IF(E549=0,0,IMPRIMIR!E548)","v":0},0,0,0]
[null,{"$f":"IF(E550=0,0,IMPRIMIR!A549)","v":0},{"$f":"IF(E550=0,0,IMPRIMIR!$D$3)","v":0},0,{"$f":"IMPRIMIR!B549","v":0},{"$f":"IMPRIMIR!C549","v":0},{"$f":"IF(E550=0,0,IMPRIMIR!D549)","v":0},{"$f":"IF(E550=0,0,IMPRIMIR!E549)","v":0},0,0,0]
[null,{"$f":"IF(E551=0,0,IMPRIMIR!A550)","v":0},{"$f":"IF(E551=0,0,IMPRIMIR!$D$3)","v":0},0,{"$f":"IMPRIMIR!B550","v":0},{"$f":"IMPRIMIR!C550","v":0},{"$f":"IF(E551=0,0,IMPRIMIR!D550)","v":0},{"$f":"IF(E551=0,0,IMPRIMIR!E550)","v":0},0,0,0]
[null,{"$f":"IF(E552=0,0,IMPRIMIR!A551)","v":0},{"$f":"IF(E552=0,0,IMPRIMIR!$D$3)","v":0},0,{"$f":"IMPRIMIR!B551","v":0},{"$f":"IMPRIMIR!C551","v":0},{"$f":"IF(E552=0,0,IMPRIMIR!D551)","v":0},{"$f":"IF(E552=0,0,IMPRIMIR!E551)","v":0},0,0,0]
[null,{"$f":"IF(E553=0,0,IMPRIMIR!A552)","v":0},{"$f":"IF(E553=0,0,IMPRIMIR!$D$3)","v":0},0,{"$f":"IMPRIMIR!B552","v":0},{"$f":"IMPRIMIR!C552","v":0},{"$f":"IF(E553=0,0,IMPRIMIR!D552)","v":0},{"$f":"IF(E553=0,0,IMPRIMIR!E552)","v":0},0,0,0]
[null,{"$f":"IF(E554=0,0,IMPRIMIR!A553)","v":0},{"$f":"IF(E554=0,0,IMPRIMIR!$D$3)","v":0},0,{"$f":"IMPRIMIR!B553","v":0},{"$f":"IMPRIMIR!C553","v":0},{"$f":"IF(E554=0,0,IMPRIMIR!D553)","v":0},{"$f":"IF(E554=0,0,IMPRIMIR!E553)","v":0},0,0,0]
[null,{"$f":"IF(E555=0,0,IMPRIMIR!A554)","v":0},{"$f":"IF(E555=0,0,IMPRIMIR!$D$3)","v":0},0,{"$f":"IMPRIMIR!B554","v":0},{"$f":"IMPRIMIR!C554","v":0},{"$f":"IF(E555=0,0,IMPRIMIR!D554)","v":0},{"$f":"IF(E555=0,0,IMPRIMIR!E554)","v":0},0,0,0]
[null,{"$f":"IF(E556=0,0,IMPRIMIR!A555)","v":0},{"$f":"IF(E556=0,0,IMPRIMIR!$D$3)","v":0},0,{"$f":"IMPRIMIR!B555","v":0},{"$f":"IMPRIMIR!C555","v":0},{"$f":"IF(E556=0,0,IMPRIMIR!D555)","v":0},{"$f":"IF(E556=0,0,IMPRIMIR!E555)","v":0},0,0,0]
[null,{"$f":"IF(E557=0,0,IMPRIMIR!A556)","v":0},{"$f":"IF(E557=0,0,IMPRIMIR!$D$3)","v":0},0,{"$f":"IMPRIMIR!B556","v":0},{"$f":"IMPRIMIR!C556","v":0},{"$f":"IF(E557=0,0,IMPRIMIR!D556)","v":0},{"$f":"IF(E557=0,0,IMPRIMIR!E556)","v":0},0,0,0]
[null,{"$f":"IF(E558=0,0,IMPRIMIR!A557)","v":0},{"$f":"IF(E558=0,0,IMPRIMIR!$D$3)","v":0},0,{"$f":"IMPRIMIR!B557","v":0},{"$f":"IMPRIMIR!C557","v":0},{"$f":"IF(E558=0,0,IMPRIMIR!D557)","v":0},{"$f":"IF(E558=0,0,IMPRIMIR!E557)","v":0},0,0,0]
[null,{"$f":"IF(E559=0,0,IMPRIMIR!A558)","v":0},{"$f":"IF(E559=0,0,IMPRIMIR!$D$3)","v":0},0,{"$f":"IMPRIMIR!B558","v":0},{"$f":"IMPRIMIR!C558","v":0},{"$f":"IF(E559=0,0,IMPRIMIR!D558)","v":0},{"$f":"IF(E559=0,0,IMPRIMIR!E558)","v":0},0,0,0]
[null,{"$f":"IF(E560=0,0,IMPRIMIR!A559)","v":0},{"$f":"IF(E560=0,0,IMPRIMIR!$D$3)","v":0},0,{"$f":"IMPRIMIR!B559","v":0},{"$f":"IMPRIMIR!C559","v":0},{"$f":"IF(E560=0,0,IMPRIMIR!D559)","v":0},{"$f":"IF(E560=0,0,IMPRIMIR!E559)","v":0},0,0,0]
[null,{"$f":"IF(E561=0,0,IMPRIMIR!A560)","v":0},{"$f":"IF(E561=0,0,IMPRIMIR!$D$3)","v":0},0,{"$f":"IMPRIMIR!B560","v":0},{"$f":"IMPRIMIR!C560","v":0},{"$f":"IF(E561=0,0,IMPRIMIR!D560)","v":0},{"$f":"IF(E561=0,0,IMPRIMIR!E560)","v":0},0,0,0]
[null,{"$f":"IF(E562=0,0,IMPRIMIR!A561)","v":0},{"$f":"IF(E562=0,0,IMPRIMIR!$D$3)","v":0},0,{"$f":"IMPRIMIR!B561","v":0},{"$f":"IMPRIMIR!C561","v":0},{"$f":"IF(E562=0,0,IMPRIMIR!D561)","v":0},{"$f":"IF(E562=0,0,IMPRIMIR!E561)","v":0},0,0,0]
[null,{"$f":"IF(E563=0,0,IMPRIMIR!A562)","v":0},{"$f":"IF(E563=0,0,IMPRIMIR!$D$3)","v":0},0,{"$f":"IMPRIMIR!B562","v":0},{"$f":"IMPRIMIR!C562","v":0},{"$f":"IF(E563=0,0,IMPRIMIR!D562)","v":0},{"$f":"IF(E563=0,0,IMPRIMIR!E562)","v":0},0,0,0]
[null,{"$f":"IF(E564=0,0,IMPRIMIR!A563)","v":0},{"$f":"IF(E564=0,0,IMPRIMIR!$D$3)","v":0},0,{"$f":"IMPRIMIR!B563","v":0},{"$f":"IMPRIMIR!C563","v":0},{"$f":"IF(E564=0,0,IMPRIMIR!D563)","v":0},{"$f":"IF(E564=0,0,IMPRIMIR!E563)","v":0},0,0,0]
[null,{"$f":"IF(E565=0,0,IMPRIMIR!A564)","v":0},{"$f":"IF(E565=0,0,IMPRIMIR!$D$3)","v":0},0,{"$f":"IMPRIMIR!B564","v":0},{"$f":"IMPRIMIR!C564","v":0},{"$f":"IF(E565=0,0,IMPRIMIR!D564)","v":0},{"$f":"IF(E565=0,0,IMPRIMIR!E564)","v":0},0,0,0]
[null,{"$f":"IF(E566=0,0,IMPRIMIR!A565)","v":0},{"$f":"IF(E566=0,0,IMPRIMIR!$D$3)","v":0},0,{"$f":"IMPRIMIR!B565","v":0},{"$f":"IMPRIMIR!C565","v":0},{"$f":"IF(E566=0,0,IMPRIMIR!D565)","v":0},{"$f":"IF(E566=0,0,IMPRIMIR!E565)","v":0},0,0,0]
[null,{"$f":"IF(E567=0,0,IMPRIMIR!A566)","v":0},{"$f":"IF(E567=0,0,IMPRIMIR!$D$3)","v":0},0,{"$f":"IMPRIMIR!B566","v":0},{"$f":"IMPRIMIR!C566","v":0},{"$f":"IF(E567=0,0,IMPRIMIR!D566)","v":0},{"$f":"IF(E567=0,0,IMPRIMIR!E566)","v":0},0,0,0]
[null,{"$f":"IF(E568=0,0,IMPRIMIR!A567)","v":0},{"$f":"IF(E568=0,0,IMPRIMIR!$D$3)","v":0},0,{"$f":"IMPRIMIR!B567","v":0},{"$f":"IMPRIMIR!C567","v":0},{"$f":"IF(E568=0,0,IMPRIMIR!D567)","v":0},{"$f":"IF(E568=0,0,IMPRIMIR!E567)","v":0},0,0,0]
[null,{"$f":"IF(E569=0,0,IMPRIMIR!A568)","v":0},{"$f":"IF(E569=0,0,IMPRIMIR!$D$3)","v":0},0,{"$f":"IMPRIMIR!B568","v":0},{"$f":"IMPRIMIR!C568","v":0},{"$f":"IF(E569=0,0,IMPRIMIR!D568)","v":0},{"$f":"IF(E569=0,0,IMPRIMIR!E568)","v":0},0,0,0]
[null,{"$f":"IF(E570=0,0,IMPRIMIR!A569)","v":0},{"$f":"IF(E570=0,0,IMPRIMIR!$D$3)","v":0},0,{"$f":"IMPRIMIR!B569","v":0},{"$f":"IMPRIMIR!C569","v":0},{"$f":"IF(E570=0,0,IMPRIMIR!D569)","v":0},{"$f":"IF(E570=0,0,IMPRIMIR!E569)","v":0},0,0,0]
[null,{"$f":"IF(E571=0,0,IMPRIMIR!A570)","v":0},{"$f":"IF(E571=0,0,IMPRIMIR!$D$3)","v":0},0,{"$f":"IMPRIMIR!B570","v":0},{"$f":"IMPRIMIR!C570","v":0},{"$f":"IF(E571=0,0,IMPRIMIR!D570)","v":0},{"$f":"IF(E571=0,0,IMPRIMIR!E570)","v":0},0,0,0]
[null,{"$f":"IF(E572=0,0,IMPRIMIR!A571)","v":0},{"$f":"IF(E572=0,0,IMPRIMIR!$D$3)","v":0},0,{"$f":"IMPRIMIR!B571","v":0},{"$f":"IMPRIMIR!C571","v":0},{"$f":"IF(E572=0,0,IMPRIMIR!D571)","v":0},{"$f":"IF(E572=0,0,IMPRIMIR!E571)","v":0},0,0,0]
[null,{"$f":"IF(E573=0,0,IMPRIMIR!A572)","v":0},{"$f":"IF(E573=0,0,IMPRIMIR!$D$3)","v":0},0,{"$f":"IMPRIMIR!B572","v":0},{"$f":"IMPRIMIR!C572","v":0},{"$f":"IF(E573=0,0,IMPRIMIR!D572)","v":0},{"$f":"IF(E573=0,0,IMPRIMIR!E572)","v":0},0,0,0]
[null,{"$f":"IF(E574=0,0,IMPRIMIR!A573)","v":0},{"$f":"IF(E574=0,0,IMPRIMIR!$D$3)","v":0},0,{"$f":"IMPRIMIR!B573","v":0},{"$f":"IMPRIMIR!C573","v":0},{"$f":"IF(E574=0,0,IMPRIMIR!D573)","v":0},{"$f":"IF(E574=0,0,IMPRIMIR!E573)","v":0},0,0,0]
[null,{"$f":"IF(E575=0,0,IMPRIMIR!A574)","v":0},{"$f":"IF(E575=0,0,IMPRIMIR!$D$3)","v":0},0,{"$f":"IMPRIMIR!B574","v":0},{"$f":"IMPRIMIR!C574","v":0},{"$f":"IF(E575=0,0,IMPRIMIR!D574)","v":0},{"$f":"IF(E575=0,0,IMPRIMIR!E574)","v":0},0,0,0]
[null,{"$f":"IF(E576=0,0,IMPRIMIR!A575)","v":0},{"$f":"IF(E576=0,0,IMPRIMIR!$D$3)","v":0},0,{"$f":"IMPRIMIR!B575","v":0},{"$f":"IMPRIMIR!C575","v":0},{"$f":"IF(E576=0,0,IMPRIMIR!D575)","v":0},{"$f":"IF(E576=0,0,IMPRIMIR!E575)","v":0},0,0,0]
[null,{"$f":"IF(E577=0,0,IMPRIMIR!A576)","v":0},{"$f":"IF(E577=0,0,IMPRIMIR!$D$3)","v":0},0,{"$f":"IMPRIMIR!B576","v":0},{"$f":"IMPRIMIR!C576","v":0},{"$f":"IF(E577=0,0,IMPRIMIR!D576)","v":0},{"$f":"IF(E577=0,0,IMPRIMIR!E576)","v":0},0,0,0]
[null,{"$f":"IF(E578=0,0,IMPRIMIR!A577)","v":0},{"$f":"IF(E578=0,0,IMPRIMIR!$D$3)","v":0},0,{"$f":"IMPRIMIR!B577","v":0},{"$f":"IMPRIMIR!C577","v":0},{"$f":"IF(E578=0,0,IMPRIMIR!D577)","v":0},{"$f":"IF(E578=0,0,IMPRIMIR!E577)","v":0},0,0,0]
[null,{"$f":"IF(E579=0,0,IMPRIMIR!A578)","v":0},{"$f":"IF(E579=0,0,IMPRIMIR!$D$3)","v":0},0,{"$f":"IMPRIMIR!B578","v":0},{"$f":"IMPRIMIR!C578","v":0},{"$f":"IF(E579=0,0,IMPRIMIR!D578)","v":0},{"$f":"IF(E579=0,0,IMPRIMIR!E578)","v":0},0,0,0]
[null,{"$f":"IF(E580=0,0,IMPRIMIR!A579)","v":0},{"$f":"IF(E580=0,0,IMPRIMIR!$D$3)","v":0},0,{"$f":"IMPRIMIR!B579","v":0},{"$f":"IMPRIMIR!C579","v":0},{"$f":"IF(E580=0,0,IMPRIMIR!D579)","v":0},{"$f":"IF(E580=0,0,IMPRIMIR!E579)","v":0},0,0,0]
[null,{"$f":"IF(E581=0,0,IMPRIMIR!A580)","v":0},{"$f":"IF(E581=0,0,IMPRIMIR!$D$3)","v":0},0,{"$f":"IMPRIMIR!B580","v":0},{"$f":"IMPRIMIR!C580","v":0},{"$f":"IF(E581=0,0,IMPRIMIR!D580)","v":0},{"$f":"IF(E581=0,0,IMPRIMIR!E580)","v":0},0,0,0]
[null,{"$f":"IF(E582=0,0,IMPRIMIR!A581)","v":0},{"$f":"IF(E582=0,0,IMPRIMIR!$D$3)","v":0},0,{"$f":"IMPRIMIR!B581","v":0},{"$f":"IMPRIMIR!C581","v":0},{"$f":"IF(E582=0,0,IMPRIMIR!D581)","v":0},{"$f":"IF(E582=0,0,IMPRIMIR!E581)","v":0},0,0,0]
[null,{"$f":"IF(E583=0,0,IMPRIMIR!A582)","v":0},{"$f":"IF(E583=0,0,IMPRIMIR!$D$3)","v":0},0,{"$f":"IMPRIMIR!B582","v":0},{"$f":"IMPRIMIR!C582","v":0},{"$f":"IF(E583=0,0,IMPRIMIR!D582)","v":0},{"$f":"IF(E583=0,0,IMPRIMIR!E582)","v":0},0,0,0]
[null,{"$f":"IF(E584=0,0,IMPRIMIR!A583)","v":0},{"$f":"IF(E584=0,0,IMPRIMIR!$D$3)","v":0},0,{"$f":"IMPRIMIR!B583","v":0},{"$f":"IMPRIMIR!C583","v":0},{"$f":"IF(E584=0,0,IMPRIMIR!D583)","v":0},{"$f":"IF(E584=0,0,IMPRIMIR!E583)","v":0},0,0,0]
[null,{"$f":"IF(E585=0,0,IMPRIMIR!A584)","v":0},{"$f":"IF(E585=0,0,IMPRIMIR!$D$3)","v":0},0,{"$f":"IMPRIMIR!B584","v":0},{"$f":"IMPRIMIR!C584","v":0},{"$f":"IF(E585=0,0,IMPRIMIR!D584)","v":0},{"$f":"IF(E585=0,0,IMPRIMIR!E584)","v":0},0,0,0]
[null,{"$f":"IF(E586=0,0,IMPRIMIR!A585)","v":0},{"$f":"IF(E586=0,0,IMPRIMIR!$D$3)","v":0},0,{"$f":"IMPRIMIR!B585","v":0},{"$f":"IMPRIMIR!C585","v":0},{"$f":"IF(E586=0,0,IMPRIMIR!D585)","v":0},{"$f":"IF(E586=0,0,IMPRIMIR!E585)","v":0},0,0,0]
[null,{"$f":"IF(E587=0,0,IMPRIMIR!A586)","v":0},{"$f":"IF(E587=0,0,IMPRIMIR!$D$3)","v":0},0,{"$f":"IMPRIMIR!B586","v":0},{"$f":"IMPRIMIR!C586","v":0},{"$f":"IF(E587=0,0,IMPRIMIR!D586)","v":0},{"$f":"IF(E587=0,0,IMPRIMIR!E586)","v":0},0,0,0]
[null,{"$f":"IF(E588=0,0,IMPRIMIR!A587)","v":0},{"$f":"IF(E588=0,0,IMPRIMIR!$D$3)","v":0},0,{"$f":"IMPRIMIR!B587","v":0},{"$f":"IMPRIMIR!C587","v":0},{"$f":"IF(E588=0,0,IMPRIMIR!D587)","v":0},{"$f":"IF(E588=0,0,IMPRIMIR!E587)","v":0},0,0,0]
[null,{"$f":"IF(E589=0,0,IMPRIMIR!A588)","v":0},{"$f":"IF(E589=0,0,IMPRIMIR!$D$3)","v":0},0,{"$f":"IMPRIMIR!B588","v":0},{"$f":"IMPRIMIR!C588","v":0},{"$f":"IF(E589=0,0,IMPRIMIR!D588)","v":0},{"$f":"IF(E589=0,0,IMPRIMIR!E588)","v":0},0,0,0]
[null,{"$f":"IF(E590=0,0,IMPRIMIR!A589)","v":0},{"$f":"IF(E590=0,0,IMPRIMIR!$D$3)","v":0},0,{"$f":"IMPRIMIR!B589","v":0},{"$f":"IMPRIMIR!C589","v":0},{"$f":"IF(E590=0,0,IMPRIMIR!D589)","v":0},{"$f":"IF(E590=0,0,IMPRIMIR!E589)","v":0},0,0,0]
[null,{"$f":"IF(E591=0,0,IMPRIMIR!A590)","v":0},{"$f":"IF(E591=0,0,IMPRIMIR!$D$3)","v":0},{"$f":"IF(E591=\"0\",0,$G$2)","v":0},{"$f":"IMPRIMIR!B590","v":0},{"$f":"IMPRIMIR!C590","v":0},{"$f":"IF(E591=0,0,IMPRIMIR!D590)","v":0},{"$f":"IF(E591=0,0,IMPRIMIR!E590)","v":0},{"$f":"IF(E591=0,0,$G$2)","v":0},{"$f":"IF(E591=0,0,$G$4)","v":0},{"$f":"IF(E591=0,0,$G$3)","v":0}]
[null,{"$f":"IF(E592=0,0,IMPRIMIR!A591)","v":0},{"$f":"IF(E592=0,0,IMPRIMIR!$D$3)","v":0},0,{"$f":"IMPRIMIR!B591","v":0},{"$f":"IMPRIMIR!C591","v":0},{"$f":"IF(E592=0,0,IMPRIMIR!D591)","v":0},{"$f":"IF(E592=0,0,IMPRIMIR!E591)","v":0},0,0,0]
[null,{"$f":"IF(E593=0,0,IMPRIMIR!A592)","v":0},{"$f":"IF(E593=0,0,IMPRIMIR!$D$3)","v":0},0,{"$f":"IMPRIMIR!B592","v":0},{"$f":"IMPRIMIR!C592","v":0},{"$f":"IF(E593=0,0,IMPRIMIR!D592)","v":0},{"$f":"IF(E593=0,0,IMPRIMIR!E592)","v":0},0,0,0]
[null,{"$f":"IF(E594=0,0,IMPRIMIR!A593)","v":0},{"$f":"IF(E594=0,0,IMPRIMIR!$D$3)","v":0},0,{"$f":"IMPRIMIR!B593","v":0},{"$f":"IMPRIMIR!C593","v":0},{"$f":"IF(E594=0,0,IMPRIMIR!D593)","v":0},{"$f":"IF(E594=0,0,IMPRIMIR!E593)","v":0},0,0,0]
[null,{"$f":"IF(E595=0,0,IMPRIMIR!A594)","v":0},{"$f":"IF(E595=0,0,IMPRIMIR!$D$3)","v":0},0,{"$f":"IMPRIMIR!B594","v":0},{"$f":"IMPRIMIR!C594","v":0},{"$f":"IF(E595=0,0,IMPRIMIR!D594)","v":0},{"$f":"IF(E595=0,0,IMPRIMIR!E594)","v":0},0,0,0]
[null,{"$f":"IF(E596=0,0,IMPRIMIR!A595)","v":0},{"$f":"IF(E596=0,0,IMPRIMIR!$D$3)","v":0},0,{"$f":"IMPRIMIR!B595","v":0},{"$f":"IMPRIMIR!C595","v":0},{"$f":"IF(E596=0,0,IMPRIMIR!D595)","v":0},{"$f":"IF(E596=0,0,IMPRIMIR!E595)","v":0},0,0,0]
[null,{"$f":"IF(E597=0,0,IMPRIMIR!A596)","v":0},{"$f":"IF(E597=0,0,IMPRIMIR!$D$3)","v":0},0,{"$f":"IMPRIMIR!B596","v":0},{"$f":"IMPRIMIR!C596","v":0},{"$f":"IF(E597=0,0,IMPRIMIR!D596)","v":0},{"$f":"IF(E597=0,0,IMPRIMIR!E596)","v":0},0,0,0]
[null,{"$f":"IF(E598=0,0,IMPRIMIR!A597)","v":0},{"$f":"IF(E598=0,0,IMPRIMIR!$D$3)","v":0},0,{"$f":"IMPRIMIR!B597","v":0},{"$f":"IMPRIMIR!C597","v":0},{"$f":"IF(E598=0,0,IMPRIMIR!D597)","v":0},{"$f":"IF(E598=0,0,IMPRIMIR!E597)","v":0},0,0,0]
[null,{"$f":"IF(E599=0,0,IMPRIMIR!A598)","v":0},{"$f":"IF(E599=0,0,IMPRIMIR!$D$3)","v":0},0,{"$f":"IMPRIMIR!B598","v":0},{"$f":"IMPRIMIR!C598","v":0},{"$f":"IF(E599=0,0,IMPRIMIR!D598)","v":0},{"$f":"IF(E599=0,0,IMPRIMIR!E598)","v":0},0,0,0]
[null,{"$f":"IF(E600=0,0,IMPRIMIR!A599)","v":0},{"$f":"IF(E600=0,0,IMPRIMIR!$D$3)","v":0},0,{"$f":"IMPRIMIR!B599","v":0},{"$f":"IMPRIMIR!C599","v":0},{"$f":"IF(E600=0,0,IMPRIMIR!D599)","v":0},{"$f":"IF(E600=0,0,IMPRIMIR!E599)","v":0},0,0,0]
[null,{"$f":"IF(E601=0,0,IMPRIMIR!A600)","v":0},{"$f":"IF(E601=0,0,IMPRIMIR!$D$3)","v":0},0,{"$f":"IMPRIMIR!B600","v":0},{"$f":"IMPRIMIR!C600","v":0},{"$f":"IF(E601=0,0,IMPRIMIR!D600)","v":0},{"$f":"IF(E601=0,0,IMPRIMIR!E600)","v":0},0,0,0]
[null,{"$f":"IF(E602=0,0,IMPRIMIR!A601)","v":0},{"$f":"IF(E602=0,0,IMPRIMIR!$D$3)","v":0},0,{"$f":"IMPRIMIR!B601","v":0},{"$f":"IMPRIMIR!C601","v":0},{"$f":"IF(E602=0,0,IMPRIMIR!D601)","v":0},{"$f":"IF(E602=0,0,IMPRIMIR!E601)","v":0},0,0,0]
[null,{"$f":"IF(E603=0,0,IMPRIMIR!A602)","v":0},{"$f":"IF(E603=0,0,IMPRIMIR!$D$3)","v":0},0,{"$f":"IMPRIMIR!B602","v":0},{"$f":"IMPRIMIR!C602","v":0},{"$f":"IF(E603=0,0,IMPRIMIR!D602)","v":0},{"$f":"IF(E603=0,0,IMPRIMIR!E602)","v":0},0,0,0]
[null,{"$f":"IF(E604=0,0,IMPRIMIR!A603)","v":0},{"$f":"IF(E604=0,0,IMPRIMIR!$D$3)","v":0},0,{"$f":"IMPRIMIR!B603","v":0},{"$f":"IMPRIMIR!C603","v":0},{"$f":"IF(E604=0,0,IMPRIMIR!D603)","v":0},{"$f":"IF(E604=0,0,IMPRIMIR!E603)","v":0},0,0,0]
[null,{"$f":"IF(E605=0,0,IMPRIMIR!A604)","v":0},{"$f":"IF(E605=0,0,IMPRIMIR!$D$3)","v":0},0,{"$f":"IMPRIMIR!B604","v":0},{"$f":"IMPRIMIR!C604","v":0},{"$f":"IF(E605=0,0,IMPRIMIR!D604)","v":0},{"$f":"IF(E605=0,0,IMPRIMIR!E604)","v":0},0,0,0]
[null,{"$f":"IF(E606=0,0,IMPRIMIR!A605)","v":0},{"$f":"IF(E606=0,0,IMPRIMIR!$D$3)","v":0},0,{"$f":"IMPRIMIR!B605","v":0},{"$f":"IMPRIMIR!C605","v":0},{"$f":"IF(E606=0,0,IMPRIMIR!D605)","v":0},{"$f":"IF(E606=0,0,IMPRIMIR!E605)","v":0},0,0,0]
[null,{"$f":"IF(E607=0,0,IMPRIMIR!A606)","v":0},{"$f":"IF(E607=0,0,IMPRIMIR!$D$3)","v":0},0,{"$f":"IMPRIMIR!B606","v":0},{"$f":"IMPRIMIR!C606","v":0},{"$f":"IF(E607=0,0,IMPRIMIR!D606)","v":0},{"$f":"IF(E607=0,0,IMPRIMIR!E606)","v":0},0,0,0]
[null,{"$f":"IF(E608=0,0,IMPRIMIR!A607)","v":0},{"$f":"IF(E608=0,0,IMPRIMIR!$D$3)","v":0},0,{"$f":"IMPRIMIR!B607","v":0},{"$f":"IMPRIMIR!C607","v":0},{"$f":"IF(E608=0,0,IMPRIMIR!D607)","v":0},{"$f":"IF(E608=0,0,IMPRIMIR!E607)","v":0},0,0,0]
[null,{"$f":"IF(E609=0,0,IMPRIMIR!A608)","v":0},{"$f":"IF(E609=0,0,IMPRIMIR!$D$3)","v":0},0,{"$f":"IMPRIMIR!B608","v":0},{"$f":"IMPRIMIR!C608","v":0},{"$f":"IF(E609=0,0,IMPRIMIR!D608)","v":0},{"$f":"IF(E609=0,0,IMPRIMIR!E608)","v":0},0,0,0]
[null,{"$f":"IF(E610=0,0,IMPRIMIR!A609)","v":0},{"$f":"IF(E610=0,0,IMPRIMIR!$D$3)","v":0},0,{"$f":"IMPRIMIR!B609","v":0},{"$f":"IMPRIMIR!C609","v":0},{"$f":"IF(E610=0,0,IMPRIMIR!D609)","v":0},{"$f":"IF(E610=0,0,IMPRIMIR!E609)","v":0},0,0,0]
[null,{"$f":"IF(E611=0,0,IMPRIMIR!A610)","v":0},{"$f":"IF(E611=0,0,IMPRIMIR!$D$3)","v":0},0,{"$f":"IMPRIMIR!B610","v":0},{"$f":"IMPRIMIR!C610","v":0},{"$f":"IF(E611=0,0,IMPRIMIR!D610)","v":0},{"$f":"IF(E611=0,0,IMPRIMIR!E610)","v":0},0,0,0]
[null,{"$f":"IF(E612=0,0,IMPRIMIR!A611)","v":0},{"$f":"IF(E612=0,0,IMPRIMIR!$D$3)","v":0},0,{"$f":"IMPRIMIR!B611","v":0},{"$f":"IMPRIMIR!C611","v":0},{"$f":"IF(E612=0,0,IMPRIMIR!D611)","v":0},{"$f":"IF(E612=0,0,IMPRIMIR!E611)","v":0},0,0,0]
[null,{"$f":"IF(E613=0,0,IMPRIMIR!A612)","v":0},{"$f":"IF(E613=0,0,IMPRIMIR!$D$3)","v":0},0,{"$f":"IMPRIMIR!B612","v":0},{"$f":"IMPRIMIR!C612","v":0},{"$f":"IF(E613=0,0,IMPRIMIR!D612)","v":0},{"$f":"IF(E613=0,0,IMPRIMIR!E612)","v":0},0,0,0]
[null,{"$f":"IF(E614=0,0,IMPRIMIR!A613)","v":0},{"$f":"IF(E614=0,0,IMPRIMIR!$D$3)","v":0},0,{"$f":"IMPRIMIR!B613","v":0},{"$f":"IMPRIMIR!C613","v":0},{"$f":"IF(E614=0,0,IMPRIMIR!D613)","v":0},{"$f":"IF(E614=0,0,IMPRIMIR!E613)","v":0},0,0,0]
[null,{"$f":"IF(E615=0,0,IMPRIMIR!A614)","v":0},{"$f":"IF(E615=0,0,IMPRIMIR!$D$3)","v":0},0,{"$f":"IMPRIMIR!B614","v":0},{"$f":"IMPRIMIR!C614","v":0},{"$f":"IF(E615=0,0,IMPRIMIR!D614)","v":0},{"$f":"IF(E615=0,0,IMPRIMIR!E614)","v":0},0,0,0]
[null,{"$f":"IF(E616=0,0,IMPRIMIR!A615)","v":0},{"$f":"IF(E616=0,0,IMPRIMIR!$D$3)","v":0},0,{"$f":"IMPRIMIR!B615","v":0},{"$f":"IMPRIMIR!C615","v":0},{"$f":"IF(E616=0,0,IMPRIMIR!D615)","v":0},{"$f":"IF(E616=0,0,IMPRIMIR!E615)","v":0},0,0,0]
[null,{"$f":"IF(E617=0,0,IMPRIMIR!A616)","v":0},{"$f":"IF(E617=0,0,IMPRIMIR!$D$3)","v":0},0,{"$f":"IMPRIMIR!B616","v":0},{"$f":"IMPRIMIR!C616","v":0},{"$f":"IF(E617=0,0,IMPRIMIR!D616)","v":0},{"$f":"IF(E617=0,0,IMPRIMIR!E616)","v":0},0,0,0]
[null,{"$f":"IF(E618=0,0,IMPRIMIR!A617)","v":0},{"$f":"IF(E618=0,0,IMPRIMIR!$D$3)","v":0},0,{"$f":"IMPRIMIR!B617","v":0},{"$f":"IMPRIMIR!C617","v":0},{"$f":"IF(E618=0,0,IMPRIMIR!D617)","v":0},{"$f":"IF(E618=0,0,IMPRIMIR!E617)","v":0},0,0,0]
[null,{"$f":"IF(E619=0,0,IMPRIMIR!A618)","v":0},{"$f":"IF(E619=0,0,IMPRIMIR!$D$3)","v":0},0,{"$f":"IMPRIMIR!B618","v":0},{"$f":"IMPRIMIR!C618","v":0},{"$f":"IF(E619=0,0,IMPRIMIR!D618)","v":0},{"$f":"IF(E619=0,0,IMPRIMIR!E618)","v":0},0,0,0]
[null,{"$f":"IF(E620=0,0,IMPRIMIR!A619)","v":0},{"$f":"IF(E620=0,0,IMPRIMIR!$D$3)","v":0},0,{"$f":"IMPRIMIR!B619","v":0},{"$f":"IMPRIMIR!C619","v":0},{"$f":"IF(E620=0,0,IMPRIMIR!D619)","v":0},{"$f":"IF(E620=0,0,IMPRIMIR!E619)","v":0},0,0,0]
[null,{"$f":"IF(E621=0,0,IMPRIMIR!A620)","v":0},{"$f":"IF(E621=0,0,IMPRIMIR!$D$3)","v":0},0,{"$f":"IMPRIMIR!B620","v":0},{"$f":"IMPRIMIR!C620","v":0},{"$f":"IF(E621=0,0,IMPRIMIR!D620)","v":0},{"$f":"IF(E621=0,0,IMPRIMIR!E620)","v":0},0,0,0]
[null,{"$f":"IF(E622=0,0,IMPRIMIR!A621)","v":0},{"$f":"IF(E622=0,0,IMPRIMIR!$D$3)","v":0},0,{"$f":"IMPRIMIR!B621","v":0},{"$f":"IMPRIMIR!C621","v":0},{"$f":"IF(E622=0,0,IMPRIMIR!D621)","v":0},{"$f":"IF(E622=0,0,IMPRIMIR!E621)","v":0},0,0,0]
[null,{"$f":"IF(E623=0,0,IMPRIMIR!A622)","v":0},{"$f":"IF(E623=0,0,IMPRIMIR!$D$3)","v":0},0,{"$f":"IMPRIMIR!B622","v":0},{"$f":"IMPRIMIR!C622","v":0},{"$f":"IF(E623=0,0,IMPRIMIR!D622)","v":0},{"$f":"IF(E623=0,0,IMPRIMIR!E622)","v":0},0,0,0]
[null,{"$f":"IF(E624=0,0,IMPRIMIR!A623)","v":0},{"$f":"IF(E624=0,0,IMPRIMIR!$D$3)","v":0},0,{"$f":"IMPRIMIR!B623","v":0},{"$f":"IMPRIMIR!C623","v":0},{"$f":"IF(E624=0,0,IMPRIMIR!D623)","v":0},{"$f":"IF(E624=0,0,IMPRIMIR!E623)","v":0},0,0,0]
[null,{"$f":"IF(E625=0,0,IMPRIMIR!A624)","v":0},{"$f":"IF(E625=0,0,IMPRIMIR!$D$3)","v":0},0,{"$f":"IMPRIMIR!B624","v":0},{"$f":"IMPRIMIR!C624","v":0},{"$f":"IF(E625=0,0,IMPRIMIR!D624)","v":0},{"$f":"IF(E625=0,0,IMPRIMIR!E624)","v":0},0,0,0]
[null,{"$f":"IF(E626=0,0,IMPRIMIR!A625)","v":0},{"$f":"IF(E626=0,0,IMPRIMIR!$D$3)","v":0},0,{"$f":"IMPRIMIR!B625","v":0},{"$f":"IMPRIMIR!C625","v":0},{"$f":"IF(E626=0,0,IMPRIMIR!D625)","v":0},{"$f":"IF(E626=0,0,IMPRIMIR!E625)","v":0},0,0,0]
[null,{"$f":"IF(E627=0,0,IMPRIMIR!A626)","v":0},{"$f":"IF(E627=0,0,IMPRIMIR!$D$3)","v":0},0,{"$f":"IMPRIMIR!B626","v":0},{"$f":"IMPRIMIR!C626","v":0},{"$f":"IF(E627=0,0,IMPRIMIR!D626)","v":0},{"$f":"IF(E627=0,0,IMPRIMIR!E626)","v":0},0,0,0]
[null,{"$f":"IF(E628=0,0,IMPRIMIR!A627)","v":0},{"$f":"IF(E628=0,0,IMPRIMIR!$D$3)","v":0},0,{"$f":"IMPRIMIR!B627","v":0},{"$f":"IMPRIMIR!C627","v":0},{"$f":"IF(E628=0,0,IMPRIMIR!D627)","v":0},{"$f":"IF(E628=0,0,IMPRIMIR!E627)","v":0},0,0,0]
[null,{"$f":"IF(E629=0,0,IMPRIMIR!A628)","v":0},{"$f":"IF(E629=0,0,IMPRIMIR!$D$3)","v":0},0,{"$f":"IMPRIMIR!B628","v":0},{"$f":"IMPRIMIR!C628","v":0},{"$f":"IF(E629=0,0,IMPRIMIR!D628)","v":0},{"$f":"IF(E629=0,0,IMPRIMIR!E628)","v":0},0,0,0]
[null,{"$f":"IF(E630=0,0,IMPRIMIR!A629)","v":0},{"$f":"IF(E630=0,0,IMPRIMIR!$D$3)","v":0},0,{"$f":"IMPRIMIR!B629","v":0},{"$f":"IMPRIMIR!C629","v":0},{"$f":"IF(E630=0,0,IMPRIMIR!D629)","v":0},{"$f":"IF(E630=0,0,IMPRIMIR!E629)","v":0},0,0,0]
[null,{"$f":"IF(E631=0,0,IMPRIMIR!A630)","v":0},{"$f":"IF(E631=0,0,IMPRIMIR!$D$3)","v":0},0,{"$f":"IMPRIMIR!B630","v":0},{"$f":"IMPRIMIR!C630","v":0},{"$f":"IF(E631=0,0,IMPRIMIR!D630)","v":0},{"$f":"IF(E631=0,0,IMPRIMIR!E630)","v":0},0,0,0]
[null,{"$f":"IF(E632=0,0,IMPRIMIR!A631)","v":0},{"$f":"IF(E632=0,0,IMPRIMIR!$D$3)","v":0},0,{"$f":"IMPRIMIR!B631","v":0},{"$f":"IMPRIMIR!C631","v":0},{"$f":"IF(E632=0,0,IMPRIMIR!D631)","v":0},{"$f":"IF(E632=0,0,IMPRIMIR!E631)","v":0},0,0,0]
[null,{"$f":"IF(E633=0,0,IMPRIMIR!A632)","v":0},{"$f":"IF(E633=0,0,IMPRIMIR!$D$3)","v":0},0,{"$f":"IMPRIMIR!B632","v":0},{"$f":"IMPRIMIR!C632","v":0},{"$f":"IF(E633=0,0,IMPRIMIR!D632)","v":0},{"$f":"IF(E633=0,0,IMPRIMIR!E632)","v":0},0,0,0]
[null,{"$f":"IF(E634=0,0,IMPRIMIR!A633)","v":0},{"$f":"IF(E634=0,0,IMPRIMIR!$D$3)","v":0},0,{"$f":"IMPRIMIR!B633","v":0},{"$f":"IMPRIMIR!C633","v":0},{"$f":"IF(E634=0,0,IMPRIMIR!D633)","v":0},{"$f":"IF(E634=0,0,IMPRIMIR!E633)","v":0},0,0,0]
[null,{"$f":"IF(E635=0,0,IMPRIMIR!A634)","v":0},{"$f":"IF(E635=0,0,IMPRIMIR!$D$3)","v":0},0,{"$f":"IMPRIMIR!B634","v":0},{"$f":"IMPRIMIR!C634","v":0},{"$f":"IF(E635=0,0,IMPRIMIR!D634)","v":0},{"$f":"IF(E635=0,0,IMPRIMIR!E634)","v":0},0,0,0]
[null,{"$f":"IF(E636=0,0,IMPRIMIR!A635)","v":0},{"$f":"IF(E636=0,0,IMPRIMIR!$D$3)","v":0},0,{"$f":"IMPRIMIR!B635","v":0},{"$f":"IMPRIMIR!C635","v":0},{"$f":"IF(E636=0,0,IMPRIMIR!D635)","v":0},{"$f":"IF(E636=0,0,IMPRIMIR!E635)","v":0},0,0,0]
[null,{"$f":"IF(E637=0,0,IMPRIMIR!A636)","v":0},{"$f":"IF(E637=0,0,IMPRIMIR!$D$3)","v":0},0,{"$f":"IMPRIMIR!B636","v":0},{"$f":"IMPRIMIR!C636","v":0},{"$f":"IF(E637=0,0,IMPRIMIR!D636)","v":0},{"$f":"IF(E637=0,0,IMPRIMIR!E636)","v":0},0,0,0]
[null,{"$f":"IF(E638=0,0,IMPRIMIR!A637)","v":0},{"$f":"IF(E638=0,0,IMPRIMIR!$D$3)","v":0},0,{"$f":"IMPRIMIR!B637","v":0},{"$f":"IMPRIMIR!C637","v":0},{"$f":"IF(E638=0,0,IMPRIMIR!D637)","v":0},{"$f":"IF(E638=0,0,IMPRIMIR!E637)","v":0},0,0,0]
[null,{"$f":"IF(E639=0,0,IMPRIMIR!A638)","v":0},{"$f":"IF(E639=0,0,IMPRIMIR!$D$3)","v":0},0,{"$f":"IMPRIMIR!B638","v":0},{"$f":"IMPRIMIR!C638","v":0},{"$f":"IF(E639=0,0,IMPRIMIR!D638)","v":0},{"$f":"IF(E639=0,0,IMPRIMIR!E638)","v":0},0,0,0]
[null,{"$f":"IF(E640=0,0,IMPRIMIR!A639)","v":0},{"$f":"IF(E640=0,0,IMPRIMIR!$D$3)","v":0},0,{"$f":"IMPRIMIR!B639","v":0},{"$f":"IMPRIMIR!C639","v":0},{"$f":"IF(E640=0,0,IMPRIMIR!D639)","v":0},{"$f":"IF(E640=0,0,IMPRIMIR!E639)","v":0},0,0,0]
[null,{"$f":"IF(E641=0,0,IMPRIMIR!A640)","v":0},{"$f":"IF(E641=0,0,IMPRIMIR!$D$3)","v":0},0,{"$f":"IMPRIMIR!B640","v":0},{"$f":"IMPRIMIR!C640","v":0},{"$f":"IF(E641=0,0,IMPRIMIR!D640)","v":0},{"$f":"IF(E641=0,0,IMPRIMIR!E640)","v":0},0,0,0]
[null,{"$f":"IF(E642=0,0,IMPRIMIR!A641)","v":0},{"$f":"IF(E642=0,0,IMPRIMIR!$D$3)","v":0},0,{"$f":"IMPRIMIR!B641","v":0},{"$f":"IMPRIMIR!C641","v":0},{"$f":"IF(E642=0,0,IMPRIMIR!D641)","v":0},{"$f":"IF(E642=0,0,IMPRIMIR!E641)","v":0},0,0,0]
[null,{"$f":"IF(E643=0,0,IMPRIMIR!A642)","v":0},{"$f":"IF(E643=0,0,IMPRIMIR!$D$3)","v":0},0,{"$f":"IMPRIMIR!B642","v":0},{"$f":"IMPRIMIR!C642","v":0},{"$f":"IF(E643=0,0,IMPRIMIR!D642)","v":0},{"$f":"IF(E643=0,0,IMPRIMIR!E642)","v":0},0,0,0]
[null,{"$f":"IF(E644=0,0,IMPRIMIR!A643)","v":0},{"$f":"IF(E644=0,0,IMPRIMIR!$D$3)","v":0},0,{"$f":"IMPRIMIR!B643","v":0},{"$f":"IMPRIMIR!C643","v":0},{"$f":"IF(E644=0,0,IMPRIMIR!D643)","v":0},{"$f":"IF(E644=0,0,IMPRIMIR!E643)","v":0},0,0,0]
[null,{"$f":"IF(E645=0,0,IMPRIMIR!A644)","v":0},{"$f":"IF(E645=0,0,IMPRIMIR!$D$3)","v":0},0,{"$f":"IMPRIMIR!B644","v":0},{"$f":"IMPRIMIR!C644","v":0},{"$f":"IF(E645=0,0,IMPRIMIR!D644)","v":0},{"$f":"IF(E645=0,0,IMPRIMIR!E644)","v":0},0,0,0]
[null,{"$f":"IF(E646=0,0,IMPRIMIR!A645)","v":0},{"$f":"IF(E646=0,0,IMPRIMIR!$D$3)","v":0},0,{"$f":"IMPRIMIR!B645","v":0},{"$f":"IMPRIMIR!C645","v":0},{"$f":"IF(E646=0,0,IMPRIMIR!D645)","v":0},{"$f":"IF(E646=0,0,IMPRIMIR!E645)","v":0},0,0,0]
[null,{"$f":"IF(E647=0,0,IMPRIMIR!A646)","v":0},{"$f":"IF(E647=0,0,IMPRIMIR!$D$3)","v":0},0,{"$f":"IMPRIMIR!B646","v":0},{"$f":"IMPRIMIR!C646","v":0},{"$f":"IF(E647=0,0,IMPRIMIR!D646)","v":0},{"$f":"IF(E647=0,0,IMPRIMIR!E646)","v":0},0,0,0]
[null,{"$f":"IF(E648=0,0,IMPRIMIR!A647)","v":0},{"$f":"IF(E648=0,0,IMPRIMIR!$D$3)","v":0},0,{"$f":"IMPRIMIR!B647","v":0},{"$f":"IMPRIMIR!C647","v":0},{"$f":"IF(E648=0,0,IMPRIMIR!D647)","v":0},{"$f":"IF(E648=0,0,IMPRIMIR!E647)","v":0},0,0,0]
[null,{"$f":"IF(E649=0,0,IMPRIMIR!A648)","v":0},{"$f":"IF(E649=0,0,IMPRIMIR!$D$3)","v":0},0,{"$f":"IMPRIMIR!B648","v":0},{"$f":"IMPRIMIR!C648","v":0},{"$f":"IF(E649=0,0,IMPRIMIR!D648)","v":0},{"$f":"IF(E649=0,0,IMPRIMIR!E648)","v":0},0,0,0]
[null,{"$f":"IF(E650=0,0,IMPRIMIR!A649)","v":0},{"$f":"IF(E650=0,0,IMPRIMIR!$D$3)","v":0},0,{"$f":"IMPRIMIR!B649","v":0},{"$f":"IMPRIMIR!C649","v":0},{"$f":"IF(E650=0,0,IMPRIMIR!D649)","v":0},{"$f":"IF(E650=0,0,IMPRIMIR!E649)","v":0},0,0,0]
[null,{"$f":"IF(E651=0,0,IMPRIMIR!A650)","v":0},{"$f":"IF(E651=0,0,IMPRIMIR!$D$3)","v":0},0,{"$f":"IMPRIMIR!B650","v":0},{"$f":"IMPRIMIR!C650","v":0},{"$f":"IF(E651=0,0,IMPRIMIR!D650)","v":0},{"$f":"IF(E651=0,0,IMPRIMIR!E650)","v":0},0,0,0]
[null,{"$f":"IF(E652=0,0,IMPRIMIR!A651)","v":0},{"$f":"IF(E652=0,0,IMPRIMIR!$D$3)","v":0},0,{"$f":"IMPRIMIR!B651","v":0},{"$f":"IMPRIMIR!C651","v":0},{"$f":"IF(E652=0,0,IMPRIMIR!D651)","v":0},{"$f":"IF(E652=0,0,IMPRIMIR!E651)","v":0},0,0,0]
[null,{"$f":"IF(E653=0,0,IMPRIMIR!A652)","v":0},{"$f":"IF(E653=0,0,IMPRIMIR!$D$3)","v":0},0,{"$f":"IMPRIMIR!B652","v":0},{"$f":"IMPRIMIR!C652","v":0},{"$f":"IF(E653=0,0,IMPRIMIR!D652)","v":0},{"$f":"IF(E653=0,0,IMPRIMIR!E652)","v":0},0,0,0]
[null,{"$f":"IF(E654=0,0,IMPRIMIR!A653)","v":0},{"$f":"IF(E654=0,0,IMPRIMIR!$D$3)","v":0},0,{"$f":"IMPRIMIR!B653","v":0},{"$f":"IMPRIMIR!C653","v":0},{"$f":"IF(E654=0,0,IMPRIMIR!D653)","v":0},{"$f":"IF(E654=0,0,IMPRIMIR!E653)","v":0},0,0,0]
[null,{"$f":"IF(E655=0,0,IMPRIMIR!A654)","v":0},{"$f":"IF(E655=0,0,IMPRIMIR!$D$3)","v":0},{"$f":"IF(E655=\"0\",0,$G$2)","v":0},{"$f":"IMPRIMIR!B654","v":0},{"$f":"IMPRIMIR!C654","v":0},{"$f":"IF(E655=0,0,IMPRIMIR!D654)","v":0},{"$f":"IF(E655=0,0,IMPRIMIR!E654)","v":0},{"$f":"IF(E655=0,0,$G$2)","v":0},{"$f":"IF(E655=0,0,$G$4)","v":0},{"$f":"IF(E655=0,0,$G$3)","v":0}]
[null,{"$f":"IF(E656=0,0,IMPRIMIR!A655)","v":0},{"$f":"IF(E656=0,0,IMPRIMIR!$D$3)","v":0},0,{"$f":"IMPRIMIR!B655","v":0},{"$f":"IMPRIMIR!C655","v":0},{"$f":"IF(E656=0,0,IMPRIMIR!D655)","v":0},{"$f":"IF(E656=0,0,IMPRIMIR!E655)","v":0},0,0,0]
[null,{"$f":"IF(E657=0,0,IMPRIMIR!A656)","v":0},{"$f":"IF(E657=0,0,IMPRIMIR!$D$3)","v":0},0,{"$f":"IMPRIMIR!B656","v":0},{"$f":"IMPRIMIR!C656","v":0},{"$f":"IF(E657=0,0,IMPRIMIR!D656)","v":0},{"$f":"IF(E657=0,0,IMPRIMIR!E656)","v":0},0,0,0]
[null,{"$f":"IF(E658=0,0,IMPRIMIR!A657)","v":0},{"$f":"IF(E658=0,0,IMPRIMIR!$D$3)","v":0},0,{"$f":"IMPRIMIR!B657","v":0},{"$f":"IMPRIMIR!C657","v":0},{"$f":"IF(E658=0,0,IMPRIMIR!D657)","v":0},{"$f":"IF(E658=0,0,IMPRIMIR!E657)","v":0},0,0,0]
[null,{"$f":"IF(E659=0,0,IMPRIMIR!A658)","v":0},{"$f":"IF(E659=0,0,IMPRIMIR!$D$3)","v":0},0,{"$f":"IMPRIMIR!B658","v":0},{"$f":"IMPRIMIR!C658","v":0},{"$f":"IF(E659=0,0,IMPRIMIR!D658)","v":0},{"$f":"IF(E659=0,0,IMPRIMIR!E658)","v":0},0,0,0]
[null,{"$f":"IF(E660=0,0,IMPRIMIR!A659)","v":0},{"$f":"IF(E660=0,0,IMPRIMIR!$D$3)","v":0},0,{"$f":"IMPRIMIR!B659","v":0},{"$f":"IMPRIMIR!C659","v":0},{"$f":"IF(E660=0,0,IMPRIMIR!D659)","v":0},{"$f":"IF(E660=0,0,IMPRIMIR!E659)","v":0},0,0,0]
[null,{"$f":"IF(E661=0,0,IMPRIMIR!A660)","v":0},{"$f":"IF(E661=0,0,IMPRIMIR!$D$3)","v":0},0,{"$f":"IMPRIMIR!B660","v":0},{"$f":"IMPRIMIR!C660","v":0},{"$f":"IF(E661=0,0,IMPRIMIR!D660)","v":0},{"$f":"IF(E661=0,0,IMPRIMIR!E660)","v":0},0,0,0]
[null,{"$f":"IF(E662=0,0,IMPRIMIR!A661)","v":0},{"$f":"IF(E662=0,0,IMPRIMIR!$D$3)","v":0},0,{"$f":"IMPRIMIR!B661","v":0},{"$f":"IMPRIMIR!C661","v":0},{"$f":"IF(E662=0,0,IMPRIMIR!D661)","v":0},{"$f":"IF(E662=0,0,IMPRIMIR!E661)","v":0},0,0,0]
[null,{"$f":"IF(E663=0,0,IMPRIMIR!A662)","v":0},{"$f":"IF(E663=0,0,IMPRIMIR!$D$3)","v":0},0,{"$f":"IMPRIMIR!B662","v":0},{"$f":"IMPRIMIR!C662","v":0},{"$f":"IF(E663=0,0,IMPRIMIR!D662)","v":0},{"$f":"IF(E663=0,0,IMPRIMIR!E662)","v":0},0,0,0]
[null,{"$f":"IF(E664=0,0,IMPRIMIR!A663)","v":0},{"$f":"IF(E664=0,0,IMPRIMIR!$D$3)","v":0},0,{"$f":"IMPRIMIR!B663","v":0},{"$f":"IMPRIMIR!C663","v":0},{"$f":"IF(E664=0,0,IMPRIMIR!D663)","v":0},{"$f":"IF(E664=0,0,IMPRIMIR!E663)","v":0},0,0,0]
[null,{"$f":"IF(E665=0,0,IMPRIMIR!A664)","v":0},{"$f":"IF(E665=0,0,IMPRIMIR!$D$3)","v":0},0,{"$f":"IMPRIMIR!B664","v":0},{"$f":"IMPRIMIR!C664","v":0},{"$f":"IF(E665=0,0,IMPRIMIR!D664)","v":0},{"$f":"IF(E665=0,0,IMPRIMIR!E664)","v":0},0,0,0]
[null,{"$f":"IF(E666=0,0,IMPRIMIR!A665)","v":0},{"$f":"IF(E666=0,0,IMPRIMIR!$D$3)","v":0},0,{"$f":"IMPRIMIR!B665","v":0},{"$f":"IMPRIMIR!C665","v":0},{"$f":"IF(E666=0,0,IMPRIMIR!D665)","v":0},{"$f":"IF(E666=0,0,IMPRIMIR!E665)","v":0},0,0,0]
[null,{"$f":"IF(E667=0,0,IMPRIMIR!A666)","v":0},{"$f":"IF(E667=0,0,IMPRIMIR!$D$3)","v":0},0,{"$f":"IMPRIMIR!B666","v":0},{"$f":"IMPRIMIR!C666","v":0},{"$f":"IF(E667=0,0,IMPRIMIR!D666)","v":0},{"$f":"IF(E667=0,0,IMPRIMIR!E666)","v":0},0,0,0]