{"text_format":"1","workbook":"xlsx","n_sheets":6,"sheets":["INSTRUCTIVO","DATOS FIDEIC","PARTES","IMPRIMIR","LISTADOS","BD-GRAL"],"not_rendered":{"charts":0,"images":0,"macros":1,"external_links":0,"defined_names":4,"comments":0,"pivot_tables":0},"unopened":[],"bounds":{"document_bytes":16777216,"sheet_cells":100000,"rows_first":2000,"rows_last":500,"rows_between":2000,"halvings":0,"cell_chars":16384,"cell_head_chars":4096},"cells_cut":0,"cells_raw":0,"read":"whole","date_system":"1900"}

{"sheet":"INSTRUCTIVO","index":0,"n_rows":7,"n_cols":2,"rows_kept":7,"cut":false,"hidden":false,"merged":[[6,1,6,7],[23,1,23,7],[0,0,0,7],[4,1,4,7],[5,1,5,7],[2,1,2,7],[3,1,3,7],[15,1,15,7],[18,1,18,7]]}
["INSTRUCCIONES DE LLENADO -POR FAVOR SEGUIR EL ORDEN-"]
[]
[1,"GUARDAR ARCHIVO:  ELEGIR LA OPCIÓN \"GUARDAR COMO\". PONER NOMBRE DEL FIDEICOMISO Y ELEGIR COMO TIPO: \"ARCHIVO EXCEL HABILITADO PARA MACRO\"."]
[2,"POSICIONARSE EN SOLAPA \"DATOS FIDEIC\", Y COMPLETAR DATOS."]
[3,"POSICIONARSE EN SOLAPA \"PARTES\", Y COMPLETAR DATOS SEGÚN SEA PARTES HUMANO/S O PERSONA/S. JURÍDICA."]
[4,"POSICIONARSE EN SOLAPA \"IMPRIMIR\". DEBE PRESIONAR PRIMERO LOS BOTONES UNO (1º) E IMPRIMIR -IR A LA SOLAPA SUPERIOR DE LA HOJA \"ARCHIVO\" y elegir opción \"IMPRIMIR\"-"]
[5,"UNA VEZ IMPRESA FIRMAR EN TODAS LAS PÁGINAS LOS MIEMBRO/AS, REP. LEGALES, GESTOR, APODERADO/A, ESCRIBANO/A, Y NO PARTES INTERVINIENTES. LA FIRMA SE DEBE CERTIFICAR POR ANTE  JUEZ DE PAZ, O POR ANTE BANCO."]

{"sheet":"DATOS FIDEIC","index":1,"n_rows":36,"n_cols":12,"rows_kept":36,"cut":false,"hidden":false,"merged":[[18,5,18,6],[19,5,19,6],[17,5,17,6],[34,5,34,7],[35,5,35,7],[30,5,30,6],[32,5,32,6],[29,5,29,7],[31,5,31,7],[20,5,20,6],[21,5,21,6],[22,5,22,6],[23,5,23,6],[24,5,24,6],[33,5,33,7],[26,0,28,0],[26,1,28,1],[26,2,28,2],[26,3,26,4],[27,3,28,3],[27,4,28,4],[9,3,9,4],[10,3,10,4],[11,3,11,4],[12,3,12,4],[13,3,13,4],[2,0,2,4],[3,0,3,2],[1,0,1,4],[6,3,8,4],[6,0,8,0],[6,1,8,1],[3,3,3,5],[4,4,4,5],[6,2,8,2]]}
["DATOS FIDEICOMISO"]
["(COMPLETAR CELDAS CON FONDO VERDE)"]
["REGISTRO PÚBLICO DE COMERCIO, Juzgado Pcial. de 1era. Instancia en los Civil, Comercial, Laboral, Minería y Familia, con asiento en la localidad de LAS HERAS -Pcia. de Sta. Cruz, Simón Bolivar 482 (CP9017)-"]
["NOMBRE DEL FIDEICOMISO:"]
[null,null,"FECHA:",null,{"$f":"+IF(D5=0,\"CAMPO OBLIGATORIO, CAUSAL DE RECHAZO\",\"\")","v":"CAMPO OBLIGATORIO, CAUSAL DE RECHAZO"}]
["ANEXO I (GESTIÓN/TRÁMITE)       "]
["REFER.","APELLIDO/s DEL GESTIONANTE","NOMBRE/s DEL DEL GESTIONANTE","DATOS"]
[]
[]
[]
[]
[]
[]
[]
[null,null,null,null,"COMPLETAR"]
[null,null,null,"CONCEPTO"]
[null,null,null,null,"-EN MAYUSCULA -"]
["aa GESTOR",null,null,"TRAMITE QUE SE INICIA:","ELEGIR",{"$f":"+IF(OR(B18=0,C18=0),\"FALTA APELL/NOMB DEL GEST, CAUSAL DE RECHAZO\",\"\")","v":"FALTA APELL/NOMB DEL GEST, CAUSAL DE RECHAZO"},null,null,null,null,null,1]
["ab GESTOR",{"$f":"B$18","v":0},{"$f":"C$18","v":0},"DOMICILIO PROCESAL CONSTITUIDO -art.40 CPCC-:",null,{"$f":"+IF(E19=0,\"CAMPO OBLIGATORIO, CAUSAL DE RECHAZO\",\"\")","v":"CAMPO OBLIGATORIO, CAUSAL DE RECHAZO"},null,null,null,null,null,2]
["ac GESTOR",{"$f":"B$18","v":0},{"$f":"C$18","v":0},"CARÁCTER DEL GESTIONANTE:","ELEGIR",{"$f":"+IF(E20=0,\"CAMPO OBLIGATORIO, CAUSAL DE RECHAZO\",\"\")","v":""},null,null,null,null,null,3]
["ad GESTOR",{"$f":"IF(OR($E$20=\"ESCRIBANO/A\",$E$20=\"APODERADO/A LETRADO/A\"),0,$B18)","v":0},{"$f":"IF(OR($E$20=\"ESCRIBANO/A\",$E$20=\"APODERADO/A LETRADO/A\"),0,$C18)","v":0},{"$f":"IF(OR(E$20=\"ESCRIBANO/A\",E$20=\"APODERADO/A LETRADO/A\"),\"\",\"LETRADO/A/S PATROCINANTE/S:\")","v":"LETRADO/A/S PATROCINANTE/S:"},null,{"$f":"+IF(D21=\"\",\"\",IF(E21=0,\"CAMPO OBLIGATORIO, CAUSAL DE RECHAZO\",\"\"))","v":"CAMPO OBLIGATORIO, CAUSAL DE RECHAZO"},null,null,null,null,null,4]
["ae GESTOR",{"$f":"IF(OR($E$20=\"ESCRIBANO/A\",$E$20=\"APODERADO/A LETRADO/A\"),0,$B19)","v":0},{"$f":"IF(OR($E$20=\"ESCRIBANO/A\",$E$20=\"APODERADO/A LETRADO/A\"),0,$C19)","v":0},{"$f":"IF(OR(E$20=\"ESCRIBANO/A\",E$20=\"APODERADO/A LETRADO/A\"),\"\",\"DOC. IDENTIDAD –sin puntos-:\")","v":"DOC. IDENTIDAD –sin puntos-:"},null,{"$f":"+IF(D22=\"\",\"\",IF(E22=0,\"CAMPO OBLIGATORIO, CAUSAL DE RECHAZO\",\"\"))","v":"CAMPO OBLIGATORIO, CAUSAL DE RECHAZO"},null,null,null,null,null,5]
["af GESTOR",0,0,{"$f":"IF(OR(E$20=\"ESCRIBANO/A\",E$20=\"APODERADO/A LETRADO/A\"),\"\",\"DOMICILIO REAL -indicar Ciudad/Pcia./País\")","v":"DOMICILIO REAL -indicar Ciudad/Pcia./País"},null,"CAMPO OBLIGATORIO, CAUSAL DE RECHAZO",null,null,null,null,null,6]
["ag GESTOR",0,0,{"$f":"IF(OR(E$20=\"ESCRIBANO/A\",E$20=\"APODERADO/A LETRADO/A\"),\"\",\"CEL/TEL -c/código de área, sin puntos o barras-:\")","v":"CEL/TEL -c/código de área, sin puntos o barras-:"},null,"CAMPO OBLIGATORIO, CAUSAL DE RECHAZO",null,null,null,null,null,7]
["ah GESTOR",0,0,{"$f":"IF(OR(E$20=\"ESCRIBANO/A\",E$20=\"APODERADO/A LETRADO/A\"),\"\",\"EMAIL -OBLIGATORIO-:\")","v":"EMAIL -OBLIGATORIO-:"},null,"CAMPO OBLIGATORIO, CAUSAL DE RECHAZO",null,null,null,null,null,8]
["ANEXO II -DATOS DEL FIDEICOMISO-"]
["REFER.","NOMBRE FIDEICOMISO","NOMBRE FIDEICOMISO","DATOS"]
[null,null,null,"CONCEPTO","COMPLETAR -EN MAYUSCULA -"]
[]
["ba FIDEICOMISO",{"$f":"$D$4","v":0},{"$f":"$D$4","v":0},"DIRECCION domicilio legal:",null,{"$f":"+IF(E30=0,\"CAMPO OBLIGATORIO, CAUSAL DE RECHAZO\",\"\")","v":"CAMPO OBLIGATORIO, CAUSAL DE RECHAZO"}]
["ba FIDEICOMISO",{"$f":"$D$4","v":0},0,"CUIT –sin puntos ni barras-:"]
["ba FIDEICOMISO",0,0,"FECHA DE INICIO DEL CONTRATO:",null,{"$f":"+IF(E32=0,\"CAMPO OBLIGATORIO, CAUSAL DE RECHAZO\",\"\")","v":"CAMPO OBLIGATORIO, CAUSAL DE RECHAZO"}]
["ba FIDEICOMISO",0,0,"CAPITAL MÍNIMO A INTEGRAR TOTAL (SOCIOS DE ESTE FORM):",{"$error":"#REF!"},{"$f":"+IF(E33=0,\"CAMPO OBLIGATORIO, CAUSAL DE RECHAZO\",\"\")","v":{"$error":"#REF!"}}]
["ba FIDEICOMISO",0,0,"INDICAR LA FECHA DE CUMPLIMIENTO DEL PLAZO O LA CONDICIÓN -ART. 1668 Cód. Civ. y Com.",null,"CAMPO OBLIGATORIO, CAUSAL DE RECHAZO"]
["ba FIDEICOMISO",0,0,"CEL/TEL (de administración) -en su caso indicar que no posee-:",null,{"$f":"+IF(E35=0,\"CAMPO OBLIGATORIO, CAUSAL DE RECHAZO\",\"\")","v":"CAMPO OBLIGATORIO, CAUSAL DE RECHAZO"}]
["ba FIDEICOMISO",0,0,"EMAIL (de administración)  -en su caso indicar que no posee-:",null,"CAMPO OBLIGATORIO, CAUSAL DE RECHAZO"]

{"sheet":"PARTES","index":2,"n_rows":232,"n_cols":10,"rows_kept":232,"cut":false,"hidden":false,"merged":[[1,0,1,4],[2,0,2,4],[3,0,3,2],[3,3,3,4],[6,8,6,9],[5,0,5,4],[5,6,5,9]]}
[{"$f":"+'DATOS FIDEIC'!A1","v":"DATOS FIDEICOMISO"}]
["(COMPLETAR CELDAS CON FONDO VERDE)"]
[{"$f":"+'DATOS FIDEIC'!A3:E3","v":"REGISTRO PÚBLICO DE COMERCIO, Juzgado Pcial. de 1era. Instancia en los Civil, Comercial, Laboral, Minería y Familia, con asiento en la localidad de LAS HERAS -Pcia. de Sta. Cruz, Simón Bolivar 482 (CP9017)-"}]
["NOMBRE DEL FIDEICOMISO:",null,null,{"$f":"+'DATOS FIDEIC'!D4:E4","v":0}]
[null,"FECHA:",{"$f":"+'DATOS FIDEIC'!D5","v":"00:00:00"}]
["DATOS PARTES PERSONAS HUMANAS",null,null,null,null,null,"DATOS PARTES PERSONAS JURÍDICAS"]
["REFER.","APELLIDO/s DEL PARTE","NOMBRE/s DEL PARTE","DATOS",null,null,"REFER.","RAZON SOCIAL/DENOMINACIÓN PARTE PERSONA JURÍDICA","DATOS"]
["c PARTE PH",null,0,"DOC. IDENTIDAD –sin puntos-:",null,null,"c PARTE PJ",null,"CUIT –sin puntos ni barras-:"]
["c PARTE PH",{"$f":"+B8","v":0},{"$f":"+C8","v":0},"CUIT/CUIL –sin puntos ni barras-:",null,null,"c PARTE PJ",{"$f":"H8","v":0},"TIPO DE PERSONA JCA -FIDEICOMISO, asociación, mutual, etc-:"]
["c PARTE PH",{"$f":"+B9","v":0},{"$f":"+C9","v":0},"FECHA DE NACIMIENTO –dd/mm/aa-:",null,null,"c PARTE PJ",{"$f":"H8","v":0},"ORGANISMO /s DONDE SE INSCRIBIÓ CONSTITUCIÓN (INDICAR LOCALIDAD/PCIA DEL ORG) -si no se inscribió poner: NO INSCRIPTO/A:"]
["c PARTE PH",0,0,"LUGAR DE NACIMIENTO:",null,null,"c PARTE PJ",{"$f":"IF(I11=\"\",0,H8)","v":0},{"$f":"IF(OR(J10=\"NO INSCRIPTO/A\",J10=\"NO INSCR.\", J10=\"NO INSCR\",J10=\"N/I\", J10= \"NO INSCRIPTO\",J10=\"NO INSCRIPTA\"),\"\",\"DATOS DE RESOLUCIÓN Y FECHA DE INSCRIPCIÓN:\")","v":"DATOS DE RESOLUCIÓN Y FECHA DE INSCRIPCIÓN:"}]
["c PARTE PH",0,0,"NACIONALIDAD:",null,null,"c PARTE PJ",{"$f":"IF(I12=\"\",0,H8)","v":0},{"$f":"IF(I11=\"\",\"\",\"FECHA DE INSCRIPCION:\")","v":"FECHA DE INSCRIPCION:"}]
["c PARTE PH",0,0,"PROFESIÓN/OFICIO:",null,null,"c PARTE PJ",{"$f":"H8","v":0},"APELLIDO/S, NOMBRE/S,  DNI Y CARGO DE CADA PARTE DE SU ADMINISTRACIÓN:"]
["c PARTE PH",0,0,"DOMICILIO REAL:",null,null,"c PARTE PJ",{"$f":"IF(AND(J15>0,J14=0),0,H8)","v":0},"DOMICILIO SOCIAL:"]
["c PARTE PH",0,0,"CEL/TEL :",null,null,"c PARTE PJ",{"$f":"IF(AND(J14>0,J15=0),0,H8)","v":0},"SEDE SOCIAL:"]
["c PARTE PH",{"$f":"IF(E16=0,0,B8)","v":0},{"$f":"IF(E16=0,0,C8)","v":0},"EMAIL:",null,null,"c PARTE PJ",{"$f":"H8","v":0},"CEL/TEL :"]
["c PARTE PH",{"$f":"B8","v":0},{"$f":"C8","v":0},"ESTADO CIVIL:",null,null,"c PARTE PJ",{"$f":"H8","v":0},"OBJETO PRINCIPAL (EN FORMA RESUMIDA):"]
["c PARTE PH",{"$f":"IF($E17=\"CASADO/A\",B8,0)","v":0},{"$f":"IF($E17=\"CASADO/A\",C8,0)","v":0},{"$f":"IF(E17=\"CASADO/A\",\"APELLIDO/S CÓNYUGE:\",\"\")","v":""},null,null,"d CONTRIB.",{"$f":"+H8","v":0},"CARÁCTER DE PARTE:","ELEGIR"]
["c PARTE PH",{"$f":"IF($E17=\"CASADO/A\",B8,0)","v":0},{"$f":"IF($E17=\"CASADO/A\",C8,0)","v":0},{"$f":"IF(E17=\"CASADO/A\",\"NOMBRE/S CÓNYUGE:\",\"\")","v":""},null,null,"c PARTE PJ",{"$f":"IF(J19=0,0,H8)","v":0},"NOTA/OBSERVACIÓN -en mayúscula-:"]
["c PARTE PH",{"$f":"IF($E17=\"CASADO/A\",B8,0)","v":0},{"$f":"IF($E17=\"CASADO/A\",C8,0)","v":0},{"$f":"IF(E17=\"CASADO/A\",\"DOC. IDENTIDAD (cónyuge) –sin puntos ni barras-:\",\"\")","v":""},null,null,"c PARTE PJ",null,"CUIT –sin puntos ni barras-:"]
["g CONTRIB.",{"$f":"B8","v":0},{"$f":"B8","v":0},"CARÁCTER DE PARTE:","ELEGIR",null,"c PARTE PJ",{"$f":"H20","v":0},"TIPO DE PERSONA JCA -FIDEICOMISO, asociación, mutual, etc-:"]
["c PARTE PH",{"$f":"IF(E22=0,0,B8)","v":0},{"$f":"IF(E22=0,0,C8)","v":0},"NOTA/OBSERVACIÓN -en mayúscula-:",null,null,"c PARTE PJ",{"$f":"H20","v":0},"ORGANISMO /s DONDE SE INSCRIBIÓ CONSTITUCIÓN (INDICAR LOCALIDAD/PCIA DEL ORG) -si no se inscribió poner: NO INSCRIPTO/A:"]
["c PARTE PH",null,0,"DOC. IDENTIDAD –sin puntos-:",null,null,"c PARTE PJ",{"$f":"IF(I23=\"\",0,H20)","v":0},{"$f":"IF(OR(J22=\"NO INSCRIPTO/A\",J22=\"NO INSCR.\", J22=\"NO INSCR\",J22=\"N/I\", J22= \"NO INSCRIPTO\",J22=\"NO INSCRIPTA\"),\"\",\"DATOS DE RESOLUCIÓN Y FECHA DE INSCRIPCIÓN:\")","v":"DATOS DE RESOLUCIÓN Y FECHA DE INSCRIPCIÓN:"}]
["c PARTE PH",{"$f":"+B23","v":0},{"$f":"+C23","v":0},"CUIT/CUIL –sin puntos ni barras-:",null,null,"c PARTE PJ",{"$f":"IF(I24=\"\",0,H20)","v":0},{"$f":"IF(I23=\"\",\"\",\"FECHA DE INSCRIPCION:\")","v":"FECHA DE INSCRIPCION:"}]
["c PARTE PH",{"$f":"+B24","v":0},0,"FECHA DE NACIMIENTO –dd/mm/aa-:",null,null,"c PARTE PJ",{"$f":"H20","v":0},"APELLIDO/S, NOMBRE/S,  DNI Y CARGO DE CADA PARTE DE SU ADMINISTRACIÓN:"]
["c PARTE PH",0,0,"LUGAR DE NACIMIENTO:",null,null,"c PARTE PJ",{"$f":"IF(AND(J27>0,J26=0),0,H20)","v":0},"DOMICILIO SOCIAL:"]
["c PARTE PH",0,0,"NACIONALIDAD:",null,null,"c PARTE PJ",{"$f":"IF(AND(J26>0,J27=0),0,H20)","v":0},"SEDE SOCIAL:"]
["c PARTE PH",0,0,"PROFESIÓN/OFICIO:",null,null,"c PARTE PJ",{"$f":"H20","v":0},"CEL/TEL :"]
["c PARTE PH",0,0,"DOMICILIO REAL:",null,null,"c PARTE PJ",{"$f":"H20","v":0},"OBJETO PRINCIPAL (EN FORMA RESUMIDA):"]
["c PARTE PH",0,0,"CEL/TEL :",null,null,"d CONTRIB.",{"$f":"+H20","v":0},"CARÁCTER DE PARTE:","ELEGIR"]
["c PARTE PH",{"$f":"IF(E31=0,0,B23)","v":0},{"$f":"IF(E31=0,0,C23)","v":0},"EMAIL:",null,null,"c PARTE PJ",{"$f":"IF(J31=0,0,H20)","v":0},"NOTA/OBSERVACIÓN -en mayúscula-:"]
["c PARTE PH",{"$f":"B23","v":0},{"$f":"C23","v":0},"ESTADO CIVIL:",null,null,"c PARTE PJ",null,"CUIT –sin puntos ni barras-:"]
["c PARTE PH",{"$f":"IF($E32=\"CASADO/A\",B23,0)","v":0},{"$f":"IF($E32=\"CASADO/A\",C23,0)","v":0},{"$f":"IF(E32=\"CASADO/A\",\"APELLIDO/S CÓNYUGE:\",\"\")","v":""},null,null,"c PARTE PJ",{"$f":"H32","v":0},"TIPO DE PERSONA JCA -FIDEICOMISO, asociación, mutual, etc-:"]
["c PARTE PH",{"$f":"IF($E32=\"CASADO/A\",B23,0)","v":0},{"$f":"IF($E32=\"CASADO/A\",C23,0)","v":0},{"$f":"IF(E32=\"CASADO/A\",\"NOMBRE/S CÓNYUGE:\",\"\")","v":""},null,null,"c PARTE PJ",{"$f":"H32","v":0},"ORGANISMO /s DONDE SE INSCRIBIÓ CONSTITUCIÓN (INDICAR LOCALIDAD/PCIA DEL ORG) -si no se inscribió poner: NO INSCRIPTO/A:"]
["c PARTE PH",{"$f":"IF($E32=\"CASADO/A\",B23,0)","v":0},{"$f":"IF($E32=\"CASADO/A\",C23,0)","v":0},{"$f":"IF(E32=\"CASADO/A\",\"DOC. IDENTIDAD (cónyuge) –sin puntos ni barras-:\",\"\")","v":""},null,null,"c PARTE PJ",{"$f":"IF(I35=\"\",0,H32)","v":0},{"$f":"IF(OR(J34=\"NO INSCRIPTO/A\",J34=\"NO INSCR.\", J34=\"NO INSCR\",J34=\"N/I\", J34= \"NO INSCRIPTO\",J34=\"NO INSCRIPTA\"),\"\",\"DATOS DE RESOLUCIÓN Y FECHA DE INSCRIPCIÓN:\")","v":"DATOS DE RESOLUCIÓN Y FECHA DE INSCRIPCIÓN:"}]
["g CONTRIB.",{"$f":"B23","v":0},{"$f":"B23","v":0},"CARÁCTER DE PARTE:","ELEGIR",null,"c PARTE PJ",{"$f":"IF(I36=\"\",0,H32)","v":0},{"$f":"IF(I35=\"\",\"\",\"FECHA DE INSCRIPCION:\")","v":"FECHA DE INSCRIPCION:"}]
["c PARTE PH",{"$f":"IF(E37=0,0,B23)","v":0},{"$f":"IF(E37=0,0,C23)","v":0},"NOTA/OBSERVACIÓN -en mayúscula-:",null,null,"c PARTE PJ",{"$f":"H32","v":0},"APELLIDO/S, NOMBRE/S,  DNI Y CARGO DE CADA PARTE DE SU ADMINISTRACIÓN:"]
["c PARTE PH",null,0,"DOC. IDENTIDAD –sin puntos-:",null,null,"c PARTE PJ",{"$f":"IF(AND(J39>0,J38=0),0,H32)","v":0},"DOMICILIO SOCIAL:"]
["c PARTE PH",{"$f":"+B38","v":0},{"$f":"+C38","v":0},"CUIT/CUIL –sin puntos ni barras-:",null,null,"c PARTE PJ",{"$f":"IF(AND(J38>0,J39=0),0,H32)","v":0},"SEDE SOCIAL:"]
["c PARTE PH",{"$f":"+B39","v":0},0,"FECHA DE NACIMIENTO –dd/mm/aa-:",null,null,"c PARTE PJ",{"$f":"H32","v":0},"CEL/TEL :"]
["c PARTE PH",0,0,"LUGAR DE NACIMIENTO:",null,null,"c PARTE PJ",{"$f":"H32","v":0},"OBJETO PRINCIPAL (EN FORMA RESUMIDA):"]
["c PARTE PH",0,0,"NACIONALIDAD:",null,null,"d CONTRIB.",{"$f":"+H32","v":0},"CARÁCTER DE PARTE:","ELEGIR"]
["c PARTE PH",0,0,"PROFESIÓN/OFICIO:",null,null,"c PARTE PJ",{"$f":"IF(J43=0,0,H32)","v":0},"NOTA/OBSERVACIÓN -en mayúscula-:"]
["c PARTE PH",0,0,"DOMICILIO REAL:",null,null,"c PARTE PJ",null,"CUIT –sin puntos ni barras-:"]
["c PARTE PH",0,0,"CEL/TEL :",null,null,"c PARTE PJ",{"$f":"H44","v":0},"TIPO DE PERSONA JCA -FIDEICOMISO, asociación, mutual, etc-:"]
["c PARTE PH",{"$f":"IF(E46=0,0,B38)","v":0},{"$f":"IF(E46=0,0,C38)","v":0},"EMAIL:",null,null,"c PARTE PJ",{"$f":"H44","v":0},"ORGANISMO /s DONDE SE INSCRIBIÓ CONSTITUCIÓN (INDICAR LOCALIDAD/PCIA DEL ORG) -si no se inscribió poner: NO INSCRIPTO/A:"]
["c PARTE PH",{"$f":"B38","v":0},{"$f":"C38","v":0},"ESTADO CIVIL:",null,null,"c PARTE PJ",{"$f":"IF(I47=\"\",0,H44)","v":0},{"$f":"IF(OR(J46=\"NO INSCRIPTO/A\",J46=\"NO INSCR.\", J46=\"NO INSCR\",J46=\"N/I\", J46= \"NO INSCRIPTO\",J46=\"NO INSCRIPTA\"),\"\",\"DATOS DE RESOLUCIÓN Y FECHA DE INSCRIPCIÓN:\")","v":"DATOS DE RESOLUCIÓN Y FECHA DE INSCRIPCIÓN:"}]
["c PARTE PH",{"$f":"IF($E47=\"CASADO/A\",B38,0)","v":0},{"$f":"IF($E47=\"CASADO/A\",C38,0)","v":0},{"$f":"IF(E47=\"CASADO/A\",\"APELLIDO/S CÓNYUGE:\",\"\")","v":""},null,null,"c PARTE PJ",{"$f":"IF(I48=\"\",0,H44)","v":0},{"$f":"IF(I47=\"\",\"\",\"FECHA DE INSCRIPCION:\")","v":"FECHA DE INSCRIPCION:"}]
["c PARTE PH",{"$f":"IF($E47=\"CASADO/A\",B38,0)","v":0},{"$f":"IF($E47=\"CASADO/A\",C38,0)","v":0},{"$f":"IF(E47=\"CASADO/A\",\"NOMBRE/S CÓNYUGE:\",\"\")","v":""},null,null,"c PARTE PJ",{"$f":"H44","v":0},"APELLIDO/S, NOMBRE/S,  DNI Y CARGO DE CADA PARTE DE SU ADMINISTRACIÓN:"]
["c PARTE PH",{"$f":"IF($E47=\"CASADO/A\",B38,0)","v":0},{"$f":"IF($E47=\"CASADO/A\",C38,0)","v":0},{"$f":"IF(E47=\"CASADO/A\",\"DOC. IDENTIDAD (cónyuge) –sin puntos ni barras-:\",\"\")","v":""},null,null,"c PARTE PJ",{"$f":"IF(AND(J51>0,J50=0),0,H44)","v":0},"DOMICILIO SOCIAL:"]
["g CONTRIB.",{"$f":"B38","v":0},{"$f":"B38","v":0},"CARÁCTER DE PARTE:","ELEGIR",null,"c PARTE PJ",{"$f":"IF(AND(J50>0,J51=0),0,H44)","v":0},"SEDE SOCIAL:"]
["c PARTE PH",{"$f":"IF(E52=0,0,B38)","v":0},{"$f":"IF(E52=0,0,C38)","v":0},"NOTA/OBSERVACIÓN -en mayúscula-:",null,null,"c PARTE PJ",{"$f":"H44","v":0},"CEL/TEL :"]
["c PARTE PH",null,0,"DOC. IDENTIDAD –sin puntos-:",null,null,"c PARTE PJ",{"$f":"H44","v":0},"OBJETO PRINCIPAL (EN FORMA RESUMIDA):"]
["c PARTE PH",{"$f":"+B53","v":0},{"$f":"+C53","v":0},"CUIT/CUIL –sin puntos ni barras-:",null,null,"d CONTRIB.",{"$f":"+H44","v":0},"CARÁCTER DE PARTE:","ELEGIR"]
["c PARTE PH",{"$f":"+B54","v":0},0,"FECHA DE NACIMIENTO –dd/mm/aa-:",null,null,"c PARTE PJ",{"$f":"IF(J55=0,0,H44)","v":0},"NOTA/OBSERVACIÓN -en mayúscula-:"]
["c PARTE PH",0,0,"LUGAR DE NACIMIENTO:",null,null,"c PARTE PJ",null,"CUIT –sin puntos ni barras-:"]
["c PARTE PH",0,0,"NACIONALIDAD:",null,null,"c PARTE PJ",{"$f":"H56","v":0},"TIPO DE PERSONA JCA -FIDEICOMISO, asociación, mutual, etc-:"]
["c PARTE PH",0,0,"PROFESIÓN/OFICIO:",null,null,"c PARTE PJ",{"$f":"H56","v":0},"ORGANISMO /s DONDE SE INSCRIBIÓ CONSTITUCIÓN (INDICAR LOCALIDAD/PCIA DEL ORG) -si no se inscribió poner: NO INSCRIPTO/A:"]
["c PARTE PH",0,0,"DOMICILIO REAL:",null,null,"c PARTE PJ",{"$f":"IF(I59=\"\",0,H56)","v":0},{"$f":"IF(OR(J58=\"NO INSCRIPTO/A\",J58=\"NO INSCR.\", J58=\"NO INSCR\",J58=\"N/I\", J58= \"NO INSCRIPTO\",J58=\"NO INSCRIPTA\"),\"\",\"DATOS DE RESOLUCIÓN Y FECHA DE INSCRIPCIÓN:\")","v":"DATOS DE RESOLUCIÓN Y FECHA DE INSCRIPCIÓN:"}]
["c PARTE PH",0,0,"CEL/TEL :",null,null,"c PARTE PJ",{"$f":"IF(I60=\"\",0,H56)","v":0},{"$f":"IF(I59=\"\",\"\",\"FECHA DE INSCRIPCION:\")","v":"FECHA DE INSCRIPCION:"}]
["c PARTE PH",{"$f":"IF(E61=0,0,B53)","v":0},{"$f":"IF(E61=0,0,C53)","v":0},"EMAIL:",null,null,"c PARTE PJ",{"$f":"H56","v":0},"APELLIDO/S, NOMBRE/S,  DNI Y CARGO DE CADA PARTE DE SU ADMINISTRACIÓN:"]
["c PARTE PH",{"$f":"B53","v":0},{"$f":"C53","v":0},"ESTADO CIVIL:",null,null,"c PARTE PJ",{"$f":"IF(AND(J63>0,J62=0),0,H56)","v":0},"DOMICILIO SOCIAL:"]
["c PARTE PH",{"$f":"IF($E62=\"CASADO/A\",B53,0)","v":0},{"$f":"IF($E62=\"CASADO/A\",C53,0)","v":0},{"$f":"IF(E62=\"CASADO/A\",\"APELLIDO/S CÓNYUGE:\",\"\")","v":""},null,null,"c PARTE PJ",{"$f":"IF(AND(J62>0,J63=0),0,H56)","v":0},"SEDE SOCIAL:"]
["c PARTE PH",{"$f":"IF($E62=\"CASADO/A\",B53,0)","v":0},{"$f":"IF($E62=\"CASADO/A\",C53,0)","v":0},{"$f":"IF(E62=\"CASADO/A\",\"NOMBRE/S CÓNYUGE:\",\"\")","v":""},null,null,"c PARTE PJ",{"$f":"H56","v":0},"CEL/TEL :"]
["c PARTE PH",{"$f":"IF($E62=\"CASADO/A\",B53,0)","v":0},{"$f":"IF($E62=\"CASADO/A\",C53,0)","v":0},{"$f":"IF(E62=\"CASADO/A\",\"DOC. IDENTIDAD (cónyuge) –sin puntos ni barras-:\",\"\")","v":""},null,null,"c PARTE PJ",{"$f":"H56","v":0},"OBJETO PRINCIPAL (EN FORMA RESUMIDA):"]
["g CONTRIB.",{"$f":"B53","v":0},{"$f":"B53","v":0},"CARÁCTER DE PARTE:","ELEGIR",null,"d CONTRIB.",{"$f":"+H56","v":0},"CARÁCTER DE PARTE:","ELEGIR"]
["c PARTE PH",{"$f":"IF(E67=0,0,B53)","v":0},{"$f":"IF(E67=0,0,C53)","v":0},"NOTA/OBSERVACIÓN -en mayúscula-:",null,null,"c PARTE PJ",{"$f":"IF(J67=0,0,H56)","v":0},"NOTA/OBSERVACIÓN -en mayúscula-:"]
["c PARTE PH",null,0,"DOC. IDENTIDAD –sin puntos-:",null,null,"c PARTE PJ",null,"CUIT –sin puntos ni barras-:"]
["c PARTE PH",{"$f":"+B68","v":0},{"$f":"+C68","v":0},"CUIT/CUIL –sin puntos ni barras-:",null,null,"c PARTE PJ",{"$f":"H68","v":0},"TIPO DE PERSONA JCA -FIDEICOMISO, asociación, mutual, etc-:"]
["c PARTE PH",{"$f":"+B69","v":0},0,"FECHA DE NACIMIENTO –dd/mm/aa-:",null,null,"c PARTE PJ",{"$f":"H68","v":0},"ORGANISMO /s DONDE SE INSCRIBIÓ CONSTITUCIÓN (INDICAR LOCALIDAD/PCIA DEL ORG) -si no se inscribió poner: NO INSCRIPTO/A:"]
["c PARTE PH",0,0,"LUGAR DE NACIMIENTO:",null,null,"c PARTE PJ",{"$f":"IF(I71=\"\",0,H68)","v":0},{"$f":"IF(OR(J70=\"NO INSCRIPTO/A\",J70=\"NO INSCR.\", J70=\"NO INSCR\",J70=\"N/I\", J70= \"NO INSCRIPTO\",J70=\"NO INSCRIPTA\"),\"\",\"DATOS DE RESOLUCIÓN Y FECHA DE INSCRIPCIÓN:\")","v":"DATOS DE RESOLUCIÓN Y FECHA DE INSCRIPCIÓN:"}]
["c PARTE PH",0,0,"NACIONALIDAD:",null,null,"c PARTE PJ",{"$f":"IF(I72=\"\",0,H68)","v":0},{"$f":"IF(I71=\"\",\"\",\"FECHA DE INSCRIPCION:\")","v":"FECHA DE INSCRIPCION:"}]
["c PARTE PH",0,0,"PROFESIÓN/OFICIO:",null,null,"c PARTE PJ",{"$f":"H68","v":0},"APELLIDO/S, NOMBRE/S,  DNI Y CARGO DE CADA PARTE DE SU ADMINISTRACIÓN:"]
["c PARTE PH",0,0,"DOMICILIO REAL:",null,null,"c PARTE PJ",{"$f":"IF(AND(J75>0,J74=0),0,H68)","v":0},"DOMICILIO SOCIAL:"]
["c PARTE PH",0,0,"CEL/TEL :",null,null,"c PARTE PJ",{"$f":"IF(AND(J74>0,J75=0),0,H68)","v":0},"SEDE SOCIAL:"]
["c PARTE PH",{"$f":"IF(E76=0,0,B68)","v":0},{"$f":"IF(E76=0,0,C68)","v":0},"EMAIL:",null,null,"c PARTE PJ",{"$f":"H68","v":0},"CEL/TEL :"]
["c PARTE PH",{"$f":"B68","v":0},{"$f":"C68","v":0},"ESTADO CIVIL:",null,null,"c PARTE PJ",{"$f":"H68","v":0},"OBJETO PRINCIPAL (EN FORMA RESUMIDA):"]
["c PARTE PH",{"$f":"IF($E77=\"CASADO/A\",B68,0)","v":0},{"$f":"IF($E77=\"CASADO/A\",C68,0)","v":0},{"$f":"IF(E77=\"CASADO/A\",\"APELLIDO/S CÓNYUGE:\",\"\")","v":""},null,null,"d CONTRIB.",{"$f":"+H68","v":0},"CARÁCTER DE PARTE:","ELEGIR"]
["c PARTE PH",{"$f":"IF($E77=\"CASADO/A\",B68,0)","v":0},{"$f":"IF($E77=\"CASADO/A\",C68,0)","v":0},{"$f":"IF(E77=\"CASADO/A\",\"NOMBRE/S CÓNYUGE:\",\"\")","v":""},null,null,"c PARTE PJ",{"$f":"IF(J79=0,0,H68)","v":0},"NOTA/OBSERVACIÓN -en mayúscula-:"]
["c PARTE PH",{"$f":"IF($E77=\"CASADO/A\",B68,0)","v":0},{"$f":"IF($E77=\"CASADO/A\",C68,0)","v":0},{"$f":"IF(E77=\"CASADO/A\",\"DOC. IDENTIDAD (cónyuge) –sin puntos ni barras-:\",\"\")","v":""},null,null,"c PARTE PJ",null,"CUIT –sin puntos ni barras-:"]
["g CONTRIB.",{"$f":"B68","v":0},{"$f":"B68","v":0},"CARÁCTER DE PARTE:","ELEGIR",null,"c PARTE PJ",{"$f":"H80","v":0},"TIPO DE PERSONA JCA -FIDEICOMISO, asociación, mutual, etc-:"]
["c PARTE PH",{"$f":"IF(E82=0,0,B68)","v":0},{"$f":"IF(E82=0,0,C68)","v":0},"NOTA/OBSERVACIÓN -en mayúscula-:",null,null,"c PARTE PJ",{"$f":"H80","v":0},"ORGANISMO /s DONDE SE INSCRIBIÓ CONSTITUCIÓN (INDICAR LOCALIDAD/PCIA DEL ORG) -si no se inscribió poner: NO INSCRIPTO/A:"]
["c PARTE PH",null,0,"DOC. IDENTIDAD –sin puntos-:",null,null,"c PARTE PJ",{"$f":"IF(I83=\"\",0,H80)","v":0},{"$f":"IF(OR(J82=\"NO INSCRIPTO/A\",J82=\"NO INSCR.\", J82=\"NO INSCR\",J82=\"N/I\", J82= \"NO INSCRIPTO\",J82=\"NO INSCRIPTA\"),\"\",\"DATOS DE RESOLUCIÓN Y FECHA DE INSCRIPCIÓN:\")","v":"DATOS DE RESOLUCIÓN Y FECHA DE INSCRIPCIÓN:"}]
["c PARTE PH",{"$f":"+B83","v":0},{"$f":"+C83","v":0},"CUIT/CUIL –sin puntos ni barras-:",null,null,"c PARTE PJ",{"$f":"IF(I84=\"\",0,H80)","v":0},{"$f":"IF(I83=\"\",\"\",\"FECHA DE INSCRIPCION:\")","v":"FECHA DE INSCRIPCION:"}]
["c PARTE PH",{"$f":"+B84","v":0},0,"FECHA DE NACIMIENTO –dd/mm/aa-:",null,null,"c PARTE PJ",{"$f":"H80","v":0},"APELLIDO/S, NOMBRE/S,  DNI Y CARGO DE CADA PARTE DE SU ADMINISTRACIÓN:"]
["c PARTE PH",0,0,"LUGAR DE NACIMIENTO:",null,null,"c PARTE PJ",{"$f":"IF(AND(J87>0,J86=0),0,H80)","v":0},"DOMICILIO SOCIAL:"]
["c PARTE PH",0,0,"NACIONALIDAD:",null,null,"c PARTE PJ",{"$f":"IF(AND(J86>0,J87=0),0,H80)","v":0},"SEDE SOCIAL:"]
["c PARTE PH",0,0,"PROFESIÓN/OFICIO:",null,null,"c PARTE PJ",{"$f":"H80","v":0},"CEL/TEL :"]
["c PARTE PH",0,0,"DOMICILIO REAL:",null,null,"c PARTE PJ",{"$f":"H80","v":0},"OBJETO PRINCIPAL (EN FORMA RESUMIDA):"]
["c PARTE PH",0,0,"CEL/TEL :",null,null,"d CONTRIB.",{"$f":"+H80","v":0},"CARÁCTER DE PARTE:","ELEGIR"]
["c PARTE PH",{"$f":"IF(E91=0,0,B83)","v":0},{"$f":"IF(E91=0,0,C83)","v":0},"EMAIL:",null,null,"c PARTE PJ",{"$f":"IF(J91=0,0,H80)","v":0},"NOTA/OBSERVACIÓN -en mayúscula-:"]
["c PARTE PH",{"$f":"B83","v":0},{"$f":"C83","v":0},"ESTADO CIVIL:",null,null,"c PARTE PJ",null,"CUIT –sin puntos ni barras-:"]
["c PARTE PH",{"$f":"IF($E92=\"CASADO/A\",B83,0)","v":0},{"$f":"IF($E92=\"CASADO/A\",C83,0)","v":0},{"$f":"IF(E92=\"CASADO/A\",\"APELLIDO/S CÓNYUGE:\",\"\")","v":""},null,null,"c PARTE PJ",{"$f":"H92","v":0},"TIPO DE PERSONA JCA -FIDEICOMISO, asociación, mutual, etc-:"]
["c PARTE PH",{"$f":"IF($E92=\"CASADO/A\",B83,0)","v":0},{"$f":"IF($E92=\"CASADO/A\",C83,0)","v":0},{"$f":"IF(E92=\"CASADO/A\",\"NOMBRE/S CÓNYUGE:\",\"\")","v":""},null,null,"c PARTE PJ",{"$f":"H92","v":0},"ORGANISMO /s DONDE SE INSCRIBIÓ CONSTITUCIÓN (INDICAR LOCALIDAD/PCIA DEL ORG) -si no se inscribió poner: NO INSCRIPTO/A:"]
["c PARTE PH",{"$f":"IF($E92=\"CASADO/A\",B83,0)","v":0},{"$f":"IF($E92=\"CASADO/A\",C83,0)","v":0},{"$f":"IF(E92=\"CASADO/A\",\"DOC. IDENTIDAD (cónyuge) –sin puntos ni barras-:\",\"\")","v":""},null,null,"c PARTE PJ",{"$f":"IF(I95=\"\",0,H92)","v":0},{"$f":"IF(OR(J94=\"NO INSCRIPTO/A\",J94=\"NO INSCR.\", J94=\"NO INSCR\",J94=\"N/I\", J94= \"NO INSCRIPTO\",J94=\"NO INSCRIPTA\"),\"\",\"DATOS DE RESOLUCIÓN Y FECHA DE INSCRIPCIÓN:\")","v":"DATOS DE RESOLUCIÓN Y FECHA DE INSCRIPCIÓN:"}]
["g CONTRIB.",{"$f":"B83","v":0},{"$f":"B83","v":0},"CARÁCTER DE PARTE:","ELEGIR",null,"c PARTE PJ",{"$f":"IF(I96=\"\",0,H92)","v":0},{"$f":"IF(I95=\"\",\"\",\"FECHA DE INSCRIPCION:\")","v":"FECHA DE INSCRIPCION:"}]
["c PARTE PH",{"$f":"IF(E97=0,0,B83)","v":0},{"$f":"IF(E97=0,0,C83)","v":0},"NOTA/OBSERVACIÓN -en mayúscula-:",null,null,"c PARTE PJ",{"$f":"H92","v":0},"APELLIDO/S, NOMBRE/S,  DNI Y CARGO DE CADA PARTE DE SU ADMINISTRACIÓN:"]
["c PARTE PH",null,0,"DOC. IDENTIDAD –sin puntos-:",null,null,"c PARTE PJ",{"$f":"IF(AND(J99>0,J98=0),0,H92)","v":0},"DOMICILIO SOCIAL:"]
["c PARTE PH",{"$f":"+B98","v":0},{"$f":"+C98","v":0},"CUIT/CUIL –sin puntos ni barras-:",null,null,"c PARTE PJ",{"$f":"IF(AND(J98>0,J99=0),0,H92)","v":0},"SEDE SOCIAL:"]
["c PARTE PH",{"$f":"+B99","v":0},0,"FECHA DE NACIMIENTO –dd/mm/aa-:",null,null,"c PARTE PJ",{"$f":"H92","v":0},"CEL/TEL :"]
["c PARTE PH",0,0,"LUGAR DE NACIMIENTO:",null,null,"c PARTE PJ",{"$f":"H92","v":0},"OBJETO PRINCIPAL (EN FORMA RESUMIDA):"]
["c PARTE PH",0,0,"NACIONALIDAD:",null,null,"d CONTRIB.",{"$f":"+H92","v":0},"CARÁCTER DE PARTE:","ELEGIR"]
["c PARTE PH",0,0,"PROFESIÓN/OFICIO:",null,null,"c PARTE PJ",{"$f":"IF(J103=0,0,H92)","v":0},"NOTA/OBSERVACIÓN -en mayúscula-:"]
["c PARTE PH",0,0,"DOMICILIO REAL:",null,null,"c PARTE PJ",null,"CUIT –sin puntos ni barras-:"]
["c PARTE PH",0,0,"CEL/TEL :",null,null,"c PARTE PJ",{"$f":"H104","v":0},"TIPO DE PERSONA JCA -FIDEICOMISO, asociación, mutual, etc-:"]
["c PARTE PH",{"$f":"IF(E106=0,0,B98)","v":0},{"$f":"IF(E106=0,0,C98)","v":0},"EMAIL:",null,null,"c PARTE PJ",{"$f":"H104","v":0},"ORGANISMO /s DONDE SE INSCRIBIÓ CONSTITUCIÓN (INDICAR LOCALIDAD/PCIA DEL ORG) -si no se inscribió poner: NO INSCRIPTO/A:"]
["c PARTE PH",{"$f":"B98","v":0},{"$f":"C98","v":0},"ESTADO CIVIL:",null,null,"c PARTE PJ",{"$f":"IF(I107=\"\",0,H104)","v":0},{"$f":"IF(OR(J106=\"NO INSCRIPTO/A\",J106=\"NO INSCR.\", J106=\"NO INSCR\",J106=\"N/I\", J106= \"NO INSCRIPTO\",J106=\"NO INSCRIPTA\"),\"\",\"DATOS DE RESOLUCIÓN Y FECHA DE INSCRIPCIÓN:\")","v":"DATOS DE RESOLUCIÓN Y FECHA DE INSCRIPCIÓN:"}]
["c PARTE PH",{"$f":"IF($E107=\"CASADO/A\",B98,0)","v":0},{"$f":"IF($E107=\"CASADO/A\",C98,0)","v":0},{"$f":"IF(E107=\"CASADO/A\",\"APELLIDO/S CÓNYUGE:\",\"\")","v":""},null,null,"c PARTE PJ",{"$f":"IF(I108=\"\",0,H104)","v":0},{"$f":"IF(I107=\"\",\"\",\"FECHA DE INSCRIPCION:\")","v":"FECHA DE INSCRIPCION:"}]
["c PARTE PH",{"$f":"IF($E107=\"CASADO/A\",B98,0)","v":0},{"$f":"IF($E107=\"CASADO/A\",C98,0)","v":0},{"$f":"IF(E107=\"CASADO/A\",\"NOMBRE/S CÓNYUGE:\",\"\")","v":""},null,null,"c PARTE PJ",{"$f":"H104","v":0},"APELLIDO/S, NOMBRE/S,  DNI Y CARGO DE CADA PARTE DE SU ADMINISTRACIÓN:"]
["c PARTE PH",{"$f":"IF($E107=\"CASADO/A\",B98,0)","v":0},{"$f":"IF($E107=\"CASADO/A\",C98,0)","v":0},{"$f":"IF(E107=\"CASADO/A\",\"DOC. IDENTIDAD (cónyuge) –sin puntos ni barras-:\",\"\")","v":""},null,null,"c PARTE PJ",{"$f":"IF(AND(J111>0,J110=0),0,H104)","v":0},"DOMICILIO SOCIAL:"]
["g CONTRIB.",{"$f":"B98","v":0},{"$f":"B98","v":0},"CARÁCTER DE PARTE:","ELEGIR",null,"c PARTE PJ",{"$f":"IF(AND(J110>0,J111=0),0,H104)","v":0},"SEDE SOCIAL:"]
["c PARTE PH",{"$f":"IF(E112=0,0,B98)","v":0},{"$f":"IF(E112=0,0,C98)","v":0},"NOTA/OBSERVACIÓN -en mayúscula-:",null,null,"c PARTE PJ",{"$f":"H104","v":0},"CEL/TEL :"]
["c PARTE PH",null,0,"DOC. IDENTIDAD –sin puntos-:",null,null,"c PARTE PJ",{"$f":"H104","v":0},"OBJETO PRINCIPAL (EN FORMA RESUMIDA):"]
["c PARTE PH",{"$f":"+B113","v":0},{"$f":"+C113","v":0},"CUIT/CUIL –sin puntos ni barras-:",null,null,"d CONTRIB.",{"$f":"+H104","v":0},"CARÁCTER DE PARTE:","ELEGIR"]
["c PARTE PH",{"$f":"+B114","v":0},0,"FECHA DE NACIMIENTO –dd/mm/aa-:",null,null,"c PARTE PJ",{"$f":"IF(J115=0,0,H104)","v":0},"NOTA/OBSERVACIÓN -en mayúscula-:"]
["c PARTE PH",0,0,"LUGAR DE NACIMIENTO:",null,null,"c PARTE PJ",null,"CUIT –sin puntos ni barras-:"]
["c PARTE PH",0,0,"NACIONALIDAD:",null,null,"c PARTE PJ",{"$f":"H116","v":0},"TIPO DE PERSONA JCA -FIDEICOMISO, asociación, mutual, etc-:"]
["c PARTE PH",0,0,"PROFESIÓN/OFICIO:",null,null,"c PARTE PJ",{"$f":"H116","v":0},"ORGANISMO /s DONDE SE INSCRIBIÓ CONSTITUCIÓN (INDICAR LOCALIDAD/PCIA DEL ORG) -si no se inscribió poner: NO INSCRIPTO/A:"]
["c PARTE PH",0,0,"DOMICILIO REAL:",null,null,"c PARTE PJ",{"$f":"IF(I119=\"\",0,H116)","v":0},{"$f":"IF(OR(J118=\"NO INSCRIPTO/A\",J118=\"NO INSCR.\", J118=\"NO INSCR\",J118=\"N/I\", J118= \"NO INSCRIPTO\",J118=\"NO INSCRIPTA\"),\"\",\"DATOS DE RESOLUCIÓN Y FECHA DE INSCRIPCIÓN:\")","v":"DATOS DE RESOLUCIÓN Y FECHA DE INSCRIPCIÓN:"}]
["c PARTE PH",0,0,"CEL/TEL :",null,null,"c PARTE PJ",{"$f":"IF(I120=\"\",0,H116)","v":0},{"$f":"IF(I119=\"\",\"\",\"FECHA DE INSCRIPCION:\")","v":"FECHA DE INSCRIPCION:"}]
["c PARTE PH",{"$f":"IF(E121=0,0,B113)","v":0},{"$f":"IF(E121=0,0,C113)","v":0},"EMAIL:",null,null,"c PARTE PJ",{"$f":"H116","v":0},"APELLIDO/S, NOMBRE/S,  DNI Y CARGO DE CADA PARTE DE SU ADMINISTRACIÓN:"]
["c PARTE PH",{"$f":"B113","v":0},{"$f":"C113","v":0},"ESTADO CIVIL:",null,null,"c PARTE PJ",{"$f":"IF(AND(J123>0,J122=0),0,H116)","v":0},"DOMICILIO SOCIAL:"]
["c PARTE PH",{"$f":"IF($E122=\"CASADO/A\",B113,0)","v":0},{"$f":"IF($E122=\"CASADO/A\",C113,0)","v":0},{"$f":"IF(E122=\"CASADO/A\",\"APELLIDO/S CÓNYUGE:\",\"\")","v":""},null,null,"c PARTE PJ",{"$f":"IF(AND(J122>0,J123=0),0,H116)","v":0},"SEDE SOCIAL:"]
["c PARTE PH",{"$f":"IF($E122=\"CASADO/A\",B113,0)","v":0},{"$f":"IF($E122=\"CASADO/A\",C113,0)","v":0},{"$f":"IF(E122=\"CASADO/A\",\"NOMBRE/S CÓNYUGE:\",\"\")","v":""},null,null,"c PARTE PJ",{"$f":"H116","v":0},"CEL/TEL :"]
["c PARTE PH",{"$f":"IF($E122=\"CASADO/A\",B113,0)","v":0},{"$f":"IF($E122=\"CASADO/A\",C113,0)","v":0},{"$f":"IF(E122=\"CASADO/A\",\"DOC. IDENTIDAD (cónyuge) –sin puntos ni barras-:\",\"\")","v":""},null,null,"c PARTE PJ",{"$f":"H116","v":0},"OBJETO PRINCIPAL (EN FORMA RESUMIDA):"]
["g CONTRIB.",{"$f":"B113","v":0},{"$f":"B113","v":0},"CARÁCTER DE PARTE:","ELEGIR",null,"d CONTRIB.",{"$f":"+H116","v":0},"CARÁCTER DE PARTE:","ELEGIR"]
["c PARTE PH",{"$f":"IF(E127=0,0,B113)","v":0},{"$f":"IF(E127=0,0,C113)","v":0},"NOTA/OBSERVACIÓN -en mayúscula-:",null,null,"c PARTE PJ",{"$f":"IF(J127=0,0,H116)","v":0},"NOTA/OBSERVACIÓN -en mayúscula-:"]
["c PARTE PH",null,0,"DOC. IDENTIDAD –sin puntos-:",null,null,"c PARTE PJ",null,"CUIT –sin puntos ni barras-:"]
["c PARTE PH",{"$f":"+B128","v":0},{"$f":"+C128","v":0},"CUIT/CUIL –sin puntos ni barras-:",null,null,"c PARTE PJ",{"$f":"H128","v":0},"TIPO DE PERSONA JCA -FIDEICOMISO, asociación, mutual, etc-:"]
["c PARTE PH",{"$f":"+B129","v":0},0,"FECHA DE NACIMIENTO –dd/mm/aa-:",null,null,"c PARTE PJ",{"$f":"H128","v":0},"ORGANISMO /s DONDE SE INSCRIBIÓ CONSTITUCIÓN (INDICAR LOCALIDAD/PCIA DEL ORG) -si no se inscribió poner: NO INSCRIPTO/A:"]
["c PARTE PH",0,0,"LUGAR DE NACIMIENTO:",null,null,"c PARTE PJ",{"$f":"IF(I131=\"\",0,H128)","v":0},{"$f":"IF(OR(J130=\"NO INSCRIPTO/A\",J130=\"NO INSCR.\", J130=\"NO INSCR\",J130=\"N/I\", J130= \"NO INSCRIPTO\",J130=\"NO INSCRIPTA\"),\"\",\"DATOS DE RESOLUCIÓN Y FECHA DE INSCRIPCIÓN:\")","v":"DATOS DE RESOLUCIÓN Y FECHA DE INSCRIPCIÓN:"}]
["c PARTE PH",0,0,"NACIONALIDAD:",null,null,"c PARTE PJ",{"$f":"IF(I132=\"\",0,H128)","v":0},{"$f":"IF(I131=\"\",\"\",\"FECHA DE INSCRIPCION:\")","v":"FECHA DE INSCRIPCION:"}]
["c PARTE PH",0,0,"PROFESIÓN/OFICIO:",null,null,"c PARTE PJ",{"$f":"H128","v":0},"APELLIDO/S, NOMBRE/S,  DNI Y CARGO DE CADA PARTE DE SU ADMINISTRACIÓN:"]
["c PARTE PH",0,0,"DOMICILIO REAL:",null,null,"c PARTE PJ",{"$f":"IF(AND(J135>0,J134=0),0,H128)","v":0},"DOMICILIO SOCIAL:"]
["c PARTE PH",0,0,"CEL/TEL :",null,null,"c PARTE PJ",{"$f":"IF(AND(J134>0,J135=0),0,H128)","v":0},"SEDE SOCIAL:"]
["c PARTE PH",{"$f":"IF(E136=0,0,B128)","v":0},{"$f":"IF(E136=0,0,C128)","v":0},"EMAIL:",null,null,"c PARTE PJ",{"$f":"H128","v":0},"CEL/TEL :"]
["c PARTE PH",{"$f":"B128","v":0},{"$f":"C128","v":0},"ESTADO CIVIL:",null,null,"c PARTE PJ",{"$f":"H128","v":0},"OBJETO PRINCIPAL (EN FORMA RESUMIDA):"]
["c PARTE PH",{"$f":"IF($E137=\"CASADO/A\",B128,0)","v":0},{"$f":"IF($E137=\"CASADO/A\",C128,0)","v":0},{"$f":"IF(E137=\"CASADO/A\",\"APELLIDO/S CÓNYUGE:\",\"\")","v":""},null,null,"d CONTRIB.",{"$f":"+H128","v":0},"CARÁCTER DE PARTE:","ELEGIR"]
["c PARTE PH",{"$f":"IF($E137=\"CASADO/A\",B128,0)","v":0},{"$f":"IF($E137=\"CASADO/A\",C128,0)","v":0},{"$f":"IF(E137=\"CASADO/A\",\"NOMBRE/S CÓNYUGE:\",\"\")","v":""},null,null,"c PARTE PJ",{"$f":"IF(J139=0,0,H128)","v":0},"NOTA/OBSERVACIÓN -en mayúscula-:"]
["c PARTE PH",{"$f":"IF($E137=\"CASADO/A\",B128,0)","v":0},{"$f":"IF($E137=\"CASADO/A\",C128,0)","v":0},{"$f":"IF(E137=\"CASADO/A\",\"DOC. IDENTIDAD (cónyuge) –sin puntos ni barras-:\",\"\")","v":""}]
["g CONTRIB.",{"$f":"B128","v":0},{"$f":"B128","v":0},"CARÁCTER DE PARTE:","ELEGIR"]
["c PARTE PH",{"$f":"IF(E142=0,0,B128)","v":0},{"$f":"IF(E142=0,0,C128)","v":0},"NOTA/OBSERVACIÓN -en mayúscula-:"]
["c PARTE PH",null,0,"DOC. IDENTIDAD –sin puntos-:"]
["c PARTE PH",{"$f":"+B143","v":0},{"$f":"+C143","v":0},"CUIT/CUIL –sin puntos ni barras-:"]
["c PARTE PH",{"$f":"+B144","v":0},0,"FECHA DE NACIMIENTO –dd/mm/aa-:"]
["c PARTE PH",0,0,"LUGAR DE NACIMIENTO:"]
["c PARTE PH",0,0,"NACIONALIDAD:"]
["c PARTE PH",0,0,"PROFESIÓN/OFICIO:"]
["c PARTE PH",0,0,"DOMICILIO REAL:"]
["c PARTE PH",0,0,"CEL/TEL :"]
["c PARTE PH",{"$f":"IF(E151=0,0,B143)","v":0},{"$f":"IF(E151=0,0,C143)","v":0},"EMAIL:"]
["c PARTE PH",{"$f":"B143","v":0},{"$f":"C143","v":0},"ESTADO CIVIL:"]
["c PARTE PH",{"$f":"IF($E152=\"CASADO/A\",B143,0)","v":0},{"$f":"IF($E152=\"CASADO/A\",C143,0)","v":0},{"$f":"IF(E152=\"CASADO/A\",\"APELLIDO/S CÓNYUGE:\",\"\")","v":""}]
["c PARTE PH",{"$f":"IF($E152=\"CASADO/A\",B143,0)","v":0},{"$f":"IF($E152=\"CASADO/A\",C143,0)","v":0},{"$f":"IF(E152=\"CASADO/A\",\"NOMBRE/S CÓNYUGE:\",\"\")","v":""}]
["c PARTE PH",{"$f":"IF($E152=\"CASADO/A\",B143,0)","v":0},{"$f":"IF($E152=\"CASADO/A\",C143,0)","v":0},{"$f":"IF(E152=\"CASADO/A\",\"DOC. IDENTIDAD (cónyuge) –sin puntos ni barras-:\",\"\")","v":""}]
["g CONTRIB.",{"$f":"B143","v":0},{"$f":"B143","v":0},"CARÁCTER DE PARTE:","ELEGIR"]
["c PARTE PH",{"$f":"IF(E157=0,0,B143)","v":0},{"$f":"IF(E157=0,0,C143)","v":0},"NOTA/OBSERVACIÓN -en mayúscula-:"]
["c PARTE PH",null,0,"DOC. IDENTIDAD –sin puntos-:"]
["c PARTE PH",{"$f":"+B158","v":0},{"$f":"+C158","v":0},"CUIT/CUIL –sin puntos ni barras-:"]
["c PARTE PH",{"$f":"+B159","v":0},0,"FECHA DE NACIMIENTO –dd/mm/aa-:"]
["c PARTE PH",0,0,"LUGAR DE NACIMIENTO:"]
["c PARTE PH",0,0,"NACIONALIDAD:"]
["c PARTE PH",0,0,"PROFESIÓN/OFICIO:"]
["c PARTE PH",0,0,"DOMICILIO REAL:"]
["c PARTE PH",0,0,"CEL/TEL :"]
["c PARTE PH",{"$f":"IF(E166=0,0,B158)","v":0},{"$f":"IF(E166=0,0,C158)","v":0},"EMAIL:"]
["c PARTE PH",{"$f":"B158","v":0},{"$f":"C158","v":0},"ESTADO CIVIL:"]
["c PARTE PH",{"$f":"IF($E167=\"CASADO/A\",B158,0)","v":0},{"$f":"IF($E167=\"CASADO/A\",C158,0)","v":0},{"$f":"IF(E167=\"CASADO/A\",\"APELLIDO/S CÓNYUGE:\",\"\")","v":""}]
["c PARTE PH",{"$f":"IF($E167=\"CASADO/A\",B158,0)","v":0},{"$f":"IF($E167=\"CASADO/A\",C158,0)","v":0},{"$f":"IF(E167=\"CASADO/A\",\"NOMBRE/S CÓNYUGE:\",\"\")","v":""}]
["c PARTE PH",{"$f":"IF($E167=\"CASADO/A\",B158,0)","v":0},{"$f":"IF($E167=\"CASADO/A\",C158,0)","v":0},{"$f":"IF(E167=\"CASADO/A\",\"DOC. IDENTIDAD (cónyuge) –sin puntos ni barras-:\",\"\")","v":""}]
["g CONTRIB.",{"$f":"B158","v":0},{"$f":"B158","v":0},"CARÁCTER DE PARTE:","ELEGIR"]
["c PARTE PH",{"$f":"IF(E172=0,0,B158)","v":0},{"$f":"IF(E172=0,0,C158)","v":0},"NOTA/OBSERVACIÓN -en mayúscula-:"]
["c PARTE PH",null,0,"DOC. IDENTIDAD –sin puntos-:"]
["c PARTE PH",{"$f":"+B173","v":0},{"$f":"+C173","v":0},"CUIT/CUIL –sin puntos ni barras-:"]
["c PARTE PH",{"$f":"+B174","v":0},0,"FECHA DE NACIMIENTO –dd/mm/aa-:"]
["c PARTE PH",0,0,"LUGAR DE NACIMIENTO:"]
["c PARTE PH",0,0,"NACIONALIDAD:"]
["c PARTE PH",0,0,"PROFESIÓN/OFICIO:"]
["c PARTE PH",0,0,"DOMICILIO REAL:"]
["c PARTE PH",0,0,"CEL/TEL :"]
["c PARTE PH",{"$f":"IF(E181=0,0,B173)","v":0},{"$f":"IF(E181=0,0,C173)","v":0},"EMAIL:"]
["c PARTE PH",{"$f":"B173","v":0},{"$f":"C173","v":0},"ESTADO CIVIL:"]
["c PARTE PH",{"$f":"IF($E182=\"CASADO/A\",B173,0)","v":0},{"$f":"IF($E182=\"CASADO/A\",C173,0)","v":0},{"$f":"IF(E182=\"CASADO/A\",\"APELLIDO/S CÓNYUGE:\",\"\")","v":""}]
["c PARTE PH",{"$f":"IF($E182=\"CASADO/A\",B173,0)","v":0},{"$f":"IF($E182=\"CASADO/A\",C173,0)","v":0},{"$f":"IF(E182=\"CASADO/A\",\"NOMBRE/S CÓNYUGE:\",\"\")","v":""}]
["c PARTE PH",{"$f":"IF($E182=\"CASADO/A\",B173,0)","v":0},{"$f":"IF($E182=\"CASADO/A\",C173,0)","v":0},{"$f":"IF(E182=\"CASADO/A\",\"DOC. IDENTIDAD (cónyuge) –sin puntos ni barras-:\",\"\")","v":""}]
["g CONTRIB.",{"$f":"B173","v":0},{"$f":"B173","v":0},"CARÁCTER DE PARTE:","ELEGIR"]
["c PARTE PH",{"$f":"IF(E187=0,0,B173)","v":0},{"$f":"IF(E187=0,0,C173)","v":0},"NOTA/OBSERVACIÓN -en mayúscula-:"]
["c PARTE PH",null,0,"DOC. IDENTIDAD –sin puntos-:"]
["c PARTE PH",{"$f":"+B188","v":0},{"$f":"+C188","v":0},"CUIT/CUIL –sin puntos ni barras-:"]
["c PARTE PH",{"$f":"+B189","v":0},0,"FECHA DE NACIMIENTO –dd/mm/aa-:"]
["c PARTE PH",0,0,"LUGAR DE NACIMIENTO:"]
["c PARTE PH",0,0,"NACIONALIDAD:"]
["c PARTE PH",0,0,"PROFESIÓN/OFICIO:"]
["c PARTE PH",0,0,"DOMICILIO REAL:"]
["c PARTE PH",0,0,"CEL/TEL :"]
["c PARTE PH",{"$f":"IF(E196=0,0,B188)","v":0},{"$f":"IF(E196=0,0,C188)","v":0},"EMAIL:"]
["c PARTE PH",{"$f":"B188","v":0},{"$f":"C188","v":0},"ESTADO CIVIL:"]
["c PARTE PH",{"$f":"IF($E197=\"CASADO/A\",B188,0)","v":0},{"$f":"IF($E197=\"CASADO/A\",C188,0)","v":0},{"$f":"IF(E197=\"CASADO/A\",\"APELLIDO/S CÓNYUGE:\",\"\")","v":""}]
["c PARTE PH",{"$f":"IF($E197=\"CASADO/A\",B188,0)","v":0},{"$f":"IF($E197=\"CASADO/A\",C188,0)","v":0},{"$f":"IF(E197=\"CASADO/A\",\"NOMBRE/S CÓNYUGE:\",\"\")","v":""}]
["c PARTE PH",{"$f":"IF($E197=\"CASADO/A\",B188,0)","v":0},{"$f":"IF($E197=\"CASADO/A\",C188,0)","v":0},{"$f":"IF(E197=\"CASADO/A\",\"DOC. IDENTIDAD (cónyuge) –sin puntos ni barras-:\",\"\")","v":""}]
["g CONTRIB.",{"$f":"B188","v":0},{"$f":"B188","v":0},"CARÁCTER DE PARTE:","ELEGIR"]
["c PARTE PH",{"$f":"IF(E202=0,0,B188)","v":0},{"$f":"IF(E202=0,0,C188)","v":0},"NOTA/OBSERVACIÓN -en mayúscula-:"]
["c PARTE PH",null,0,"DOC. IDENTIDAD –sin puntos-:"]
["c PARTE PH",{"$f":"+B203","v":0},{"$f":"+C203","v":0},"CUIT/CUIL –sin puntos ni barras-:"]
["c PARTE PH",{"$f":"+B204","v":0},0,"FECHA DE NACIMIENTO –dd/mm/aa-:"]
["c PARTE PH",0,0,"LUGAR DE NACIMIENTO:"]
["c PARTE PH",0,0,"NACIONALIDAD:"]
["c PARTE PH",0,0,"PROFESIÓN/OFICIO:"]
["c PARTE PH",0,0,"DOMICILIO REAL:"]
["c PARTE PH",0,0,"CEL/TEL :"]
["c PARTE PH",{"$f":"IF(E211=0,0,B203)","v":0},{"$f":"IF(E211=0,0,C203)","v":0},"EMAIL:"]
["c PARTE PH",{"$f":"B203","v":0},{"$f":"C203","v":0},"ESTADO CIVIL:"]
["c PARTE PH",{"$f":"IF($E212=\"CASADO/A\",B203,0)","v":0},{"$f":"IF($E212=\"CASADO/A\",C203,0)","v":0},{"$f":"IF(E212=\"CASADO/A\",\"APELLIDO/S CÓNYUGE:\",\"\")","v":""}]
["c PARTE PH",{"$f":"IF($E212=\"CASADO/A\",B203,0)","v":0},{"$f":"IF($E212=\"CASADO/A\",C203,0)","v":0},{"$f":"IF(E212=\"CASADO/A\",\"NOMBRE/S CÓNYUGE:\",\"\")","v":""}]
["c PARTE PH",{"$f":"IF($E212=\"CASADO/A\",B203,0)","v":0},{"$f":"IF($E212=\"CASADO/A\",C203,0)","v":0},{"$f":"IF(E212=\"CASADO/A\",\"DOC. IDENTIDAD (cónyuge) –sin puntos ni barras-:\",\"\")","v":""}]
["g CONTRIB.",{"$f":"B203","v":0},{"$f":"B203","v":0},"CARÁCTER DE PARTE:","ELEGIR"]
["c PARTE PH",{"$f":"IF(E217=0,0,B203)","v":0},{"$f":"IF(E217=0,0,C203)","v":0},"NOTA/OBSERVACIÓN -en mayúscula-:"]
["c PARTE PH",null,0,"DOC. IDENTIDAD –sin puntos-:"]
["c PARTE PH",{"$f":"+B218","v":0},{"$f":"+C218","v":0},"CUIT/CUIL –sin puntos ni barras-:"]
["c PARTE PH",{"$f":"+B219","v":0},0,"FECHA DE NACIMIENTO –dd/mm/aa-:"]
["c PARTE PH",0,0,"LUGAR DE NACIMIENTO:"]
["c PARTE PH",0,0,"NACIONALIDAD:"]
["c PARTE PH",0,0,"PROFESIÓN/OFICIO:"]
["c PARTE PH",0,0,"DOMICILIO REAL:"]
["c PARTE PH",0,0,"CEL/TEL :"]
["c PARTE PH",{"$f":"IF(E226=0,0,B218)","v":0},{"$f":"IF(E226=0,0,C218)","v":0},"EMAIL:"]
["c PARTE PH",{"$f":"B218","v":0},{"$f":"C218","v":0},"ESTADO CIVIL:"]
["c PARTE PH",{"$f":"IF($E227=\"CASADO/A\",B218,0)","v":0},{"$f":"IF($E227=\"CASADO/A\",C218,0)","v":0},{"$f":"IF(E227=\"CASADO/A\",\"APELLIDO/S CÓNYUGE:\",\"\")","v":""}]
["c PARTE PH",{"$f":"IF($E227=\"CASADO/A\",B218,0)","v":0},{"$f":"IF($E227=\"CASADO/A\",C218,0)","v":0},{"$f":"IF(E227=\"CASADO/A\",\"NOMBRE/S CÓNYUGE:\",\"\")","v":""}]
["c PARTE PH",{"$f":"IF($E227=\"CASADO/A\",B218,0)","v":0},{"$f":"IF($E227=\"CASADO/A\",C218,0)","v":0},{"$f":"IF(E227=\"CASADO/A\",\"DOC. IDENTIDAD (cónyuge) –sin puntos ni barras-:\",\"\")","v":""}]
["g CONTRIB.",{"$f":"B218","v":0},{"$f":"B218","v":0},"CARÁCTER DE PARTE:","ELEGIR"]
["c PARTE PH",{"$f":"IF(E232=0,0,B218)","v":0},{"$f":"IF(E232=0,0,C218)","v":0},"NOTA/OBSERVACIÓN -en mayúscula-:"]

{"sheet":"IMPRIMIR","index":3,"n_rows":377,"n_cols":6,"rows_kept":377,"cut":false,"hidden":false,"merged":[[4,5,5,5],[0,0,0,2],[2,3,2,4],[1,0,1,4],[2,0,2,2],[0,3,0,4]]}
[{"$f":"+'DATOS FIDEIC'!A1","v":"DATOS FIDEICOMISO"},null,null,"HOJA (FOJA) Nº: …………….."]
[{"$f":"+'DATOS FIDEIC'!A3:E3","v":"REGISTRO PÚBLICO DE COMERCIO, Juzgado Pcial. de 1era. Instancia en los Civil, Comercial, Laboral, Minería y Familia, con asiento en la localidad de LAS HERAS -Pcia. de Sta. Cruz, Simón Bolivar 482 (CP9017)-"}]
["NOMBRE DE LA FIDEICOMISO:",null,null,{"$f":"+'DATOS FIDEIC'!D4:E4","v":0}]
[null,"FECHA:",{"$f":"+'DATOS FIDEIC'!D5","v":"00:00:00"}]
["REFER.","VINCULADOS","VINCULADOS","DATOS",null,"FILA Nº"]
[null,null,null,"CONCEPTO","COMPLETAR -EN MAYUSCULA -"]
[{"$f":"+'DATOS FIDEIC'!A18","v":"aa GESTOR"},{"$f":"+'DATOS FIDEIC'!B18","v":0},{"$f":"+'DATOS FIDEIC'!C18","v":0},{"$f":"+'DATOS FIDEIC'!D18","v":"TRAMITE QUE SE INICIA:"},{"$f":"IF('DATOS FIDEIC'!E18=\"ELEGIR\",\"INCOMPLETO RECHAZAR\",'DATOS FIDEIC'!E18)","v":"INCOMPLETO RECHAZAR"},1]
[{"$f":"+'DATOS FIDEIC'!A19","v":"ab GESTOR"},{"$f":"+'DATOS FIDEIC'!B19","v":0},{"$f":"+'DATOS FIDEIC'!C19","v":0},{"$f":"+'DATOS FIDEIC'!D19","v":"DOMICILIO PROCESAL CONSTITUIDO -art.40 CPCC-:"},{"$f":"IF('DATOS FIDEIC'!E19>0,'DATOS FIDEIC'!E19,\"INCOMPLETO RECHAZAR\")","v":"INCOMPLETO RECHAZAR"},2]
[{"$f":"+'DATOS FIDEIC'!A20","v":"ac GESTOR"},{"$f":"+'DATOS FIDEIC'!B20","v":0},{"$f":"+'DATOS FIDEIC'!C20","v":0},{"$f":"+'DATOS FIDEIC'!D20","v":"CARÁCTER DEL GESTIONANTE:"},{"$f":"IF('DATOS FIDEIC'!E20=\"ELEGIR\",\"INCOMPLETO RECHAZAR\",'DATOS FIDEIC'!E20)","v":"INCOMPLETO RECHAZAR"},3]
[{"$f":"+'DATOS FIDEIC'!A21","v":"ad GESTOR"},{"$f":"+'DATOS FIDEIC'!B21","v":0},{"$f":"+'DATOS FIDEIC'!C21","v":0},{"$f":"+'DATOS FIDEIC'!D21","v":"LETRADO/A/S PATROCINANTE/S:"},{"$f":"IF('DATOS FIDEIC'!E21>0,'DATOS FIDEIC'!E21,\"INCOMPLETO RECHAZAR\")","v":"INCOMPLETO RECHAZAR"},4]
[{"$f":"+'DATOS FIDEIC'!A22","v":"ae GESTOR"},{"$f":"+'DATOS FIDEIC'!B22","v":0},{"$f":"+'DATOS FIDEIC'!C22","v":0},{"$f":"+'DATOS FIDEIC'!D22","v":"DOC. IDENTIDAD –sin puntos-:"},{"$f":"IF('DATOS FIDEIC'!E22>0,'DATOS FIDEIC'!E22,\"INCOMPLETO RECHAZAR\")","v":"INCOMPLETO RECHAZAR"},5]
[{"$f":"+'DATOS FIDEIC'!A23","v":"af GESTOR"},{"$f":"+'DATOS FIDEIC'!B23","v":0},{"$f":"+'DATOS FIDEIC'!C23","v":0},{"$f":"+'DATOS FIDEIC'!D23","v":"DOMICILIO REAL -indicar Ciudad/Pcia./País"},{"$f":"IF('DATOS FIDEIC'!E23>0,'DATOS FIDEIC'!E23,\"INCOMPLETO RECHAZAR\")","v":"INCOMPLETO RECHAZAR"},6]
[{"$f":"+'DATOS FIDEIC'!A24","v":"ag GESTOR"},{"$f":"+'DATOS FIDEIC'!B24","v":0},{"$f":"+'DATOS FIDEIC'!C24","v":0},{"$f":"+'DATOS FIDEIC'!D24","v":"CEL/TEL -c/código de área, sin puntos o barras-:"},{"$f":"IF('DATOS FIDEIC'!E24>0,'DATOS FIDEIC'!E24,\"INCOMPLETO RECHAZAR\")","v":"INCOMPLETO RECHAZAR"},7]
[{"$f":"+'DATOS FIDEIC'!A25","v":"ah GESTOR"},{"$f":"+'DATOS FIDEIC'!B25","v":0},{"$f":"+'DATOS FIDEIC'!C25","v":0},{"$f":"+'DATOS FIDEIC'!D25","v":"EMAIL -OBLIGATORIO-:"},{"$f":"IF('DATOS FIDEIC'!E25>0,'DATOS FIDEIC'!E25,\"INCOMPLETO RECHAZAR\")","v":"INCOMPLETO RECHAZAR"},8]
[{"$f":"+'DATOS FIDEIC'!A35","v":"ba FIDEICOMISO"},{"$f":"UPPER('DATOS FIDEIC'!B35)","v":"0"},{"$f":"UPPER('DATOS FIDEIC'!C35)","v":"0"},{"$f":"+'DATOS FIDEIC'!D35","v":"CEL/TEL (de administración) -en su caso indicar que no posee-:"},{"$f":"IF('DATOS FIDEIC'!E35>0,'DATOS FIDEIC'!E35,\"INCOMPLETO RECHAZAR\")","v":"INCOMPLETO RECHAZAR"},9]
[{"$f":"+'DATOS FIDEIC'!A36","v":"ba FIDEICOMISO"},{"$f":"UPPER('DATOS FIDEIC'!B36)","v":"0"},{"$f":"UPPER('DATOS FIDEIC'!C36)","v":"0"},{"$f":"+'DATOS FIDEIC'!D36","v":"EMAIL (de administración)  -en su caso indicar que no posee-:"},{"$f":"IF('DATOS FIDEIC'!E36>0,'DATOS FIDEIC'!E36,\"INCOMPLETO RECHAZAR\")","v":"INCOMPLETO RECHAZAR"},10]
[{"$f":"+'DATOS FIDEIC'!A30","v":"ba FIDEICOMISO"},{"$f":"UPPER('DATOS FIDEIC'!B30)","v":"0"},{"$f":"UPPER('DATOS FIDEIC'!C30)","v":"0"},{"$f":"+'DATOS FIDEIC'!D30","v":"DIRECCION domicilio legal:"},{"$f":"IF('DATOS FIDEIC'!E30>0,'DATOS FIDEIC'!E30,\"INCOMPLETO RECHAZAR\")","v":"INCOMPLETO RECHAZAR"},11]
[{"$f":"+'DATOS FIDEIC'!A31","v":"ba FIDEICOMISO"},{"$f":"UPPER('DATOS FIDEIC'!B31)","v":"0"},{"$f":"UPPER('DATOS FIDEIC'!C31)","v":"0"},{"$f":"+'DATOS FIDEIC'!D31","v":"CUIT –sin puntos ni barras-:"},{"$f":"IF('DATOS FIDEIC'!E31>0,'DATOS FIDEIC'!E31,\"INCOMPLETO RECHAZAR\")","v":"INCOMPLETO RECHAZAR"},12]
[{"$f":"+'DATOS FIDEIC'!A32","v":"ba FIDEICOMISO"},{"$f":"UPPER('DATOS FIDEIC'!B32)","v":"0"},{"$f":"UPPER('DATOS FIDEIC'!C32)","v":"0"},{"$f":"+'DATOS FIDEIC'!D32","v":"FECHA DE INICIO DEL CONTRATO:"},{"$f":"IF('DATOS FIDEIC'!E32>0,'DATOS FIDEIC'!E32,\"INCOMPLETO RECHAZAR\")","v":"INCOMPLETO RECHAZAR"},368]
[{"$f":"+'DATOS FIDEIC'!A34","v":"ba FIDEICOMISO"},{"$f":"+'DATOS FIDEIC'!B34","v":0},{"$f":"+'DATOS FIDEIC'!C34","v":0},{"$f":"+'DATOS FIDEIC'!D34","v":"INDICAR LA FECHA DE CUMPLIMIENTO DEL PLAZO O LA CONDICIÓN -ART. 1668 Cód. Civ. y Com."},{"$f":"IF('DATOS FIDEIC'!E34>0,#REF!,\"INCOMPLETO RECHAZAR\")","v":"INCOMPLETO RECHAZAR"}]
[{"$f":"+PARTES!A8","v":"c PARTE PH"},{"$f":"+PARTES!B8","v":0},{"$f":"+PARTES!C8","v":0},{"$f":"+PARTES!D8","v":"DOC. IDENTIDAD –sin puntos-:"},{"$f":"IF(PARTES!E8>0,PARTES!E8,\"INCOMPLETO RECHAZAR\")","v":"INCOMPLETO RECHAZAR"}]
[{"$f":"+PARTES!A9","v":"c PARTE PH"},{"$f":"+PARTES!B9","v":0},{"$f":"+PARTES!C9","v":0},{"$f":"+PARTES!D9","v":"CUIT/CUIL –sin puntos ni barras-:"},{"$f":"IF(PARTES!E9>0,PARTES!E9,\"INCOMPLETO RECHAZAR\")","v":"INCOMPLETO RECHAZAR"}]
[{"$f":"+PARTES!A10","v":"c PARTE PH"},{"$f":"+PARTES!B10","v":0},{"$f":"+PARTES!C10","v":0},{"$f":"+PARTES!D10","v":"FECHA DE NACIMIENTO –dd/mm/aa-:"},{"$f":"IF(PARTES!E10>0,PARTES!E10,\"INCOMPLETO RECHAZAR\")","v":"INCOMPLETO RECHAZAR"}]
[{"$f":"+PARTES!A11","v":"c PARTE PH"},{"$f":"+PARTES!B11","v":0},{"$f":"+PARTES!C11","v":0},{"$f":"+PARTES!D11","v":"LUGAR DE NACIMIENTO:"},{"$f":"IF(PARTES!E11>0,PARTES!E11,\"INCOMPLETO RECHAZAR\")","v":"INCOMPLETO RECHAZAR"}]
[{"$f":"+PARTES!A12","v":"c PARTE PH"},{"$f":"+PARTES!B12","v":0},{"$f":"+PARTES!C12","v":0},{"$f":"+PARTES!D12","v":"NACIONALIDAD:"},{"$f":"IF(PARTES!E12>0,PARTES!E12,\"INCOMPLETO RECHAZAR\")","v":"INCOMPLETO RECHAZAR"}]
[{"$f":"+PARTES!A13","v":"c PARTE PH"},{"$f":"+PARTES!B13","v":0},{"$f":"+PARTES!C13","v":0},{"$f":"+PARTES!D13","v":"PROFESIÓN/OFICIO:"},{"$f":"IF(PARTES!E13>0,PARTES!E13,\"INCOMPLETO RECHAZAR\")","v":"INCOMPLETO RECHAZAR"}]
[{"$f":"+PARTES!A14","v":"c PARTE PH"},{"$f":"+PARTES!B14","v":0},{"$f":"+PARTES!C14","v":0},{"$f":"+PARTES!D14","v":"DOMICILIO REAL:"},{"$f":"IF(PARTES!E14>0,PARTES!E14,\"INCOMPLETO RECHAZAR\")","v":"INCOMPLETO RECHAZAR"}]
[{"$f":"+PARTES!A15","v":"c PARTE PH"},{"$f":"+PARTES!B15","v":0},{"$f":"+PARTES!C15","v":0},{"$f":"+PARTES!D15","v":"CEL/TEL :"},{"$f":"IF(PARTES!E15>0,PARTES!E15,\"INCOMPLETO RECHAZAR\")","v":"INCOMPLETO RECHAZAR"}]
[{"$f":"+PARTES!A16","v":"c PARTE PH"},{"$f":"+PARTES!B16","v":0},{"$f":"+PARTES!C16","v":0},{"$f":"+PARTES!D16","v":"EMAIL:"},{"$f":"IF(PARTES!E16>0,PARTES!E16,\"INCOMPLETO RECHAZAR\")","v":"INCOMPLETO RECHAZAR"}]
[{"$f":"+PARTES!A17","v":"c PARTE PH"},{"$f":"+PARTES!B17","v":0},{"$f":"+PARTES!C17","v":0},{"$f":"+PARTES!D17","v":"ESTADO CIVIL:"},{"$f":"IF(PARTES!E17>0,PARTES!E17,\"INCOMPLETO RECHAZAR\")","v":"INCOMPLETO RECHAZAR"}]
[{"$f":"+PARTES!A18","v":"c PARTE PH"},{"$f":"+PARTES!B18","v":0},{"$f":"+PARTES!C18","v":0},{"$f":"+PARTES!D18","v":""},{"$f":"IF(PARTES!E18>0,PARTES!E18,\"INCOMPLETO RECHAZAR\")","v":"INCOMPLETO RECHAZAR"}]
[{"$f":"+PARTES!A19","v":"c PARTE PH"},{"$f":"+PARTES!B19","v":0},{"$f":"+PARTES!C19","v":0},{"$f":"+PARTES!D19","v":""},{"$f":"IF(PARTES!E19>0,PARTES!E19,\"INCOMPLETO RECHAZAR\")","v":"INCOMPLETO RECHAZAR"}]
[{"$f":"+PARTES!A20","v":"c PARTE PH"},{"$f":"+PARTES!B20","v":0},{"$f":"+PARTES!C20","v":0},{"$f":"+PARTES!D20","v":""},{"$f":"IF(PARTES!E20>0,PARTES!E20,\"INCOMPLETO RECHAZAR\")","v":"INCOMPLETO RECHAZAR"}]
[{"$f":"+PARTES!A21","v":"g CONTRIB."},{"$f":"+PARTES!B21","v":0},{"$f":"+PARTES!C21","v":0},{"$f":"+PARTES!D21","v":"CARÁCTER DE PARTE:"},{"$f":"IF(PARTES!E21=\"ELEGIR\",\"INCOMPLETO RECHAZAR\",PARTES!E21)","v":"INCOMPLETO RECHAZAR"}]
[{"$f":"+PARTES!A22","v":"c PARTE PH"},{"$f":"+PARTES!B22","v":0},{"$f":"+PARTES!C22","v":0},{"$f":"+PARTES!D22","v":"NOTA/OBSERVACIÓN -en mayúscula-:"},{"$f":"IF(PARTES!E22>0,PARTES!E22,\"INCOMPLETO RECHAZAR\")","v":"INCOMPLETO RECHAZAR"}]
[{"$f":"+PARTES!A23","v":"c PARTE PH"},{"$f":"+PARTES!B23","v":0},{"$f":"+PARTES!C23","v":0},{"$f":"+PARTES!D23","v":"DOC. IDENTIDAD –sin puntos-:"},{"$f":"IF(PARTES!E23>0,PARTES!E23,\"INCOMPLETO RECHAZAR\")","v":"INCOMPLETO RECHAZAR"}]
[{"$f":"+PARTES!A24","v":"c PARTE PH"},{"$f":"+PARTES!B24","v":0},{"$f":"+PARTES!C24","v":0},{"$f":"+PARTES!D24","v":"CUIT/CUIL –sin puntos ni barras-:"},{"$f":"IF(PARTES!E24>0,PARTES!E24,\"INCOMPLETO RECHAZAR\")","v":"INCOMPLETO RECHAZAR"}]
[{"$f":"+PARTES!A25","v":"c PARTE PH"},{"$f":"+PARTES!B25","v":0},{"$f":"+PARTES!C25","v":0},{"$f":"+PARTES!D25","v":"FECHA DE NACIMIENTO –dd/mm/aa-:"},{"$f":"IF(PARTES!E25>0,PARTES!E25,\"INCOMPLETO RECHAZAR\")","v":"INCOMPLETO RECHAZAR"}]
[{"$f":"+PARTES!A26","v":"c PARTE PH"},{"$f":"+PARTES!B26","v":0},{"$f":"+PARTES!C26","v":0},{"$f":"+PARTES!D26","v":"LUGAR DE NACIMIENTO:"},{"$f":"IF(PARTES!E26>0,PARTES!E26,\"INCOMPLETO RECHAZAR\")","v":"INCOMPLETO RECHAZAR"}]
[{"$f":"+PARTES!A27","v":"c PARTE PH"},{"$f":"+PARTES!B27","v":0},{"$f":"+PARTES!C27","v":0},{"$f":"+PARTES!D27","v":"NACIONALIDAD:"},{"$f":"IF(PARTES!E27>0,PARTES!E27,\"INCOMPLETO RECHAZAR\")","v":"INCOMPLETO RECHAZAR"}]
[{"$f":"+PARTES!A28","v":"c PARTE PH"},{"$f":"+PARTES!B28","v":0},{"$f":"+PARTES!C28","v":0},{"$f":"+PARTES!D28","v":"PROFESIÓN/OFICIO:"},{"$f":"IF(PARTES!E28>0,PARTES!E28,\"INCOMPLETO RECHAZAR\")","v":"INCOMPLETO RECHAZAR"}]
[{"$f":"+PARTES!A29","v":"c PARTE PH"},{"$f":"+PARTES!B29","v":0},{"$f":"+PARTES!C29","v":0},{"$f":"+PARTES!D29","v":"DOMICILIO REAL:"},{"$f":"IF(PARTES!E29>0,PARTES!E29,\"INCOMPLETO RECHAZAR\")","v":"INCOMPLETO RECHAZAR"}]
[{"$f":"+PARTES!A30","v":"c PARTE PH"},{"$f":"+PARTES!B30","v":0},{"$f":"+PARTES!C30","v":0},{"$f":"+PARTES!D30","v":"CEL/TEL :"},{"$f":"IF(PARTES!E30>0,PARTES!E30,\"INCOMPLETO RECHAZAR\")","v":"INCOMPLETO RECHAZAR"}]
[{"$f":"+PARTES!A31","v":"c PARTE PH"},{"$f":"+PARTES!B31","v":0},{"$f":"+PARTES!C31","v":0},{"$f":"+PARTES!D31","v":"EMAIL:"},{"$f":"IF(PARTES!E31>0,PARTES!E31,\"INCOMPLETO RECHAZAR\")","v":"INCOMPLETO RECHAZAR"}]
[{"$f":"+PARTES!A32","v":"c PARTE PH"},{"$f":"+PARTES!B32","v":0},{"$f":"+PARTES!C32","v":0},{"$f":"+PARTES!D32","v":"ESTADO CIVIL:"},{"$f":"IF(PARTES!E32>0,PARTES!E32,\"INCOMPLETO RECHAZAR\")","v":"INCOMPLETO RECHAZAR"}]
[{"$f":"+PARTES!A33","v":"c PARTE PH"},{"$f":"+PARTES!B33","v":0},{"$f":"+PARTES!C33","v":0},{"$f":"+PARTES!D33","v":""},{"$f":"IF(PARTES!E33>0,PARTES!E33,\"INCOMPLETO RECHAZAR\")","v":"INCOMPLETO RECHAZAR"}]
[{"$f":"+PARTES!A34","v":"c PARTE PH"},{"$f":"+PARTES!B34","v":0},{"$f":"+PARTES!C34","v":0},{"$f":"+PARTES!D34","v":""},{"$f":"IF(PARTES!E34>0,PARTES!E34,\"INCOMPLETO RECHAZAR\")","v":"INCOMPLETO RECHAZAR"}]
[{"$f":"+PARTES!A35","v":"c PARTE PH"},{"$f":"+PARTES!B35","v":0},{"$f":"+PARTES!C35","v":0},{"$f":"+PARTES!D35","v":""},{"$f":"IF(PARTES!E35>0,PARTES!E35,\"INCOMPLETO RECHAZAR\")","v":"INCOMPLETO RECHAZAR"}]
[{"$f":"+PARTES!A36","v":"g CONTRIB."},{"$f":"+PARTES!B36","v":0},{"$f":"+PARTES!C36","v":0},{"$f":"+PARTES!D36","v":"CARÁCTER DE PARTE:"},{"$f":"IF(PARTES!E36=\"ELEGIR\",\"INCOMPLETO RECHAZAR\",PARTES!E36)","v":"INCOMPLETO RECHAZAR"}]
[{"$f":"+PARTES!A37","v":"c PARTE PH"},{"$f":"+PARTES!B37","v":0},{"$f":"+PARTES!C37","v":0},{"$f":"+PARTES!D37","v":"NOTA/OBSERVACIÓN -en mayúscula-:"},{"$f":"IF(PARTES!E37>0,PARTES!E37,\"INCOMPLETO RECHAZAR\")","v":"INCOMPLETO RECHAZAR"}]
[{"$f":"+PARTES!A38","v":"c PARTE PH"},{"$f":"+PARTES!B38","v":0},{"$f":"+PARTES!C38","v":0},{"$f":"+PARTES!D38","v":"DOC. IDENTIDAD –sin puntos-:"},{"$f":"IF(PARTES!E38>0,PARTES!E38,\"INCOMPLETO RECHAZAR\")","v":"INCOMPLETO RECHAZAR"}]
[{"$f":"+PARTES!A39","v":"c PARTE PH"},{"$f":"+PARTES!B39","v":0},{"$f":"+PARTES!C39","v":0},{"$f":"+PARTES!D39","v":"CUIT/CUIL –sin puntos ni barras-:"},{"$f":"IF(PARTES!E39>0,PARTES!E39,\"INCOMPLETO RECHAZAR\")","v":"INCOMPLETO RECHAZAR"}]
[{"$f":"+PARTES!A40","v":"c PARTE PH"},{"$f":"+PARTES!B40","v":0},{"$f":"+PARTES!C40","v":0},{"$f":"+PARTES!D40","v":"FECHA DE NACIMIENTO –dd/mm/aa-:"},{"$f":"IF(PARTES!E40>0,PARTES!E40,\"INCOMPLETO RECHAZAR\")","v":"INCOMPLETO RECHAZAR"}]
[{"$f":"+PARTES!A41","v":"c PARTE PH"},{"$f":"+PARTES!B41","v":0},{"$f":"+PARTES!C41","v":0},{"$f":"+PARTES!D41","v":"LUGAR DE NACIMIENTO:"},{"$f":"IF(PARTES!E41>0,PARTES!E41,\"INCOMPLETO RECHAZAR\")","v":"INCOMPLETO RECHAZAR"}]
[{"$f":"+PARTES!A42","v":"c PARTE PH"},{"$f":"+PARTES!B42","v":0},{"$f":"+PARTES!C42","v":0},{"$f":"+PARTES!D42","v":"NACIONALIDAD:"},{"$f":"IF(PARTES!E42>0,PARTES!E42,\"INCOMPLETO RECHAZAR\")","v":"INCOMPLETO RECHAZAR"}]
[{"$f":"+PARTES!A43","v":"c PARTE PH"},{"$f":"+PARTES!B43","v":0},{"$f":"+PARTES!C43","v":0},{"$f":"+PARTES!D43","v":"PROFESIÓN/OFICIO:"},{"$f":"IF(PARTES!E43>0,PARTES!E43,\"INCOMPLETO RECHAZAR\")","v":"INCOMPLETO RECHAZAR"}]
[{"$f":"+PARTES!A44","v":"c PARTE PH"},{"$f":"+PARTES!B44","v":0},{"$f":"+PARTES!C44","v":0},{"$f":"+PARTES!D44","v":"DOMICILIO REAL:"},{"$f":"IF(PARTES!E44>0,PARTES!E44,\"INCOMPLETO RECHAZAR\")","v":"INCOMPLETO RECHAZAR"}]
[{"$f":"+PARTES!A45","v":"c PARTE PH"},{"$f":"+PARTES!B45","v":0},{"$f":"+PARTES!C45","v":0},{"$f":"+PARTES!D45","v":"CEL/TEL :"},{"$f":"IF(PARTES!E45>0,PARTES!E45,\"INCOMPLETO RECHAZAR\")","v":"INCOMPLETO RECHAZAR"}]
[{"$f":"+PARTES!A46","v":"c PARTE PH"},{"$f":"+PARTES!B46","v":0},{"$f":"+PARTES!C46","v":0},{"$f":"+PARTES!D46","v":"EMAIL:"},{"$f":"IF(PARTES!E46>0,PARTES!E46,\"INCOMPLETO RECHAZAR\")","v":"INCOMPLETO RECHAZAR"}]
[{"$f":"+PARTES!A47","v":"c PARTE PH"},{"$f":"+PARTES!B47","v":0},{"$f":"+PARTES!C47","v":0},{"$f":"+PARTES!D47","v":"ESTADO CIVIL:"},{"$f":"IF(PARTES!E47>0,PARTES!E47,\"INCOMPLETO RECHAZAR\")","v":"INCOMPLETO RECHAZAR"}]
[{"$f":"+PARTES!A48","v":"c PARTE PH"},{"$f":"+PARTES!B48","v":0},{"$f":"+PARTES!C48","v":0},{"$f":"+PARTES!D48","v":""},{"$f":"IF(PARTES!E48>0,PARTES!E48,\"INCOMPLETO RECHAZAR\")","v":"INCOMPLETO RECHAZAR"}]
[{"$f":"+PARTES!A49","v":"c PARTE PH"},{"$f":"+PARTES!B49","v":0},{"$f":"+PARTES!C49","v":0},{"$f":"+PARTES!D49","v":""},{"$f":"IF(PARTES!E49>0,PARTES!E49,\"INCOMPLETO RECHAZAR\")","v":"INCOMPLETO RECHAZAR"}]
[{"$f":"+PARTES!A50","v":"c PARTE PH"},{"$f":"+PARTES!B50","v":0},{"$f":"+PARTES!C50","v":0},{"$f":"+PARTES!D50","v":""},{"$f":"IF(PARTES!E50>0,PARTES!E50,\"INCOMPLETO RECHAZAR\")","v":"INCOMPLETO RECHAZAR"}]
[{"$f":"+PARTES!A51","v":"g CONTRIB."},{"$f":"+PARTES!B51","v":0},{"$f":"+PARTES!C51","v":0},{"$f":"+PARTES!D51","v":"CARÁCTER DE PARTE:"},{"$f":"IF(PARTES!E51=\"ELEGIR\",\"INCOMPLETO RECHAZAR\",PARTES!E51)","v":"INCOMPLETO RECHAZAR"}]
[{"$f":"+PARTES!A52","v":"c PARTE PH"},{"$f":"+PARTES!B52","v":0},{"$f":"+PARTES!C52","v":0},{"$f":"+PARTES!D52","v":"NOTA/OBSERVACIÓN -en mayúscula-:"},{"$f":"IF(PARTES!E52>0,PARTES!E52,\"INCOMPLETO RECHAZAR\")","v":"INCOMPLETO RECHAZAR"}]
[{"$f":"+PARTES!A53","v":"c PARTE PH"},{"$f":"+PARTES!B53","v":0},{"$f":"+PARTES!C53","v":0},{"$f":"+PARTES!D53","v":"DOC. IDENTIDAD –sin puntos-:"},{"$f":"IF(PARTES!E53>0,PARTES!E53,\"INCOMPLETO RECHAZAR\")","v":"INCOMPLETO RECHAZAR"}]
[{"$f":"+PARTES!A54","v":"c PARTE PH"},{"$f":"+PARTES!B54","v":0},{"$f":"+PARTES!C54","v":0},{"$f":"+PARTES!D54","v":"CUIT/CUIL –sin puntos ni barras-:"},{"$f":"IF(PARTES!E54>0,PARTES!E54,\"INCOMPLETO RECHAZAR\")","v":"INCOMPLETO RECHAZAR"}]
[{"$f":"+PARTES!A55","v":"c PARTE PH"},{"$f":"+PARTES!B55","v":0},{"$f":"+PARTES!C55","v":0},{"$f":"+PARTES!D55","v":"FECHA DE NACIMIENTO –dd/mm/aa-:"},{"$f":"IF(PARTES!E55>0,PARTES!E55,\"INCOMPLETO RECHAZAR\")","v":"INCOMPLETO RECHAZAR"}]
[{"$f":"+PARTES!A56","v":"c PARTE PH"},{"$f":"+PARTES!B56","v":0},{"$f":"+PARTES!C56","v":0},{"$f":"+PARTES!D56","v":"LUGAR DE NACIMIENTO:"},{"$f":"IF(PARTES!E56>0,PARTES!E56,\"INCOMPLETO RECHAZAR\")","v":"INCOMPLETO RECHAZAR"}]
[{"$f":"+PARTES!A57","v":"c PARTE PH"},{"$f":"+PARTES!B57","v":0},{"$f":"+PARTES!C57","v":0},{"$f":"+PARTES!D57","v":"NACIONALIDAD:"},{"$f":"IF(PARTES!E57>0,PARTES!E57,\"INCOMPLETO RECHAZAR\")","v":"INCOMPLETO RECHAZAR"}]
[{"$f":"+PARTES!A58","v":"c PARTE PH"},{"$f":"+PARTES!B58","v":0},{"$f":"+PARTES!C58","v":0},{"$f":"+PARTES!D58","v":"PROFESIÓN/OFICIO:"},{"$f":"IF(PARTES!E58>0,PARTES!E58,\"INCOMPLETO RECHAZAR\")","v":"INCOMPLETO RECHAZAR"}]
[{"$f":"+PARTES!A59","v":"c PARTE PH"},{"$f":"+PARTES!B59","v":0},{"$f":"+PARTES!C59","v":0},{"$f":"+PARTES!D59","v":"DOMICILIO REAL:"},{"$f":"IF(PARTES!E59>0,PARTES!E59,\"INCOMPLETO RECHAZAR\")","v":"INCOMPLETO RECHAZAR"}]
[{"$f":"+PARTES!A60","v":"c PARTE PH"},{"$f":"+PARTES!B60","v":0},{"$f":"+PARTES!C60","v":0},{"$f":"+PARTES!D60","v":"CEL/TEL :"},{"$f":"IF(PARTES!E60>0,PARTES!E60,\"INCOMPLETO RECHAZAR\")","v":"INCOMPLETO RECHAZAR"}]
[{"$f":"+PARTES!A61","v":"c PARTE PH"},{"$f":"+PARTES!B61","v":0},{"$f":"+PARTES!C61","v":0},{"$f":"+PARTES!D61","v":"EMAIL:"},{"$f":"IF(PARTES!E61>0,PARTES!E61,\"INCOMPLETO RECHAZAR\")","v":"INCOMPLETO RECHAZAR"}]
[{"$f":"+PARTES!A62","v":"c PARTE PH"},{"$f":"+PARTES!B62","v":0},{"$f":"+PARTES!C62","v":0},{"$f":"+PARTES!D62","v":"ESTADO CIVIL:"},{"$f":"IF(PARTES!E62>0,PARTES!E62,\"INCOMPLETO RECHAZAR\")","v":"INCOMPLETO RECHAZAR"}]
[{"$f":"+PARTES!A63","v":"c PARTE PH"},{"$f":"+PARTES!B63","v":0},{"$f":"+PARTES!C63","v":0},{"$f":"+PARTES!D63","v":""},{"$f":"IF(PARTES!E63>0,PARTES!E63,\"INCOMPLETO RECHAZAR\")","v":"INCOMPLETO RECHAZAR"}]
[{"$f":"+PARTES!A64","v":"c PARTE PH"},{"$f":"+PARTES!B64","v":0},{"$f":"+PARTES!C64","v":0},{"$f":"+PARTES!D64","v":""},{"$f":"IF(PARTES!E64>0,PARTES!E64,\"INCOMPLETO RECHAZAR\")","v":"INCOMPLETO RECHAZAR"}]
[{"$f":"+PARTES!A65","v":"c PARTE PH"},{"$f":"+PARTES!B65","v":0},{"$f":"+PARTES!C65","v":0},{"$f":"+PARTES!D65","v":""},{"$f":"IF(PARTES!E65>0,PARTES!E65,\"INCOMPLETO RECHAZAR\")","v":"INCOMPLETO RECHAZAR"}]
[{"$f":"+PARTES!A66","v":"g CONTRIB."},{"$f":"+PARTES!B66","v":0},{"$f":"+PARTES!C66","v":0},{"$f":"+PARTES!D66","v":"CARÁCTER DE PARTE:"},{"$f":"IF(PARTES!E66=\"ELEGIR\",\"INCOMPLETO RECHAZAR\",PARTES!E66)","v":"INCOMPLETO RECHAZAR"}]
[{"$f":"+PARTES!A67","v":"c PARTE PH"},{"$f":"+PARTES!B67","v":0},{"$f":"+PARTES!C67","v":0},{"$f":"+PARTES!D67","v":"NOTA/OBSERVACIÓN -en mayúscula-:"},{"$f":"IF(PARTES!E67>0,PARTES!E67,\"INCOMPLETO RECHAZAR\")","v":"INCOMPLETO RECHAZAR"}]
[{"$f":"+PARTES!A68","v":"c PARTE PH"},{"$f":"+PARTES!B68","v":0},{"$f":"+PARTES!C68","v":0},{"$f":"+PARTES!D68","v":"DOC. IDENTIDAD –sin puntos-:"},{"$f":"IF(PARTES!E68>0,PARTES!E68,\"INCOMPLETO RECHAZAR\")","v":"INCOMPLETO RECHAZAR"}]
[{"$f":"+PARTES!A69","v":"c PARTE PH"},{"$f":"+PARTES!B69","v":0},{"$f":"+PARTES!C69","v":0},{"$f":"+PARTES!D69","v":"CUIT/CUIL –sin puntos ni barras-:"},{"$f":"IF(PARTES!E69>0,PARTES!E69,\"INCOMPLETO RECHAZAR\")","v":"INCOMPLETO RECHAZAR"}]
[{"$f":"+PARTES!A70","v":"c PARTE PH"},{"$f":"+PARTES!B70","v":0},{"$f":"+PARTES!C70","v":0},{"$f":"+PARTES!D70","v":"FECHA DE NACIMIENTO –dd/mm/aa-:"},{"$f":"IF(PARTES!E70>0,PARTES!E70,\"INCOMPLETO RECHAZAR\")","v":"INCOMPLETO RECHAZAR"}]
[{"$f":"+PARTES!A71","v":"c PARTE PH"},{"$f":"+PARTES!B71","v":0},{"$f":"+PARTES!C71","v":0},{"$f":"+PARTES!D71","v":"LUGAR DE NACIMIENTO:"},{"$f":"IF(PARTES!E71>0,PARTES!E71,\"INCOMPLETO RECHAZAR\")","v":"INCOMPLETO RECHAZAR"}]
[{"$f":"+PARTES!A72","v":"c PARTE PH"},{"$f":"+PARTES!B72","v":0},{"$f":"+PARTES!C72","v":0},{"$f":"+PARTES!D72","v":"NACIONALIDAD:"},{"$f":"IF(PARTES!E72>0,PARTES!E72,\"INCOMPLETO RECHAZAR\")","v":"INCOMPLETO RECHAZAR"}]
[{"$f":"+PARTES!A73","v":"c PARTE PH"},{"$f":"+PARTES!B73","v":0},{"$f":"+PARTES!C73","v":0},{"$f":"+PARTES!D73","v":"PROFESIÓN/OFICIO:"},{"$f":"IF(PARTES!E73>0,PARTES!E73,\"INCOMPLETO RECHAZAR\")","v":"INCOMPLETO RECHAZAR"}]
[{"$f":"+PARTES!A74","v":"c PARTE PH"},{"$f":"+PARTES!B74","v":0},{"$f":"+PARTES!C74","v":0},{"$f":"+PARTES!D74","v":"DOMICILIO REAL:"},{"$f":"IF(PARTES!E74>0,PARTES!E74,\"INCOMPLETO RECHAZAR\")","v":"INCOMPLETO RECHAZAR"}]
[{"$f":"+PARTES!A75","v":"c PARTE PH"},{"$f":"+PARTES!B75","v":0},{"$f":"+PARTES!C75","v":0},{"$f":"+PARTES!D75","v":"CEL/TEL :"},{"$f":"IF(PARTES!E75>0,PARTES!E75,\"INCOMPLETO RECHAZAR\")","v":"INCOMPLETO RECHAZAR"}]
[{"$f":"+PARTES!A76","v":"c PARTE PH"},{"$f":"+PARTES!B76","v":0},{"$f":"+PARTES!C76","v":0},{"$f":"+PARTES!D76","v":"EMAIL:"},{"$f":"IF(PARTES!E76>0,PARTES!E76,\"INCOMPLETO RECHAZAR\")","v":"INCOMPLETO RECHAZAR"}]
[{"$f":"+PARTES!A77","v":"c PARTE PH"},{"$f":"+PARTES!B77","v":0},{"$f":"+PARTES!C77","v":0},{"$f":"+PARTES!D77","v":"ESTADO CIVIL:"},{"$f":"IF(PARTES!E77>0,PARTES!E77,\"INCOMPLETO RECHAZAR\")","v":"INCOMPLETO RECHAZAR"}]
[{"$f":"+PARTES!A78","v":"c PARTE PH"},{"$f":"+PARTES!B78","v":0},{"$f":"+PARTES!C78","v":0},{"$f":"+PARTES!D78","v":""},{"$f":"IF(PARTES!E78>0,PARTES!E78,\"INCOMPLETO RECHAZAR\")","v":"INCOMPLETO RECHAZAR"}]
[{"$f":"+PARTES!A79","v":"c PARTE PH"},{"$f":"+PARTES!B79","v":0},{"$f":"+PARTES!C79","v":0},{"$f":"+PARTES!D79","v":""},{"$f":"IF(PARTES!E79>0,PARTES!E79,\"INCOMPLETO RECHAZAR\")","v":"INCOMPLETO RECHAZAR"}]
[{"$f":"+PARTES!A80","v":"c PARTE PH"},{"$f":"+PARTES!B80","v":0},{"$f":"+PARTES!C80","v":0},{"$f":"+PARTES!D80","v":""},{"$f":"IF(PARTES!E80>0,PARTES!E80,\"INCOMPLETO RECHAZAR\")","v":"INCOMPLETO RECHAZAR"}]
[{"$f":"+PARTES!A81","v":"g CONTRIB."},{"$f":"+PARTES!B81","v":0},{"$f":"+PARTES!C81","v":0},{"$f":"+PARTES!D81","v":"CARÁCTER DE PARTE:"},{"$f":"IF(PARTES!E81=\"ELEGIR\",\"INCOMPLETO RECHAZAR\",PARTES!E81)","v":"INCOMPLETO RECHAZAR"}]
[{"$f":"+PARTES!A82","v":"c PARTE PH"},{"$f":"+PARTES!B82","v":0},{"$f":"+PARTES!C82","v":0},{"$f":"+PARTES!D82","v":"NOTA/OBSERVACIÓN -en mayúscula-:"},{"$f":"IF(PARTES!E82>0,PARTES!E82,\"INCOMPLETO RECHAZAR\")","v":"INCOMPLETO RECHAZAR"}]
[{"$f":"+PARTES!A83","v":"c PARTE PH"},{"$f":"+PARTES!B83","v":0},{"$f":"+PARTES!C83","v":0},{"$f":"+PARTES!D83","v":"DOC. IDENTIDAD –sin puntos-:"},{"$f":"IF(PARTES!E83>0,PARTES!E83,\"INCOMPLETO RECHAZAR\")","v":"INCOMPLETO RECHAZAR"}]
[{"$f":"+PARTES!A84","v":"c PARTE PH"},{"$f":"+PARTES!B84","v":0},{"$f":"+PARTES!C84","v":0},{"$f":"+PARTES!D84","v":"CUIT/CUIL –sin puntos ni barras-:"},{"$f":"IF(PARTES!E84>0,PARTES!E84,\"INCOMPLETO RECHAZAR\")","v":"INCOMPLETO RECHAZAR"}]
[{"$f":"+PARTES!A85","v":"c PARTE PH"},{"$f":"+PARTES!B85","v":0},{"$f":"+PARTES!C85","v":0},{"$f":"+PARTES!D85","v":"FECHA DE NACIMIENTO –dd/mm/aa-:"},{"$f":"IF(PARTES!E85>0,PARTES!E85,\"INCOMPLETO RECHAZAR\")","v":"INCOMPLETO RECHAZAR"}]
[{"$f":"+PARTES!A86","v":"c PARTE PH"},{"$f":"+PARTES!B86","v":0},{"$f":"+PARTES!C86","v":0},{"$f":"+PARTES!D86","v":"LUGAR DE NACIMIENTO:"},{"$f":"IF(PARTES!E86>0,PARTES!E86,\"INCOMPLETO RECHAZAR\")","v":"INCOMPLETO RECHAZAR"}]
[{"$f":"+PARTES!A87","v":"c PARTE PH"},{"$f":"+PARTES!B87","v":0},{"$f":"+PARTES!C87","v":0},{"$f":"+PARTES!D87","v":"NACIONALIDAD:"},{"$f":"IF(PARTES!E87>0,PARTES!E87,\"INCOMPLETO RECHAZAR\")","v":"INCOMPLETO RECHAZAR"}]
[{"$f":"+PARTES!A88","v":"c PARTE PH"},{"$f":"+PARTES!B88","v":0},{"$f":"+PARTES!C88","v":0},{"$f":"+PARTES!D88","v":"PROFESIÓN/OFICIO:"},{"$f":"IF(PARTES!E88>0,PARTES!E88,\"INCOMPLETO RECHAZAR\")","v":"INCOMPLETO RECHAZAR"}]
[{"$f":"+PARTES!A89","v":"c PARTE PH"},{"$f":"+PARTES!B89","v":0},{"$f":"+PARTES!C89","v":0},{"$f":"+PARTES!D89","v":"DOMICILIO REAL:"},{"$f":"IF(PARTES!E89>0,PARTES!E89,\"INCOMPLETO RECHAZAR\")","v":"INCOMPLETO RECHAZAR"}]
[{"$f":"+PARTES!A90","v":"c PARTE PH"},{"$f":"+PARTES!B90","v":0},{"$f":"+PARTES!C90","v":0},{"$f":"+PARTES!D90","v":"CEL/TEL :"},{"$f":"IF(PARTES!E90>0,PARTES!E90,\"INCOMPLETO RECHAZAR\")","v":"INCOMPLETO RECHAZAR"}]
[{"$f":"+PARTES!A91","v":"c PARTE PH"},{"$f":"+PARTES!B91","v":0},{"$f":"+PARTES!C91","v":0},{"$f":"+PARTES!D91","v":"EMAIL:"},{"$f":"IF(PARTES!E91>0,PARTES!E91,\"INCOMPLETO RECHAZAR\")","v":"INCOMPLETO RECHAZAR"}]
[{"$f":"+PARTES!A92","v":"c PARTE PH"},{"$f":"+PARTES!B92","v":0},{"$f":"+PARTES!C92","v":0},{"$f":"+PARTES!D92","v":"ESTADO CIVIL:"},{"$f":"IF(PARTES!E92>0,PARTES!E92,\"INCOMPLETO RECHAZAR\")","v":"INCOMPLETO RECHAZAR"}]
[{"$f":"+PARTES!A93","v":"c PARTE PH"},{"$f":"+PARTES!B93","v":0},{"$f":"+PARTES!C93","v":0},{"$f":"+PARTES!D93","v":""},{"$f":"IF(PARTES!E93>0,PARTES!E93,\"INCOMPLETO RECHAZAR\")","v":"INCOMPLETO RECHAZAR"}]
[{"$f":"+PARTES!A94","v":"c PARTE PH"},{"$f":"+PARTES!B94","v":0},{"$f":"+PARTES!C94","v":0},{"$f":"+PARTES!D94","v":""},{"$f":"IF(PARTES!E94>0,PARTES!E94,\"INCOMPLETO RECHAZAR\")","v":"INCOMPLETO RECHAZAR"}]
[{"$f":"+PARTES!A95","v":"c PARTE PH"},{"$f":"+PARTES!B95","v":0},{"$f":"+PARTES!C95","v":0},{"$f":"+PARTES!D95","v":""},{"$f":"IF(PARTES!E95>0,PARTES!E95,\"INCOMPLETO RECHAZAR\")","v":"INCOMPLETO RECHAZAR"}]
[{"$f":"+PARTES!A96","v":"g CONTRIB."},{"$f":"+PARTES!B96","v":0},{"$f":"+PARTES!C96","v":0},{"$f":"+PARTES!D96","v":"CARÁCTER DE PARTE:"},{"$f":"IF(PARTES!E96=\"ELEGIR\",\"INCOMPLETO RECHAZAR\",PARTES!E96)","v":"INCOMPLETO RECHAZAR"}]
[{"$f":"+PARTES!A97","v":"c PARTE PH"},{"$f":"+PARTES!B97","v":0},{"$f":"+PARTES!C97","v":0},{"$f":"+PARTES!D97","v":"NOTA/OBSERVACIÓN -en mayúscula-:"},{"$f":"IF(PARTES!E97>0,PARTES!E97,\"INCOMPLETO RECHAZAR\")","v":"INCOMPLETO RECHAZAR"}]
[{"$f":"+PARTES!A98","v":"c PARTE PH"},{"$f":"+PARTES!B98","v":0},{"$f":"+PARTES!C98","v":0},{"$f":"+PARTES!D98","v":"DOC. IDENTIDAD –sin puntos-:"},{"$f":"IF(PARTES!E98>0,PARTES!E98,\"INCOMPLETO RECHAZAR\")","v":"INCOMPLETO RECHAZAR"}]
[{"$f":"+PARTES!A99","v":"c PARTE PH"},{"$f":"+PARTES!B99","v":0},{"$f":"+PARTES!C99","v":0},{"$f":"+PARTES!D99","v":"CUIT/CUIL –sin puntos ni barras-:"},{"$f":"IF(PARTES!E99>0,PARTES!E99,\"INCOMPLETO RECHAZAR\")","v":"INCOMPLETO RECHAZAR"}]
[{"$f":"+PARTES!A100","v":"c PARTE PH"},{"$f":"+PARTES!B100","v":0},{"$f":"+PARTES!C100","v":0},{"$f":"+PARTES!D100","v":"FECHA DE NACIMIENTO –dd/mm/aa-:"},{"$f":"IF(PARTES!E100>0,PARTES!E100,\"INCOMPLETO RECHAZAR\")","v":"INCOMPLETO RECHAZAR"}]
[{"$f":"+PARTES!A101","v":"c PARTE PH"},{"$f":"+PARTES!B101","v":0},{"$f":"+PARTES!C101","v":0},{"$f":"+PARTES!D101","v":"LUGAR DE NACIMIENTO:"},{"$f":"IF(PARTES!E101>0,PARTES!E101,\"INCOMPLETO RECHAZAR\")","v":"INCOMPLETO RECHAZAR"}]
[{"$f":"+PARTES!A102","v":"c PARTE PH"},{"$f":"+PARTES!B102","v":0},{"$f":"+PARTES!C102","v":0},{"$f":"+PARTES!D102","v":"NACIONALIDAD:"},{"$f":"IF(PARTES!E102>0,PARTES!E102,\"INCOMPLETO RECHAZAR\")","v":"INCOMPLETO RECHAZAR"}]
[{"$f":"+PARTES!A103","v":"c PARTE PH"},{"$f":"+PARTES!B103","v":0},{"$f":"+PARTES!C103","v":0},{"$f":"+PARTES!D103","v":"PROFESIÓN/OFICIO:"},{"$f":"IF(PARTES!E103>0,PARTES!E103,\"INCOMPLETO RECHAZAR\")","v":"INCOMPLETO RECHAZAR"}]
[{"$f":"+PARTES!A104","v":"c PARTE PH"},{"$f":"+PARTES!B104","v":0},{"$f":"+PARTES!C104","v":0},{"$f":"+PARTES!D104","v":"DOMICILIO REAL:"},{"$f":"IF(PARTES!E104>0,PARTES!E104,\"INCOMPLETO RECHAZAR\")","v":"INCOMPLETO RECHAZAR"}]
[{"$f":"+PARTES!A105","v":"c PARTE PH"},{"$f":"+PARTES!B105","v":0},{"$f":"+PARTES!C105","v":0},{"$f":"+PARTES!D105","v":"CEL/TEL :"},{"$f":"IF(PARTES!E105>0,PARTES!E105,\"INCOMPLETO RECHAZAR\")","v":"INCOMPLETO RECHAZAR"}]
[{"$f":"+PARTES!A106","v":"c PARTE PH"},{"$f":"+PARTES!B106","v":0},{"$f":"+PARTES!C106","v":0},{"$f":"+PARTES!D106","v":"EMAIL:"},{"$f":"IF(PARTES!E106>0,PARTES!E106,\"INCOMPLETO RECHAZAR\")","v":"INCOMPLETO RECHAZAR"}]
[{"$f":"+PARTES!A107","v":"c PARTE PH"},{"$f":"+PARTES!B107","v":0},{"$f":"+PARTES!C107","v":0},{"$f":"+PARTES!D107","v":"ESTADO CIVIL:"},{"$f":"IF(PARTES!E107>0,PARTES!E107,\"INCOMPLETO RECHAZAR\")","v":"INCOMPLETO RECHAZAR"}]
[{"$f":"+PARTES!A108","v":"c PARTE PH"},{"$f":"+PARTES!B108","v":0},{"$f":"+PARTES!C108","v":0},{"$f":"+PARTES!D108","v":""},{"$f":"IF(PARTES!E108>0,PARTES!E108,\"INCOMPLETO RECHAZAR\")","v":"INCOMPLETO RECHAZAR"}]
[{"$f":"+PARTES!A109","v":"c PARTE PH"},{"$f":"+PARTES!B109","v":0},{"$f":"+PARTES!C109","v":0},{"$f":"+PARTES!D109","v":""},{"$f":"IF(PARTES!E109>0,PARTES!E109,\"INCOMPLETO RECHAZAR\")","v":"INCOMPLETO RECHAZAR"}]
[{"$f":"+PARTES!A110","v":"c PARTE PH"},{"$f":"+PARTES!B110","v":0},{"$f":"+PARTES!C110","v":0},{"$f":"+PARTES!D110","v":""},{"$f":"IF(PARTES!E110>0,PARTES!E110,\"INCOMPLETO RECHAZAR\")","v":"INCOMPLETO RECHAZAR"}]
[{"$f":"+PARTES!A111","v":"g CONTRIB."},{"$f":"+PARTES!B111","v":0},{"$f":"+PARTES!C111","v":0},{"$f":"+PARTES!D111","v":"CARÁCTER DE PARTE:"},{"$f":"IF(PARTES!E111=\"ELEGIR\",\"INCOMPLETO RECHAZAR\",PARTES!E111)","v":"INCOMPLETO RECHAZAR"}]
[{"$f":"+PARTES!A112","v":"c PARTE PH"},{"$f":"+PARTES!B112","v":0},{"$f":"+PARTES!C112","v":0},{"$f":"+PARTES!D112","v":"NOTA/OBSERVACIÓN -en mayúscula-:"},{"$f":"IF(PARTES!E112>0,PARTES!E112,\"INCOMPLETO RECHAZAR\")","v":"INCOMPLETO RECHAZAR"}]
[{"$f":"+PARTES!A113","v":"c PARTE PH"},{"$f":"+PARTES!B113","v":0},{"$f":"+PARTES!C113","v":0},{"$f":"+PARTES!D113","v":"DOC. IDENTIDAD –sin puntos-:"},{"$f":"IF(PARTES!E113>0,PARTES!E113,\"INCOMPLETO RECHAZAR\")","v":"INCOMPLETO RECHAZAR"}]
[{"$f":"+PARTES!A114","v":"c PARTE PH"},{"$f":"+PARTES!B114","v":0},{"$f":"+PARTES!C114","v":0},{"$f":"+PARTES!D114","v":"CUIT/CUIL –sin puntos ni barras-:"},{"$f":"IF(PARTES!E114>0,PARTES!E114,\"INCOMPLETO RECHAZAR\")","v":"INCOMPLETO RECHAZAR"}]
[{"$f":"+PARTES!A115","v":"c PARTE PH"},{"$f":"+PARTES!B115","v":0},{"$f":"+PARTES!C115","v":0},{"$f":"+PARTES!D115","v":"FECHA DE NACIMIENTO –dd/mm/aa-:"},{"$f":"IF(PARTES!E115>0,PARTES!E115,\"INCOMPLETO RECHAZAR\")","v":"INCOMPLETO RECHAZAR"}]
[{"$f":"+PARTES!A116","v":"c PARTE PH"},{"$f":"+PARTES!B116","v":0},{"$f":"+PARTES!C116","v":0},{"$f":"+PARTES!D116","v":"LUGAR DE NACIMIENTO:"},{"$f":"IF(PARTES!E116>0,PARTES!E116,\"INCOMPLETO RECHAZAR\")","v":"INCOMPLETO RECHAZAR"}]
[{"$f":"+PARTES!A117","v":"c PARTE PH"},{"$f":"+PARTES!B117","v":0},{"$f":"+PARTES!C117","v":0},{"$f":"+PARTES!D117","v":"NACIONALIDAD:"},{"$f":"IF(PARTES!E117>0,PARTES!E117,\"INCOMPLETO RECHAZAR\")","v":"INCOMPLETO RECHAZAR"}]
[{"$f":"+PARTES!A118","v":"c PARTE PH"},{"$f":"+PARTES!B118","v":0},{"$f":"+PARTES!C118","v":0},{"$f":"+PARTES!D118","v":"PROFESIÓN/OFICIO:"},{"$f":"IF(PARTES!E118>0,PARTES!E118,\"INCOMPLETO RECHAZAR\")","v":"INCOMPLETO RECHAZAR"}]
[{"$f":"+PARTES!A119","v":"c PARTE PH"},{"$f":"+PARTES!B119","v":0},{"$f":"+PARTES!C119","v":0},{"$f":"+PARTES!D119","v":"DOMICILIO REAL:"},{"$f":"IF(PARTES!E119>0,PARTES!E119,\"INCOMPLETO RECHAZAR\")","v":"INCOMPLETO RECHAZAR"}]
[{"$f":"+PARTES!A120","v":"c PARTE PH"},{"$f":"+PARTES!B120","v":0},{"$f":"+PARTES!C120","v":0},{"$f":"+PARTES!D120","v":"CEL/TEL :"},{"$f":"IF(PARTES!E120>0,PARTES!E120,\"INCOMPLETO RECHAZAR\")","v":"INCOMPLETO RECHAZAR"}]
[{"$f":"+PARTES!A121","v":"c PARTE PH"},{"$f":"+PARTES!B121","v":0},{"$f":"+PARTES!C121","v":0},{"$f":"+PARTES!D121","v":"EMAIL:"},{"$f":"IF(PARTES!E121>0,PARTES!E121,\"INCOMPLETO RECHAZAR\")","v":"INCOMPLETO RECHAZAR"}]
[{"$f":"+PARTES!A122","v":"c PARTE PH"},{"$f":"+PARTES!B122","v":0},{"$f":"+PARTES!C122","v":0},{"$f":"+PARTES!D122","v":"ESTADO CIVIL:"},{"$f":"IF(PARTES!E122>0,PARTES!E122,\"INCOMPLETO RECHAZAR\")","v":"INCOMPLETO RECHAZAR"}]
[{"$f":"+PARTES!A123","v":"c PARTE PH"},{"$f":"+PARTES!B123","v":0},{"$f":"+PARTES!C123","v":0},{"$f":"+PARTES!D123","v":""},{"$f":"IF(PARTES!E123>0,PARTES!E123,\"INCOMPLETO RECHAZAR\")","v":"INCOMPLETO RECHAZAR"}]
[{"$f":"+PARTES!A124","v":"c PARTE PH"},{"$f":"+PARTES!B124","v":0},{"$f":"+PARTES!C124","v":0},{"$f":"+PARTES!D124","v":""},{"$f":"IF(PARTES!E124>0,PARTES!E124,\"INCOMPLETO RECHAZAR\")","v":"INCOMPLETO RECHAZAR"}]
[{"$f":"+PARTES!A125","v":"c PARTE PH"},{"$f":"+PARTES!B125","v":0},{"$f":"+PARTES!C125","v":0},{"$f":"+PARTES!D125","v":""},{"$f":"IF(PARTES!E125>0,PARTES!E125,\"INCOMPLETO RECHAZAR\")","v":"INCOMPLETO RECHAZAR"}]
[{"$f":"+PARTES!A126","v":"g CONTRIB."},{"$f":"+PARTES!B126","v":0},{"$f":"+PARTES!C126","v":0},{"$f":"+PARTES!D126","v":"CARÁCTER DE PARTE:"},{"$f":"IF(PARTES!E126=\"ELEGIR\",\"INCOMPLETO RECHAZAR\",PARTES!E126)","v":"INCOMPLETO RECHAZAR"}]
[{"$f":"+PARTES!A127","v":"c PARTE PH"},{"$f":"+PARTES!B127","v":0},{"$f":"+PARTES!C127","v":0},{"$f":"+PARTES!D127","v":"NOTA/OBSERVACIÓN -en mayúscula-:"},{"$f":"IF(PARTES!E127>0,PARTES!E127,\"INCOMPLETO RECHAZAR\")","v":"INCOMPLETO RECHAZAR"}]
[{"$f":"+PARTES!A128","v":"c PARTE PH"},{"$f":"+PARTES!B128","v":0},{"$f":"+PARTES!C128","v":0},{"$f":"+PARTES!D128","v":"DOC. IDENTIDAD –sin puntos-:"},{"$f":"IF(PARTES!E128>0,PARTES!E128,\"INCOMPLETO RECHAZAR\")","v":"INCOMPLETO RECHAZAR"}]
[{"$f":"+PARTES!A129","v":"c PARTE PH"},{"$f":"+PARTES!B129","v":0},{"$f":"+PARTES!C129","v":0},{"$f":"+PARTES!D129","v":"CUIT/CUIL –sin puntos ni barras-:"},{"$f":"IF(PARTES!E129>0,PARTES!E129,\"INCOMPLETO RECHAZAR\")","v":"INCOMPLETO RECHAZAR"}]
[{"$f":"+PARTES!A130","v":"c PARTE PH"},{"$f":"+PARTES!B130","v":0},{"$f":"+PARTES!C130","v":0},{"$f":"+PARTES!D130","v":"FECHA DE NACIMIENTO –dd/mm/aa-:"},{"$f":"IF(PARTES!E130>0,PARTES!E130,\"INCOMPLETO RECHAZAR\")","v":"INCOMPLETO RECHAZAR"}]
[{"$f":"+PARTES!A131","v":"c PARTE PH"},{"$f":"+PARTES!B131","v":0},{"$f":"+PARTES!C131","v":0},{"$f":"+PARTES!D131","v":"LUGAR DE NACIMIENTO:"},{"$f":"IF(PARTES!E131>0,PARTES!E131,\"INCOMPLETO RECHAZAR\")","v":"INCOMPLETO RECHAZAR"}]
[{"$f":"+PARTES!A132","v":"c PARTE PH"},{"$f":"+PARTES!B132","v":0},{"$f":"+PARTES!C132","v":0},{"$f":"+PARTES!D132","v":"NACIONALIDAD:"},{"$f":"IF(PARTES!E132>0,PARTES!E132,\"INCOMPLETO RECHAZAR\")","v":"INCOMPLETO RECHAZAR"}]
[{"$f":"+PARTES!A133","v":"c PARTE PH"},{"$f":"+PARTES!B133","v":0},{"$f":"+PARTES!C133","v":0},{"$f":"+PARTES!D133","v":"PROFESIÓN/OFICIO:"},{"$f":"IF(PARTES!E133>0,PARTES!E133,\"INCOMPLETO RECHAZAR\")","v":"INCOMPLETO RECHAZAR"}]
[{"$f":"+PARTES!A134","v":"c PARTE PH"},{"$f":"+PARTES!B134","v":0},{"$f":"+PARTES!C134","v":0},{"$f":"+PARTES!D134","v":"DOMICILIO REAL:"},{"$f":"IF(PARTES!E134>0,PARTES!E134,\"INCOMPLETO RECHAZAR\")","v":"INCOMPLETO RECHAZAR"}]
[{"$f":"+PARTES!A135","v":"c PARTE PH"},{"$f":"+PARTES!B135","v":0},{"$f":"+PARTES!C135","v":0},{"$f":"+PARTES!D135","v":"CEL/TEL :"},{"$f":"IF(PARTES!E135>0,PARTES!E135,\"INCOMPLETO RECHAZAR\")","v":"INCOMPLETO RECHAZAR"}]
[{"$f":"+PARTES!A136","v":"c PARTE PH"},{"$f":"+PARTES!B136","v":0},{"$f":"+PARTES!C136","v":0},{"$f":"+PARTES!D136","v":"EMAIL:"},{"$f":"IF(PARTES!E136>0,PARTES!E136,\"INCOMPLETO RECHAZAR\")","v":"INCOMPLETO RECHAZAR"}]
[{"$f":"+PARTES!A137","v":"c PARTE PH"},{"$f":"+PARTES!B137","v":0},{"$f":"+PARTES!C137","v":0},{"$f":"+PARTES!D137","v":"ESTADO CIVIL:"},{"$f":"IF(PARTES!E137>0,PARTES!E137,\"INCOMPLETO RECHAZAR\")","v":"INCOMPLETO RECHAZAR"}]
[{"$f":"+PARTES!A138","v":"c PARTE PH"},{"$f":"+PARTES!B138","v":0},{"$f":"+PARTES!C138","v":0},{"$f":"+PARTES!D138","v":""},{"$f":"IF(PARTES!E138>0,PARTES!E138,\"INCOMPLETO RECHAZAR\")","v":"INCOMPLETO RECHAZAR"}]
[{"$f":"+PARTES!A139","v":"c PARTE PH"},{"$f":"+PARTES!B139","v":0},{"$f":"+PARTES!C139","v":0},{"$f":"+PARTES!D139","v":""},{"$f":"IF(PARTES!E139>0,PARTES!E139,\"INCOMPLETO RECHAZAR\")","v":"INCOMPLETO RECHAZAR"}]
[{"$f":"+PARTES!A140","v":"c PARTE PH"},{"$f":"+PARTES!B140","v":0},{"$f":"+PARTES!C140","v":0},{"$f":"+PARTES!D140","v":""},{"$f":"IF(PARTES!E140>0,PARTES!E140,\"INCOMPLETO RECHAZAR\")","v":"INCOMPLETO RECHAZAR"}]
[{"$f":"+PARTES!A141","v":"g CONTRIB."},{"$f":"+PARTES!B141","v":0},{"$f":"+PARTES!C141","v":0},{"$f":"+PARTES!D141","v":"CARÁCTER DE PARTE:"},{"$f":"IF(PARTES!E141=\"ELEGIR\",\"INCOMPLETO RECHAZAR\",PARTES!E141)","v":"INCOMPLETO RECHAZAR"}]
[{"$f":"+PARTES!A142","v":"c PARTE PH"},{"$f":"+PARTES!B142","v":0},{"$f":"+PARTES!C142","v":0},{"$f":"+PARTES!D142","v":"NOTA/OBSERVACIÓN -en mayúscula-:"},{"$f":"IF(PARTES!E142>0,PARTES!E142,\"INCOMPLETO RECHAZAR\")","v":"INCOMPLETO RECHAZAR"}]
[{"$f":"+PARTES!A143","v":"c PARTE PH"},{"$f":"+PARTES!B143","v":0},{"$f":"+PARTES!C143","v":0},{"$f":"+PARTES!D143","v":"DOC. IDENTIDAD –sin puntos-:"},{"$f":"IF(PARTES!E143>0,PARTES!E143,\"INCOMPLETO RECHAZAR\")","v":"INCOMPLETO RECHAZAR"}]
[{"$f":"+PARTES!A144","v":"c PARTE PH"},{"$f":"+PARTES!B144","v":0},{"$f":"+PARTES!C144","v":0},{"$f":"+PARTES!D144","v":"CUIT/CUIL –sin puntos ni barras-:"},{"$f":"IF(PARTES!E144>0,PARTES!E144,\"INCOMPLETO RECHAZAR\")","v":"INCOMPLETO RECHAZAR"}]
[{"$f":"+PARTES!A145","v":"c PARTE PH"},{"$f":"+PARTES!B145","v":0},{"$f":"+PARTES!C145","v":0},{"$f":"+PARTES!D145","v":"FECHA DE NACIMIENTO –dd/mm/aa-:"},{"$f":"IF(PARTES!E145>0,PARTES!E145,\"INCOMPLETO RECHAZAR\")","v":"INCOMPLETO RECHAZAR"}]
[{"$f":"+PARTES!A146","v":"c PARTE PH"},{"$f":"+PARTES!B146","v":0},{"$f":"+PARTES!C146","v":0},{"$f":"+PARTES!D146","v":"LUGAR DE NACIMIENTO:"},{"$f":"IF(PARTES!E146>0,PARTES!E146,\"INCOMPLETO RECHAZAR\")","v":"INCOMPLETO RECHAZAR"}]
[{"$f":"+PARTES!A147","v":"c PARTE PH"},{"$f":"+PARTES!B147","v":0},{"$f":"+PARTES!C147","v":0},{"$f":"+PARTES!D147","v":"NACIONALIDAD:"},{"$f":"IF(PARTES!E147>0,PARTES!E147,\"INCOMPLETO RECHAZAR\")","v":"INCOMPLETO RECHAZAR"}]
[{"$f":"+PARTES!A148","v":"c PARTE PH"},{"$f":"+PARTES!B148","v":0},{"$f":"+PARTES!C148","v":0},{"$f":"+PARTES!D148","v":"PROFESIÓN/OFICIO:"},{"$f":"IF(PARTES!E148>0,PARTES!E148,\"INCOMPLETO RECHAZAR\")","v":"INCOMPLETO RECHAZAR"}]
[{"$f":"+PARTES!A149","v":"c PARTE PH"},{"$f":"+PARTES!B149","v":0},{"$f":"+PARTES!C149","v":0},{"$f":"+PARTES!D149","v":"DOMICILIO REAL:"},{"$f":"IF(PARTES!E149>0,PARTES!E149,\"INCOMPLETO RECHAZAR\")","v":"INCOMPLETO RECHAZAR"}]
[{"$f":"+PARTES!A150","v":"c PARTE PH"},{"$f":"+PARTES!B150","v":0},{"$f":"+PARTES!C150","v":0},{"$f":"+PARTES!D150","v":"CEL/TEL :"},{"$f":"IF(PARTES!E150>0,PARTES!E150,\"INCOMPLETO RECHAZAR\")","v":"INCOMPLETO RECHAZAR"}]
[{"$f":"+PARTES!A151","v":"c PARTE PH"},{"$f":"+PARTES!B151","v":0},{"$f":"+PARTES!C151","v":0},{"$f":"+PARTES!D151","v":"EMAIL:"},{"$f":"IF(PARTES!E151>0,PARTES!E151,\"INCOMPLETO RECHAZAR\")","v":"INCOMPLETO RECHAZAR"}]
[{"$f":"+PARTES!A152","v":"c PARTE PH"},{"$f":"+PARTES!B152","v":0},{"$f":"+PARTES!C152","v":0},{"$f":"+PARTES!D152","v":"ESTADO CIVIL:"},{"$f":"IF(PARTES!E152>0,PARTES!E152,\"INCOMPLETO RECHAZAR\")","v":"INCOMPLETO RECHAZAR"}]
[{"$f":"+PARTES!A153","v":"c PARTE PH"},{"$f":"+PARTES!B153","v":0},{"$f":"+PARTES!C153","v":0},{"$f":"+PARTES!D153","v":""},{"$f":"IF(PARTES!E153>0,PARTES!E153,\"INCOMPLETO RECHAZAR\")","v":"INCOMPLETO RECHAZAR"}]
[{"$f":"+PARTES!A154","v":"c PARTE PH"},{"$f":"+PARTES!B154","v":0},{"$f":"+PARTES!C154","v":0},{"$f":"+PARTES!D154","v":""},{"$f":"IF(PARTES!E154>0,PARTES!E154,\"INCOMPLETO RECHAZAR\")","v":"INCOMPLETO RECHAZAR"}]
[{"$f":"+PARTES!A155","v":"c PARTE PH"},{"$f":"+PARTES!B155","v":0},{"$f":"+PARTES!C155","v":0},{"$f":"+PARTES!D155","v":""},{"$f":"IF(PARTES!E155>0,PARTES!E155,\"INCOMPLETO RECHAZAR\")","v":"INCOMPLETO RECHAZAR"}]
[{"$f":"+PARTES!A156","v":"g CONTRIB."},{"$f":"+PARTES!B156","v":0},{"$f":"+PARTES!C156","v":0},{"$f":"+PARTES!D156","v":"CARÁCTER DE PARTE:"},{"$f":"IF(PARTES!E156=\"ELEGIR\",\"INCOMPLETO RECHAZAR\",PARTES!E156)","v":"INCOMPLETO RECHAZAR"}]
[{"$f":"+PARTES!A157","v":"c PARTE PH"},{"$f":"+PARTES!B157","v":0},{"$f":"+PARTES!C157","v":0},{"$f":"+PARTES!D157","v":"NOTA/OBSERVACIÓN -en mayúscula-:"},{"$f":"IF(PARTES!E157>0,PARTES!E157,\"INCOMPLETO RECHAZAR\")","v":"INCOMPLETO RECHAZAR"}]
[{"$f":"+PARTES!A158","v":"c PARTE PH"},{"$f":"+PARTES!B158","v":0},{"$f":"+PARTES!C158","v":0},{"$f":"+PARTES!D158","v":"DOC. IDENTIDAD –sin puntos-:"},{"$f":"IF(PARTES!E158>0,PARTES!E158,\"INCOMPLETO RECHAZAR\")","v":"INCOMPLETO RECHAZAR"}]
[{"$f":"+PARTES!A159","v":"c PARTE PH"},{"$f":"+PARTES!B159","v":0},{"$f":"+PARTES!C159","v":0},{"$f":"+PARTES!D159","v":"CUIT/CUIL –sin puntos ni barras-:"},{"$f":"IF(PARTES!E159>0,PARTES!E159,\"INCOMPLETO RECHAZAR\")","v":"INCOMPLETO RECHAZAR"}]
[{"$f":"+PARTES!A160","v":"c PARTE PH"},{"$f":"+PARTES!B160","v":0},{"$f":"+PARTES!C160","v":0},{"$f":"+PARTES!D160","v":"FECHA DE NACIMIENTO –dd/mm/aa-:"},{"$f":"IF(PARTES!E160>0,PARTES!E160,\"INCOMPLETO RECHAZAR\")","v":"INCOMPLETO RECHAZAR"}]
[{"$f":"+PARTES!A161","v":"c PARTE PH"},{"$f":"+PARTES!B161","v":0},{"$f":"+PARTES!C161","v":0},{"$f":"+PARTES!D161","v":"LUGAR DE NACIMIENTO:"},{"$f":"IF(PARTES!E161>0,PARTES!E161,\"INCOMPLETO RECHAZAR\")","v":"INCOMPLETO RECHAZAR"}]
[{"$f":"+PARTES!A162","v":"c PARTE PH"},{"$f":"+PARTES!B162","v":0},{"$f":"+PARTES!C162","v":0},{"$f":"+PARTES!D162","v":"NACIONALIDAD:"},{"$f":"IF(PARTES!E162>0,PARTES!E162,\"INCOMPLETO RECHAZAR\")","v":"INCOMPLETO RECHAZAR"}]
[{"$f":"+PARTES!A163","v":"c PARTE PH"},{"$f":"+PARTES!B163","v":0},{"$f":"+PARTES!C163","v":0},{"$f":"+PARTES!D163","v":"PROFESIÓN/OFICIO:"},{"$f":"IF(PARTES!E163>0,PARTES!E163,\"INCOMPLETO RECHAZAR\")","v":"INCOMPLETO RECHAZAR"}]
[{"$f":"+PARTES!A164","v":"c PARTE PH"},{"$f":"+PARTES!B164","v":0},{"$f":"+PARTES!C164","v":0},{"$f":"+PARTES!D164","v":"DOMICILIO REAL:"},{"$f":"IF(PARTES!E164>0,PARTES!E164,\"INCOMPLETO RECHAZAR\")","v":"INCOMPLETO RECHAZAR"}]
[{"$f":"+PARTES!A165","v":"c PARTE PH"},{"$f":"+PARTES!B165","v":0},{"$f":"+PARTES!C165","v":0},{"$f":"+PARTES!D165","v":"CEL/TEL :"},{"$f":"IF(PARTES!E165>0,PARTES!E165,\"INCOMPLETO RECHAZAR\")","v":"INCOMPLETO RECHAZAR"}]
[{"$f":"+PARTES!A166","v":"c PARTE PH"},{"$f":"+PARTES!B166","v":0},{"$f":"+PARTES!C166","v":0},{"$f":"+PARTES!D166","v":"EMAIL:"},{"$f":"IF(PARTES!E166>0,PARTES!E166,\"INCOMPLETO RECHAZAR\")","v":"INCOMPLETO RECHAZAR"}]
[{"$f":"+PARTES!A167","v":"c PARTE PH"},{"$f":"+PARTES!B167","v":0},{"$f":"+PARTES!C167","v":0},{"$f":"+PARTES!D167","v":"ESTADO CIVIL:"},{"$f":"IF(PARTES!E167>0,PARTES!E167,\"INCOMPLETO RECHAZAR\")","v":"INCOMPLETO RECHAZAR"}]
[{"$f":"+PARTES!A168","v":"c PARTE PH"},{"$f":"+PARTES!B168","v":0},{"$f":"+PARTES!C168","v":0},{"$f":"+PARTES!D168","v":""},{"$f":"IF(PARTES!E168>0,PARTES!E168,\"INCOMPLETO RECHAZAR\")","v":"INCOMPLETO RECHAZAR"}]
[{"$f":"+PARTES!A169","v":"c PARTE PH"},{"$f":"+PARTES!B169","v":0},{"$f":"+PARTES!C169","v":0},{"$f":"+PARTES!D169","v":""},{"$f":"IF(PARTES!E169>0,PARTES!E169,\"INCOMPLETO RECHAZAR\")","v":"INCOMPLETO RECHAZAR"}]
[{"$f":"+PARTES!A170","v":"c PARTE PH"},{"$f":"+PARTES!B170","v":0},{"$f":"+PARTES!C170","v":0},{"$f":"+PARTES!D170","v":""},{"$f":"IF(PARTES!E170>0,PARTES!E170,\"INCOMPLETO RECHAZAR\")","v":"INCOMPLETO RECHAZAR"}]
[{"$f":"+PARTES!A171","v":"g CONTRIB."},{"$f":"+PARTES!B171","v":0},{"$f":"+PARTES!C171","v":0},{"$f":"+PARTES!D171","v":"CARÁCTER DE PARTE:"},{"$f":"IF(PARTES!E171=\"ELEGIR\",\"INCOMPLETO RECHAZAR\",PARTES!E171)","v":"INCOMPLETO RECHAZAR"}]
[{"$f":"+PARTES!A172","v":"c PARTE PH"},{"$f":"+PARTES!B172","v":0},{"$f":"+PARTES!C172","v":0},{"$f":"+PARTES!D172","v":"NOTA/OBSERVACIÓN -en mayúscula-:"},{"$f":"IF(PARTES!E172>0,PARTES!E172,\"INCOMPLETO RECHAZAR\")","v":"INCOMPLETO RECHAZAR"}]
[{"$f":"+PARTES!A173","v":"c PARTE PH"},{"$f":"+PARTES!B173","v":0},{"$f":"+PARTES!C173","v":0},{"$f":"+PARTES!D173","v":"DOC. IDENTIDAD –sin puntos-:"},{"$f":"IF(PARTES!E173>0,PARTES!E173,\"INCOMPLETO RECHAZAR\")","v":"INCOMPLETO RECHAZAR"}]
[{"$f":"+PARTES!A174","v":"c PARTE PH"},{"$f":"+PARTES!B174","v":0},{"$f":"+PARTES!C174","v":0},{"$f":"+PARTES!D174","v":"CUIT/CUIL –sin puntos ni barras-:"},{"$f":"IF(PARTES!E174>0,PARTES!E174,\"INCOMPLETO RECHAZAR\")","v":"INCOMPLETO RECHAZAR"}]
[{"$f":"+PARTES!A175","v":"c PARTE PH"},{"$f":"+PARTES!B175","v":0},{"$f":"+PARTES!C175","v":0},{"$f":"+PARTES!D175","v":"FECHA DE NACIMIENTO –dd/mm/aa-:"},{"$f":"IF(PARTES!E175>0,PARTES!E175,\"INCOMPLETO RECHAZAR\")","v":"INCOMPLETO RECHAZAR"}]
[{"$f":"+PARTES!A176","v":"c PARTE PH"},{"$f":"+PARTES!B176","v":0},{"$f":"+PARTES!C176","v":0},{"$f":"+PARTES!D176","v":"LUGAR DE NACIMIENTO:"},{"$f":"IF(PARTES!E176>0,PARTES!E176,\"INCOMPLETO RECHAZAR\")","v":"INCOMPLETO RECHAZAR"}]
[{"$f":"+PARTES!A177","v":"c PARTE PH"},{"$f":"+PARTES!B177","v":0},{"$f":"+PARTES!C177","v":0},{"$f":"+PARTES!D177","v":"NACIONALIDAD:"},{"$f":"IF(PARTES!E177>0,PARTES!E177,\"INCOMPLETO RECHAZAR\")","v":"INCOMPLETO RECHAZAR"}]
[{"$f":"+PARTES!A178","v":"c PARTE PH"},{"$f":"+PARTES!B178","v":0},{"$f":"+PARTES!C178","v":0},{"$f":"+PARTES!D178","v":"PROFESIÓN/OFICIO:"},{"$f":"IF(PARTES!E178>0,PARTES!E178,\"INCOMPLETO RECHAZAR\")","v":"INCOMPLETO RECHAZAR"}]
[{"$f":"+PARTES!A179","v":"c PARTE PH"},{"$f":"+PARTES!B179","v":0},{"$f":"+PARTES!C179","v":0},{"$f":"+PARTES!D179","v":"DOMICILIO REAL:"},{"$f":"IF(PARTES!E179>0,PARTES!E179,\"INCOMPLETO RECHAZAR\")","v":"INCOMPLETO RECHAZAR"}]
[{"$f":"+PARTES!A180","v":"c PARTE PH"},{"$f":"+PARTES!B180","v":0},{"$f":"+PARTES!C180","v":0},{"$f":"+PARTES!D180","v":"CEL/TEL :"},{"$f":"IF(PARTES!E180>0,PARTES!E180,\"INCOMPLETO RECHAZAR\")","v":"INCOMPLETO RECHAZAR"}]
[{"$f":"+PARTES!A181","v":"c PARTE PH"},{"$f":"+PARTES!B181","v":0},{"$f":"+PARTES!C181","v":0},{"$f":"+PARTES!D181","v":"EMAIL:"},{"$f":"IF(PARTES!E181>0,PARTES!E181,\"INCOMPLETO RECHAZAR\")","v":"INCOMPLETO RECHAZAR"}]
[{"$f":"+PARTES!A182","v":"c PARTE PH"},{"$f":"+PARTES!B182","v":0},{"$f":"+PARTES!C182","v":0},{"$f":"+PARTES!D182","v":"ESTADO CIVIL:"},{"$f":"IF(PARTES!E182>0,PARTES!E182,\"INCOMPLETO RECHAZAR\")","v":"INCOMPLETO RECHAZAR"}]
[{"$f":"+PARTES!A183","v":"c PARTE PH"},{"$f":"+PARTES!B183","v":0},{"$f":"+PARTES!C183","v":0},{"$f":"+PARTES!D183","v":""},{"$f":"IF(PARTES!E183>0,PARTES!E183,\"INCOMPLETO RECHAZAR\")","v":"INCOMPLETO RECHAZAR"}]
[{"$f":"+PARTES!A184","v":"c PARTE PH"},{"$f":"+PARTES!B184","v":0},{"$f":"+PARTES!C184","v":0},{"$f":"+PARTES!D184","v":""},{"$f":"IF(PARTES!E184>0,PARTES!E184,\"INCOMPLETO RECHAZAR\")","v":"INCOMPLETO RECHAZAR"}]
[{"$f":"+PARTES!A185","v":"c PARTE PH"},{"$f":"+PARTES!B185","v":0},{"$f":"+PARTES!C185","v":0},{"$f":"+PARTES!D185","v":""},{"$f":"IF(PARTES!E185>0,PARTES!E185,\"INCOMPLETO RECHAZAR\")","v":"INCOMPLETO RECHAZAR"}]
[{"$f":"+PARTES!A186","v":"g CONTRIB."},{"$f":"+PARTES!B186","v":0},{"$f":"+PARTES!C186","v":0},{"$f":"+PARTES!D186","v":"CARÁCTER DE PARTE:"},{"$f":"IF(PARTES!E186=\"ELEGIR\",\"INCOMPLETO RECHAZAR\",PARTES!E186)","v":"INCOMPLETO RECHAZAR"}]
[{"$f":"+PARTES!A187","v":"c PARTE PH"},{"$f":"+PARTES!B187","v":0},{"$f":"+PARTES!C187","v":0},{"$f":"+PARTES!D187","v":"NOTA/OBSERVACIÓN -en mayúscula-:"},{"$f":"IF(PARTES!E187>0,PARTES!E187,\"INCOMPLETO RECHAZAR\")","v":"INCOMPLETO RECHAZAR"}]
[{"$f":"+PARTES!A188","v":"c PARTE PH"},{"$f":"+PARTES!B188","v":0},{"$f":"+PARTES!C188","v":0},{"$f":"+PARTES!D188","v":"DOC. IDENTIDAD –sin puntos-:"},{"$f":"IF(PARTES!E188>0,PARTES!E188,\"INCOMPLETO RECHAZAR\")","v":"INCOMPLETO RECHAZAR"}]
[{"$f":"+PARTES!A189","v":"c PARTE PH"},{"$f":"+PARTES!B189","v":0},{"$f":"+PARTES!C189","v":0},{"$f":"+PARTES!D189","v":"CUIT/CUIL –sin puntos ni barras-:"},{"$f":"IF(PARTES!E189>0,PARTES!E189,\"INCOMPLETO RECHAZAR\")","v":"INCOMPLETO RECHAZAR"}]
[{"$f":"+PARTES!A190","v":"c PARTE PH"},{"$f":"+PARTES!B190","v":0},{"$f":"+PARTES!C190","v":0},{"$f":"+PARTES!D190","v":"FECHA DE NACIMIENTO –dd/mm/aa-:"},{"$f":"IF(PARTES!E190>0,PARTES!E190,\"INCOMPLETO RECHAZAR\")","v":"INCOMPLETO RECHAZAR"}]
[{"$f":"+PARTES!A191","v":"c PARTE PH"},{"$f":"+PARTES!B191","v":0},{"$f":"+PARTES!C191","v":0},{"$f":"+PARTES!D191","v":"LUGAR DE NACIMIENTO:"},{"$f":"IF(PARTES!E191>0,PARTES!E191,\"INCOMPLETO RECHAZAR\")","v":"INCOMPLETO RECHAZAR"}]
[{"$f":"+PARTES!A192","v":"c PARTE PH"},{"$f":"+PARTES!B192","v":0},{"$f":"+PARTES!C192","v":0},{"$f":"+PARTES!D192","v":"NACIONALIDAD:"},{"$f":"IF(PARTES!E192>0,PARTES!E192,\"INCOMPLETO RECHAZAR\")","v":"INCOMPLETO RECHAZAR"}]
[{"$f":"+PARTES!A193","v":"c PARTE PH"},{"$f":"+PARTES!B193","v":0},{"$f":"+PARTES!C193","v":0},{"$f":"+PARTES!D193","v":"PROFESIÓN/OFICIO:"},{"$f":"IF(PARTES!E193>0,PARTES!E193,\"INCOMPLETO RECHAZAR\")","v":"INCOMPLETO RECHAZAR"}]
[{"$f":"+PARTES!A194","v":"c PARTE PH"},{"$f":"+PARTES!B194","v":0},{"$f":"+PARTES!C194","v":0},{"$f":"+PARTES!D194","v":"DOMICILIO REAL:"},{"$f":"IF(PARTES!E194>0,PARTES!E194,\"INCOMPLETO RECHAZAR\")","v":"INCOMPLETO RECHAZAR"}]
[{"$f":"+PARTES!A195","v":"c PARTE PH"},{"$f":"+PARTES!B195","v":0},{"$f":"+PARTES!C195","v":0},{"$f":"+PARTES!D195","v":"CEL/TEL :"},{"$f":"IF(PARTES!E195>0,PARTES!E195,\"INCOMPLETO RECHAZAR\")","v":"INCOMPLETO RECHAZAR"}]
[{"$f":"+PARTES!A196","v":"c PARTE PH"},{"$f":"+PARTES!B196","v":0},{"$f":"+PARTES!C196","v":0},{"$f":"+PARTES!D196","v":"EMAIL:"},{"$f":"IF(PARTES!E196>0,PARTES!E196,\"INCOMPLETO RECHAZAR\")","v":"INCOMPLETO RECHAZAR"}]
[{"$f":"+PARTES!A197","v":"c PARTE PH"},{"$f":"+PARTES!B197","v":0},{"$f":"+PARTES!C197","v":0},{"$f":"+PARTES!D197","v":"ESTADO CIVIL:"},{"$f":"IF(PARTES!E197>0,PARTES!E197,\"INCOMPLETO RECHAZAR\")","v":"INCOMPLETO RECHAZAR"}]
[{"$f":"+PARTES!A198","v":"c PARTE PH"},{"$f":"+PARTES!B198","v":0},{"$f":"+PARTES!C198","v":0},{"$f":"+PARTES!D198","v":""},{"$f":"IF(PARTES!E198>0,PARTES!E198,\"INCOMPLETO RECHAZAR\")","v":"INCOMPLETO RECHAZAR"}]
[{"$f":"+PARTES!A199","v":"c PARTE PH"},{"$f":"+PARTES!B199","v":0},{"$f":"+PARTES!C199","v":0},{"$f":"+PARTES!D199","v":""},{"$f":"IF(PARTES!E199>0,PARTES!E199,\"INCOMPLETO RECHAZAR\")","v":"INCOMPLETO RECHAZAR"}]
[{"$f":"+PARTES!A200","v":"c PARTE PH"},{"$f":"+PARTES!B200","v":0},{"$f":"+PARTES!C200","v":0},{"$f":"+PARTES!D200","v":""},{"$f":"IF(PARTES!E200>0,PARTES!E200,\"INCOMPLETO RECHAZAR\")","v":"INCOMPLETO RECHAZAR"}]
[{"$f":"+PARTES!A201","v":"g CONTRIB."},{"$f":"+PARTES!B201","v":0},{"$f":"+PARTES!C201","v":0},{"$f":"+PARTES!D201","v":"CARÁCTER DE PARTE:"},{"$f":"IF(PARTES!E201=\"ELEGIR\",\"INCOMPLETO RECHAZAR\",PARTES!E201)","v":"INCOMPLETO RECHAZAR"}]
[{"$f":"+PARTES!A202","v":"c PARTE PH"},{"$f":"+PARTES!B202","v":0},{"$f":"+PARTES!C202","v":0},{"$f":"+PARTES!D202","v":"NOTA/OBSERVACIÓN -en mayúscula-:"},{"$f":"IF(PARTES!E202>0,PARTES!E202,\"INCOMPLETO RECHAZAR\")","v":"INCOMPLETO RECHAZAR"}]
[{"$f":"+PARTES!A203","v":"c PARTE PH"},{"$f":"+PARTES!B203","v":0},{"$f":"+PARTES!C203","v":0},{"$f":"+PARTES!D203","v":"DOC. IDENTIDAD –sin puntos-:"},{"$f":"IF(PARTES!E203>0,PARTES!E203,\"INCOMPLETO RECHAZAR\")","v":"INCOMPLETO RECHAZAR"}]
[{"$f":"+PARTES!A204","v":"c PARTE PH"},{"$f":"+PARTES!B204","v":0},{"$f":"+PARTES!C204","v":0},{"$f":"+PARTES!D204","v":"CUIT/CUIL –sin puntos ni barras-:"},{"$f":"IF(PARTES!E204>0,PARTES!E204,\"INCOMPLETO RECHAZAR\")","v":"INCOMPLETO RECHAZAR"}]
[{"$f":"+PARTES!A205","v":"c PARTE PH"},{"$f":"+PARTES!B205","v":0},{"$f":"+PARTES!C205","v":0},{"$f":"+PARTES!D205","v":"FECHA DE NACIMIENTO –dd/mm/aa-:"},{"$f":"IF(PARTES!E205>0,PARTES!E205,\"INCOMPLETO RECHAZAR\")","v":"INCOMPLETO RECHAZAR"}]
[{"$f":"+PARTES!A206","v":"c PARTE PH"},{"$f":"+PARTES!B206","v":0},{"$f":"+PARTES!C206","v":0},{"$f":"+PARTES!D206","v":"LUGAR DE NACIMIENTO:"},{"$f":"IF(PARTES!E206>0,PARTES!E206,\"INCOMPLETO RECHAZAR\")","v":"INCOMPLETO RECHAZAR"}]
[{"$f":"+PARTES!A207","v":"c PARTE PH"},{"$f":"+PARTES!B207","v":0},{"$f":"+PARTES!C207","v":0},{"$f":"+PARTES!D207","v":"NACIONALIDAD:"},{"$f":"IF(PARTES!E207>0,PARTES!E207,\"INCOMPLETO RECHAZAR\")","v":"INCOMPLETO RECHAZAR"}]
[{"$f":"+PARTES!A208","v":"c PARTE PH"},{"$f":"+PARTES!B208","v":0},{"$f":"+PARTES!C208","v":0},{"$f":"+PARTES!D208","v":"PROFESIÓN/OFICIO:"},{"$f":"IF(PARTES!E208>0,PARTES!E208,\"INCOMPLETO RECHAZAR\")","v":"INCOMPLETO RECHAZAR"}]
[{"$f":"+PARTES!A209","v":"c PARTE PH"},{"$f":"+PARTES!B209","v":0},{"$f":"+PARTES!C209","v":0},{"$f":"+PARTES!D209","v":"DOMICILIO REAL:"},{"$f":"IF(PARTES!E209>0,PARTES!E209,\"INCOMPLETO RECHAZAR\")","v":"INCOMPLETO RECHAZAR"}]
[{"$f":"+PARTES!A210","v":"c PARTE PH"},{"$f":"+PARTES!B210","v":0},{"$f":"+PARTES!C210","v":0},{"$f":"+PARTES!D210","v":"CEL/TEL :"},{"$f":"IF(PARTES!E210>0,PARTES!E210,\"INCOMPLETO RECHAZAR\")","v":"INCOMPLETO RECHAZAR"}]
[{"$f":"+PARTES!A211","v":"c PARTE PH"},{"$f":"+PARTES!B211","v":0},{"$f":"+PARTES!C211","v":0},{"$f":"+PARTES!D211","v":"EMAIL:"},{"$f":"IF(PARTES!E211>0,PARTES!E211,\"INCOMPLETO RECHAZAR\")","v":"INCOMPLETO RECHAZAR"}]
[{"$f":"+PARTES!A212","v":"c PARTE PH"},{"$f":"+PARTES!B212","v":0},{"$f":"+PARTES!C212","v":0},{"$f":"+PARTES!D212","v":"ESTADO CIVIL:"},{"$f":"IF(PARTES!E212>0,PARTES!E212,\"INCOMPLETO RECHAZAR\")","v":"INCOMPLETO RECHAZAR"}]
[{"$f":"+PARTES!A213","v":"c PARTE PH"},{"$f":"+PARTES!B213","v":0},{"$f":"+PARTES!C213","v":0},{"$f":"+PARTES!D213","v":""},{"$f":"IF(PARTES!E213>0,PARTES!E213,\"INCOMPLETO RECHAZAR\")","v":"INCOMPLETO RECHAZAR"}]
[{"$f":"+PARTES!A214","v":"c PARTE PH"},{"$f":"+PARTES!B214","v":0},{"$f":"+PARTES!C214","v":0},{"$f":"+PARTES!D214","v":""},{"$f":"IF(PARTES!E214>0,PARTES!E214,\"INCOMPLETO RECHAZAR\")","v":"INCOMPLETO RECHAZAR"}]
[{"$f":"+PARTES!A215","v":"c PARTE PH"},{"$f":"+PARTES!B215","v":0},{"$f":"+PARTES!C215","v":0},{"$f":"+PARTES!D215","v":""},{"$f":"IF(PARTES!E215>0,PARTES!E215,\"INCOMPLETO RECHAZAR\")","v":"INCOMPLETO RECHAZAR"}]
[{"$f":"+PARTES!A216","v":"g CONTRIB."},{"$f":"+PARTES!B216","v":0},{"$f":"+PARTES!C216","v":0},{"$f":"+PARTES!D216","v":"CARÁCTER DE PARTE:"},{"$f":"IF(PARTES!E216=\"ELEGIR\",\"INCOMPLETO RECHAZAR\",PARTES!E216)","v":"INCOMPLETO RECHAZAR"}]
[{"$f":"+PARTES!A217","v":"c PARTE PH"},{"$f":"+PARTES!B217","v":0},{"$f":"+PARTES!C217","v":0},{"$f":"+PARTES!D217","v":"NOTA/OBSERVACIÓN -en mayúscula-:"},{"$f":"IF(PARTES!E217>0,PARTES!E217,\"INCOMPLETO RECHAZAR\")","v":"INCOMPLETO RECHAZAR"}]
[{"$f":"+PARTES!A218","v":"c PARTE PH"},{"$f":"+PARTES!B218","v":0},{"$f":"+PARTES!C218","v":0},{"$f":"+PARTES!D218","v":"DOC. IDENTIDAD –sin puntos-:"},{"$f":"IF(PARTES!E218>0,PARTES!E218,\"INCOMPLETO RECHAZAR\")","v":"INCOMPLETO RECHAZAR"}]
[{"$f":"+PARTES!A219","v":"c PARTE PH"},{"$f":"+PARTES!B219","v":0},{"$f":"+PARTES!C219","v":0},{"$f":"+PARTES!D219","v":"CUIT/CUIL –sin puntos ni barras-:"},{"$f":"IF(PARTES!E219>0,PARTES!E219,\"INCOMPLETO RECHAZAR\")","v":"INCOMPLETO RECHAZAR"}]
[{"$f":"+PARTES!A220","v":"c PARTE PH"},{"$f":"+PARTES!B220","v":0},{"$f":"+PARTES!C220","v":0},{"$f":"+PARTES!D220","v":"FECHA DE NACIMIENTO –dd/mm/aa-:"},{"$f":"IF(PARTES!E220>0,PARTES!E220,\"INCOMPLETO RECHAZAR\")","v":"INCOMPLETO RECHAZAR"}]
[{"$f":"+PARTES!A221","v":"c PARTE PH"},{"$f":"+PARTES!B221","v":0},{"$f":"+PARTES!C221","v":0},{"$f":"+PARTES!D221","v":"LUGAR DE NACIMIENTO:"},{"$f":"IF(PARTES!E221>0,PARTES!E221,\"INCOMPLETO RECHAZAR\")","v":"INCOMPLETO RECHAZAR"}]
[{"$f":"+PARTES!A222","v":"c PARTE PH"},{"$f":"+PARTES!B222","v":0},{"$f":"+PARTES!C222","v":0},{"$f":"+PARTES!D222","v":"NACIONALIDAD:"},{"$f":"IF(PARTES!E222>0,PARTES!E222,\"INCOMPLETO RECHAZAR\")","v":"INCOMPLETO RECHAZAR"}]
[{"$f":"+PARTES!A223","v":"c PARTE PH"},{"$f":"+PARTES!B223","v":0},{"$f":"+PARTES!C223","v":0},{"$f":"+PARTES!D223","v":"PROFESIÓN/OFICIO:"},{"$f":"IF(PARTES!E223>0,PARTES!E223,\"INCOMPLETO RECHAZAR\")","v":"INCOMPLETO RECHAZAR"}]
[{"$f":"+PARTES!A224","v":"c PARTE PH"},{"$f":"+PARTES!B224","v":0},{"$f":"+PARTES!C224","v":0},{"$f":"+PARTES!D224","v":"DOMICILIO REAL:"},{"$f":"IF(PARTES!E224>0,PARTES!E224,\"INCOMPLETO RECHAZAR\")","v":"INCOMPLETO RECHAZAR"}]
[{"$f":"+PARTES!A225","v":"c PARTE PH"},{"$f":"+PARTES!B225","v":0},{"$f":"+PARTES!C225","v":0},{"$f":"+PARTES!D225","v":"CEL/TEL :"},{"$f":"IF(PARTES!E225>0,PARTES!E225,\"INCOMPLETO RECHAZAR\")","v":"INCOMPLETO RECHAZAR"}]
[{"$f":"+PARTES!A226","v":"c PARTE PH"},{"$f":"+PARTES!B226","v":0},{"$f":"+PARTES!C226","v":0},{"$f":"+PARTES!D226","v":"EMAIL:"},{"$f":"IF(PARTES!E226>0,PARTES!E226,\"INCOMPLETO RECHAZAR\")","v":"INCOMPLETO RECHAZAR"}]
[{"$f":"+PARTES!A227","v":"c PARTE PH"},{"$f":"+PARTES!B227","v":0},{"$f":"+PARTES!C227","v":0},{"$f":"+PARTES!D227","v":"ESTADO CIVIL:"},{"$f":"IF(PARTES!E227>0,PARTES!E227,\"INCOMPLETO RECHAZAR\")","v":"INCOMPLETO RECHAZAR"}]
[{"$f":"+PARTES!A228","v":"c PARTE PH"},{"$f":"+PARTES!B228","v":0},{"$f":"+PARTES!C228","v":0},{"$f":"+PARTES!D228","v":""},{"$f":"IF(PARTES!E228>0,PARTES!E228,\"INCOMPLETO RECHAZAR\")","v":"INCOMPLETO RECHAZAR"}]
[{"$f":"+PARTES!A229","v":"c PARTE PH"},{"$f":"+PARTES!B229","v":0},{"$f":"+PARTES!C229","v":0},{"$f":"+PARTES!D229","v":""},{"$f":"IF(PARTES!E229>0,PARTES!E229,\"INCOMPLETO RECHAZAR\")","v":"INCOMPLETO RECHAZAR"}]
[{"$f":"+PARTES!A230","v":"c PARTE PH"},{"$f":"+PARTES!B230","v":0},{"$f":"+PARTES!C230","v":0},{"$f":"+PARTES!D230","v":""},{"$f":"IF(PARTES!E230>0,PARTES!E230,\"INCOMPLETO RECHAZAR\")","v":"INCOMPLETO RECHAZAR"}]
[{"$f":"+PARTES!A231","v":"g CONTRIB."},{"$f":"+PARTES!B231","v":0},{"$f":"+PARTES!C231","v":0},{"$f":"+PARTES!D231","v":"CARÁCTER DE PARTE:"},{"$f":"IF(PARTES!E231=\"ELEGIR\",\"INCOMPLETO RECHAZAR\",PARTES!E231)","v":"INCOMPLETO RECHAZAR"}]
[{"$f":"+PARTES!A232","v":"c PARTE PH"},{"$f":"+PARTES!B232","v":0},{"$f":"+PARTES!C232","v":0},{"$f":"+PARTES!D232","v":"NOTA/OBSERVACIÓN -en mayúscula-:"},{"$f":"IF(PARTES!E232>0,PARTES!E232,\"INCOMPLETO RECHAZAR\")","v":"INCOMPLETO RECHAZAR"}]
[{"$f":"+PARTES!G8","v":"c PARTE PJ"},{"$f":"+PARTES!H8","v":0},{"$f":"+PARTES!H8","v":0},{"$f":"+PARTES!I8","v":"CUIT –sin puntos ni barras-:"},{"$f":"IF(PARTES!J8>0,PARTES!J8,\"INCOMPLETO RECHAZAR\")","v":"INCOMPLETO RECHAZAR"}]
[{"$f":"+PARTES!G9","v":"c PARTE PJ"},{"$f":"+PARTES!H9","v":0},{"$f":"+PARTES!H9","v":0},{"$f":"+PARTES!I9","v":"TIPO DE PERSONA JCA -FIDEICOMISO, asociación, mutual, etc-:"},{"$f":"IF(PARTES!J9>0,PARTES!J9,\"INCOMPLETO RECHAZAR\")","v":"INCOMPLETO RECHAZAR"}]
[{"$f":"+PARTES!G10","v":"c PARTE PJ"},{"$f":"+PARTES!H10","v":0},{"$f":"+PARTES!H10","v":0},{"$f":"+PARTES!I10","v":"ORGANISMO /s DONDE SE INSCRIBIÓ CONSTITUCIÓN (INDICAR LOCALIDAD/PCIA DEL ORG) -si no se inscribió poner: NO INSCRIPTO/A:"},{"$f":"IF(PARTES!J10>0,PARTES!J10,\"INCOMPLETO RECHAZAR\")","v":"INCOMPLETO RECHAZAR"}]
[{"$f":"+PARTES!G11","v":"c PARTE PJ"},{"$f":"+PARTES!H11","v":0},{"$f":"+PARTES!H11","v":0},{"$f":"+PARTES!I11","v":"DATOS DE RESOLUCIÓN Y FECHA DE INSCRIPCIÓN:"},{"$f":"IF(PARTES!J11>0,PARTES!J11,\"INCOMPLETO RECHAZAR\")","v":"INCOMPLETO RECHAZAR"}]
[{"$f":"+PARTES!G12","v":"c PARTE PJ"},{"$f":"+PARTES!H12","v":0},{"$f":"+PARTES!H12","v":0},{"$f":"+PARTES!I12","v":"FECHA DE INSCRIPCION:"},{"$f":"IF(PARTES!J12>0,PARTES!J12,\"INCOMPLETO RECHAZAR\")","v":"INCOMPLETO RECHAZAR"}]
[{"$f":"+PARTES!G13","v":"c PARTE PJ"},{"$f":"+PARTES!H13","v":0},{"$f":"+PARTES!H13","v":0},{"$f":"+PARTES!I13","v":"APELLIDO/S, NOMBRE/S,  DNI Y CARGO DE CADA PARTE DE SU ADMINISTRACIÓN:"},{"$f":"IF(PARTES!J13>0,PARTES!J13,\"INCOMPLETO RECHAZAR\")","v":"INCOMPLETO RECHAZAR"}]
[{"$f":"+PARTES!G14","v":"c PARTE PJ"},{"$f":"+PARTES!H14","v":0},{"$f":"+PARTES!H14","v":0},{"$f":"+PARTES!I14","v":"DOMICILIO SOCIAL:"},{"$f":"IF(PARTES!J14>0,PARTES!J14,\"INCOMPLETO RECHAZAR\")","v":"INCOMPLETO RECHAZAR"}]
[{"$f":"+PARTES!G15","v":"c PARTE PJ"},{"$f":"+PARTES!H15","v":0},{"$f":"+PARTES!H15","v":0},{"$f":"+PARTES!I15","v":"SEDE SOCIAL:"},{"$f":"IF(PARTES!J15>0,PARTES!J15,\"INCOMPLETO RECHAZAR\")","v":"INCOMPLETO RECHAZAR"}]
[{"$f":"+PARTES!G16","v":"c PARTE PJ"},{"$f":"+PARTES!H16","v":0},{"$f":"+PARTES!H16","v":0},{"$f":"+PARTES!I16","v":"CEL/TEL :"},{"$f":"IF(PARTES!J16>0,PARTES!J16,\"INCOMPLETO RECHAZAR\")","v":"INCOMPLETO RECHAZAR"}]
[{"$f":"+PARTES!G17","v":"c PARTE PJ"},{"$f":"+PARTES!H17","v":0},{"$f":"+PARTES!H17","v":0},{"$f":"+PARTES!I17","v":"OBJETO PRINCIPAL (EN FORMA RESUMIDA):"},{"$f":"IF(PARTES!J17>0,PARTES!J17,\"INCOMPLETO RECHAZAR\")","v":"INCOMPLETO RECHAZAR"}]
[{"$f":"+PARTES!G18","v":"d CONTRIB."},{"$f":"+PARTES!H18","v":0},{"$f":"+PARTES!H18","v":0},{"$f":"+PARTES!I18","v":"CARÁCTER DE PARTE:"},{"$f":"IF(PARTES!J18=\"ELEGIR\",\"INCOMPLETO RECHAZAR\",PARTES!J18)","v":"INCOMPLETO RECHAZAR"}]
[{"$f":"+PARTES!G19","v":"c PARTE PJ"},{"$f":"+PARTES!H19","v":0},{"$f":"+PARTES!H19","v":0},{"$f":"+PARTES!I19","v":"NOTA/OBSERVACIÓN -en mayúscula-:"},{"$f":"IF(PARTES!J19>0,PARTES!J19,\"INCOMPLETO RECHAZAR\")","v":"INCOMPLETO RECHAZAR"}]
[{"$f":"+PARTES!G20","v":"c PARTE PJ"},{"$f":"+PARTES!H20","v":0},{"$f":"+PARTES!H20","v":0},{"$f":"+PARTES!I20","v":"CUIT –sin puntos ni barras-:"},{"$f":"IF(PARTES!J20>0,PARTES!J20,\"INCOMPLETO RECHAZAR\")","v":"INCOMPLETO RECHAZAR"}]
[{"$f":"+PARTES!G21","v":"c PARTE PJ"},{"$f":"+PARTES!H21","v":0},{"$f":"+PARTES!H21","v":0},{"$f":"+PARTES!I21","v":"TIPO DE PERSONA JCA -FIDEICOMISO, asociación, mutual, etc-:"},{"$f":"IF(PARTES!J21>0,PARTES!J21,\"INCOMPLETO RECHAZAR\")","v":"INCOMPLETO RECHAZAR"}]
[{"$f":"+PARTES!G22","v":"c PARTE PJ"},{"$f":"+PARTES!H22","v":0},{"$f":"+PARTES!H22","v":0},{"$f":"+PARTES!I22","v":"ORGANISMO /s DONDE SE INSCRIBIÓ CONSTITUCIÓN (INDICAR LOCALIDAD/PCIA DEL ORG) -si no se inscribió poner: NO INSCRIPTO/A:"},{"$f":"IF(PARTES!J22>0,PARTES!J22,\"INCOMPLETO RECHAZAR\")","v":"INCOMPLETO RECHAZAR"}]
[{"$f":"+PARTES!G23","v":"c PARTE PJ"},{"$f":"+PARTES!H23","v":0},{"$f":"+PARTES!H23","v":0},{"$f":"+PARTES!I23","v":"DATOS DE RESOLUCIÓN Y FECHA DE INSCRIPCIÓN:"},{"$f":"IF(PARTES!J23>0,PARTES!J23,\"INCOMPLETO RECHAZAR\")","v":"INCOMPLETO RECHAZAR"}]
[{"$f":"+PARTES!G24","v":"c PARTE PJ"},{"$f":"+PARTES!H24","v":0},{"$f":"+PARTES!H24","v":0},{"$f":"+PARTES!I24","v":"FECHA DE INSCRIPCION:"},{"$f":"IF(PARTES!J24>0,PARTES!J24,\"INCOMPLETO RECHAZAR\")","v":"INCOMPLETO RECHAZAR"}]
[{"$f":"+PARTES!G25","v":"c PARTE PJ"},{"$f":"+PARTES!H25","v":0},{"$f":"+PARTES!H25","v":0},{"$f":"+PARTES!I25","v":"APELLIDO/S, NOMBRE/S,  DNI Y CARGO DE CADA PARTE DE SU ADMINISTRACIÓN:"},{"$f":"IF(PARTES!J25>0,PARTES!J25,\"INCOMPLETO RECHAZAR\")","v":"INCOMPLETO RECHAZAR"}]
[{"$f":"+PARTES!G26","v":"c PARTE PJ"},{"$f":"+PARTES!H26","v":0},{"$f":"+PARTES!H26","v":0},{"$f":"+PARTES!I26","v":"DOMICILIO SOCIAL:"},{"$f":"IF(PARTES!J26>0,PARTES!J26,\"INCOMPLETO RECHAZAR\")","v":"INCOMPLETO RECHAZAR"}]
[{"$f":"+PARTES!G27","v":"c PARTE PJ"},{"$f":"+PARTES!H27","v":0},{"$f":"+PARTES!H27","v":0},{"$f":"+PARTES!I27","v":"SEDE SOCIAL:"},{"$f":"IF(PARTES!J27>0,PARTES!J27,\"INCOMPLETO RECHAZAR\")","v":"INCOMPLETO RECHAZAR"}]
[{"$f":"+PARTES!G28","v":"c PARTE PJ"},{"$f":"+PARTES!H28","v":0},{"$f":"+PARTES!H28","v":0},{"$f":"+PARTES!I28","v":"CEL/TEL :"},{"$f":"IF(PARTES!J28>0,PARTES!J28,\"INCOMPLETO RECHAZAR\")","v":"INCOMPLETO RECHAZAR"}]
[{"$f":"+PARTES!G29","v":"c PARTE PJ"},{"$f":"+PARTES!H29","v":0},{"$f":"+PARTES!H29","v":0},{"$f":"+PARTES!I29","v":"OBJETO PRINCIPAL (EN FORMA RESUMIDA):"},{"$f":"IF(PARTES!J29>0,PARTES!J29,\"INCOMPLETO RECHAZAR\")","v":"INCOMPLETO RECHAZAR"}]
[{"$f":"+PARTES!G30","v":"d CONTRIB."},{"$f":"+PARTES!H30","v":0},{"$f":"+PARTES!H30","v":0},{"$f":"+PARTES!I30","v":"CARÁCTER DE PARTE:"},{"$f":"IF(PARTES!J30=\"ELEGIR\",\"INCOMPLETO RECHAZAR\",PARTES!J30)","v":"INCOMPLETO RECHAZAR"}]
[{"$f":"+PARTES!G31","v":"c PARTE PJ"},{"$f":"+PARTES!H31","v":0},{"$f":"+PARTES!H31","v":0},{"$f":"+PARTES!I31","v":"NOTA/OBSERVACIÓN -en mayúscula-:"},{"$f":"IF(PARTES!J31>0,PARTES!J31,\"INCOMPLETO RECHAZAR\")","v":"INCOMPLETO RECHAZAR"}]
[{"$f":"+PARTES!G32","v":"c PARTE PJ"},{"$f":"+PARTES!H32","v":0},{"$f":"+PARTES!H32","v":0},{"$f":"+PARTES!I32","v":"CUIT –sin puntos ni barras-:"},{"$f":"IF(PARTES!J32>0,PARTES!J32,\"INCOMPLETO RECHAZAR\")","v":"INCOMPLETO RECHAZAR"}]
[{"$f":"+PARTES!G33","v":"c PARTE PJ"},{"$f":"+PARTES!H33","v":0},{"$f":"+PARTES!H33","v":0},{"$f":"+PARTES!I33","v":"TIPO DE PERSONA JCA -FIDEICOMISO, asociación, mutual, etc-:"},{"$f":"IF(PARTES!J33>0,PARTES!J33,\"INCOMPLETO RECHAZAR\")","v":"INCOMPLETO RECHAZAR"}]
[{"$f":"+PARTES!G34","v":"c PARTE PJ"},{"$f":"+PARTES!H34","v":0},{"$f":"+PARTES!H34","v":0},{"$f":"+PARTES!I34","v":"ORGANISMO /s DONDE SE INSCRIBIÓ CONSTITUCIÓN (INDICAR LOCALIDAD/PCIA DEL ORG) -si no se inscribió poner: NO INSCRIPTO/A:"},{"$f":"IF(PARTES!J34>0,PARTES!J34,\"INCOMPLETO RECHAZAR\")","v":"INCOMPLETO RECHAZAR"}]
[{"$f":"+PARTES!G35","v":"c PARTE PJ"},{"$f":"+PARTES!H35","v":0},{"$f":"+PARTES!H35","v":0},{"$f":"+PARTES!I35","v":"DATOS DE RESOLUCIÓN Y FECHA DE INSCRIPCIÓN:"},{"$f":"IF(PARTES!J35>0,PARTES!J35,\"INCOMPLETO RECHAZAR\")","v":"INCOMPLETO RECHAZAR"}]
[{"$f":"+PARTES!G36","v":"c PARTE PJ"},{"$f":"+PARTES!H36","v":0},{"$f":"+PARTES!H36","v":0},{"$f":"+PARTES!I36","v":"FECHA DE INSCRIPCION:"},{"$f":"IF(PARTES!J36>0,PARTES!J36,\"INCOMPLETO RECHAZAR\")","v":"INCOMPLETO RECHAZAR"}]
[{"$f":"+PARTES!G37","v":"c PARTE PJ"},{"$f":"+PARTES!H37","v":0},{"$f":"+PARTES!H37","v":0},{"$f":"+PARTES!I37","v":"APELLIDO/S, NOMBRE/S,  DNI Y CARGO DE CADA PARTE DE SU ADMINISTRACIÓN:"},{"$f":"IF(PARTES!J37>0,PARTES!J37,\"INCOMPLETO RECHAZAR\")","v":"INCOMPLETO RECHAZAR"}]
[{"$f":"+PARTES!G38","v":"c PARTE PJ"},{"$f":"+PARTES!H38","v":0},{"$f":"+PARTES!H38","v":0},{"$f":"+PARTES!I38","v":"DOMICILIO SOCIAL:"},{"$f":"IF(PARTES!J38>0,PARTES!J38,\"INCOMPLETO RECHAZAR\")","v":"INCOMPLETO RECHAZAR"}]
[{"$f":"+PARTES!G39","v":"c PARTE PJ"},{"$f":"+PARTES!H39","v":0},{"$f":"+PARTES!H39","v":0},{"$f":"+PARTES!I39","v":"SEDE SOCIAL:"},{"$f":"IF(PARTES!J39>0,PARTES!J39,\"INCOMPLETO RECHAZAR\")","v":"INCOMPLETO RECHAZAR"}]
[{"$f":"+PARTES!G40","v":"c PARTE PJ"},{"$f":"+PARTES!H40","v":0},{"$f":"+PARTES!H40","v":0},{"$f":"+PARTES!I40","v":"CEL/TEL :"},{"$f":"IF(PARTES!J40>0,PARTES!J40,\"INCOMPLETO RECHAZAR\")","v":"INCOMPLETO RECHAZAR"}]
[{"$f":"+PARTES!G41","v":"c PARTE PJ"},{"$f":"+PARTES!H41","v":0},{"$f":"+PARTES!H41","v":0},{"$f":"+PARTES!I41","v":"OBJETO PRINCIPAL (EN FORMA RESUMIDA):"},{"$f":"IF(PARTES!J41>0,PARTES!J41,\"INCOMPLETO RECHAZAR\")","v":"INCOMPLETO RECHAZAR"}]
[{"$f":"+PARTES!G42","v":"d CONTRIB."},{"$f":"+PARTES!H42","v":0},{"$f":"+PARTES!H42","v":0},{"$f":"+PARTES!I42","v":"CARÁCTER DE PARTE:"},{"$f":"IF(PARTES!J42=\"ELEGIR\",\"INCOMPLETO RECHAZAR\",PARTES!J42)","v":"INCOMPLETO RECHAZAR"}]
[{"$f":"+PARTES!G43","v":"c PARTE PJ"},{"$f":"+PARTES!H43","v":0},{"$f":"+PARTES!H43","v":0},{"$f":"+PARTES!I43","v":"NOTA/OBSERVACIÓN -en mayúscula-:"},{"$f":"IF(PARTES!J43>0,PARTES!J43,\"INCOMPLETO RECHAZAR\")","v":"INCOMPLETO RECHAZAR"}]
[{"$f":"+PARTES!G44","v":"c PARTE PJ"},{"$f":"+PARTES!H44","v":0},{"$f":"+PARTES!H44","v":0},{"$f":"+PARTES!I44","v":"CUIT –sin puntos ni barras-:"},{"$f":"IF(PARTES!J44>0,PARTES!J44,\"INCOMPLETO RECHAZAR\")","v":"INCOMPLETO RECHAZAR"}]
[{"$f":"+PARTES!G45","v":"c PARTE PJ"},{"$f":"+PARTES!H45","v":0},{"$f":"+PARTES!H45","v":0},{"$f":"+PARTES!I45","v":"TIPO DE PERSONA JCA -FIDEICOMISO, asociación, mutual, etc-:"},{"$f":"IF(PARTES!J45>0,PARTES!J45,\"INCOMPLETO RECHAZAR\")","v":"INCOMPLETO RECHAZAR"}]
[{"$f":"+PARTES!G46","v":"c PARTE PJ"},{"$f":"+PARTES!H46","v":0},{"$f":"+PARTES!H46","v":0},{"$f":"+PARTES!I46","v":"ORGANISMO /s DONDE SE INSCRIBIÓ CONSTITUCIÓN (INDICAR LOCALIDAD/PCIA DEL ORG) -si no se inscribió poner: NO INSCRIPTO/A:"},{"$f":"IF(PARTES!J46>0,PARTES!J46,\"INCOMPLETO RECHAZAR\")","v":"INCOMPLETO RECHAZAR"}]
[{"$f":"+PARTES!G47","v":"c PARTE PJ"},{"$f":"+PARTES!H47","v":0},{"$f":"+PARTES!H47","v":0},{"$f":"+PARTES!I47","v":"DATOS DE RESOLUCIÓN Y FECHA DE INSCRIPCIÓN:"},{"$f":"IF(PARTES!J47>0,PARTES!J47,\"INCOMPLETO RECHAZAR\")","v":"INCOMPLETO RECHAZAR"}]
[{"$f":"+PARTES!G48","v":"c PARTE PJ"},{"$f":"+PARTES!H48","v":0},{"$f":"+PARTES!H48","v":0},{"$f":"+PARTES!I48","v":"FECHA DE INSCRIPCION:"},{"$f":"IF(PARTES!J48>0,PARTES!J48,\"INCOMPLETO RECHAZAR\")","v":"INCOMPLETO RECHAZAR"}]
[{"$f":"+PARTES!G49","v":"c PARTE PJ"},{"$f":"+PARTES!H49","v":0},{"$f":"+PARTES!H49","v":0},{"$f":"+PARTES!I49","v":"APELLIDO/S, NOMBRE/S,  DNI Y CARGO DE CADA PARTE DE SU ADMINISTRACIÓN:"},{"$f":"IF(PARTES!J49>0,PARTES!J49,\"INCOMPLETO RECHAZAR\")","v":"INCOMPLETO RECHAZAR"}]
[{"$f":"+PARTES!G50","v":"c PARTE PJ"},{"$f":"+PARTES!H50","v":0},{"$f":"+PARTES!H50","v":0},{"$f":"+PARTES!I50","v":"DOMICILIO SOCIAL:"},{"$f":"IF(PARTES!J50>0,PARTES!J50,\"INCOMPLETO RECHAZAR\")","v":"INCOMPLETO RECHAZAR"}]
[{"$f":"+PARTES!G51","v":"c PARTE PJ"},{"$f":"+PARTES!H51","v":0},{"$f":"+PARTES!H51","v":0},{"$f":"+PARTES!I51","v":"SEDE SOCIAL:"},{"$f":"IF(PARTES!J51>0,PARTES!J51,\"INCOMPLETO RECHAZAR\")","v":"INCOMPLETO RECHAZAR"}]
[{"$f":"+PARTES!G52","v":"c PARTE PJ"},{"$f":"+PARTES!H52","v":0},{"$f":"+PARTES!H52","v":0},{"$f":"+PARTES!I52","v":"CEL/TEL :"},{"$f":"IF(PARTES!J52>0,PARTES!J52,\"INCOMPLETO RECHAZAR\")","v":"INCOMPLETO RECHAZAR"}]
[{"$f":"+PARTES!G53","v":"c PARTE PJ"},{"$f":"+PARTES!H53","v":0},{"$f":"+PARTES!H53","v":0},{"$f":"+PARTES!I53","v":"OBJETO PRINCIPAL (EN FORMA RESUMIDA):"},{"$f":"IF(PARTES!J53>0,PARTES!J53,\"INCOMPLETO RECHAZAR\")","v":"INCOMPLETO RECHAZAR"}]
[{"$f":"+PARTES!G54","v":"d CONTRIB."},{"$f":"+PARTES!H54","v":0},{"$f":"+PARTES!H54","v":0},{"$f":"+PARTES!I54","v":"CARÁCTER DE PARTE:"},{"$f":"IF(PARTES!J54=\"ELEGIR\",\"INCOMPLETO RECHAZAR\",PARTES!J54)","v":"INCOMPLETO RECHAZAR"}]
[{"$f":"+PARTES!G55","v":"c PARTE PJ"},{"$f":"+PARTES!H55","v":0},{"$f":"+PARTES!H55","v":0},{"$f":"+PARTES!I55","v":"NOTA/OBSERVACIÓN -en mayúscula-:"},{"$f":"IF(PARTES!J55>0,PARTES!J55,\"INCOMPLETO RECHAZAR\")","v":"INCOMPLETO RECHAZAR"}]
[{"$f":"+PARTES!G56","v":"c PARTE PJ"},{"$f":"+PARTES!H56","v":0},{"$f":"+PARTES!H56","v":0},{"$f":"+PARTES!I56","v":"CUIT –sin puntos ni barras-:"},{"$f":"IF(PARTES!J56>0,PARTES!J56,\"INCOMPLETO RECHAZAR\")","v":"INCOMPLETO RECHAZAR"}]
[{"$f":"+PARTES!G57","v":"c PARTE PJ"},{"$f":"+PARTES!H57","v":0},{"$f":"+PARTES!H57","v":0},{"$f":"+PARTES!I57","v":"TIPO DE PERSONA JCA -FIDEICOMISO, asociación, mutual, etc-:"},{"$f":"IF(PARTES!J57>0,PARTES!J57,\"INCOMPLETO RECHAZAR\")","v":"INCOMPLETO RECHAZAR"}]
[{"$f":"+PARTES!G58","v":"c PARTE PJ"},{"$f":"+PARTES!H58","v":0},{"$f":"+PARTES!H58","v":0},{"$f":"+PARTES!I58","v":"ORGANISMO /s DONDE SE INSCRIBIÓ CONSTITUCIÓN (INDICAR LOCALIDAD/PCIA DEL ORG) -si no se inscribió poner: NO INSCRIPTO/A:"},{"$f":"IF(PARTES!J58>0,PARTES!J58,\"INCOMPLETO RECHAZAR\")","v":"INCOMPLETO RECHAZAR"}]
[{"$f":"+PARTES!G59","v":"c PARTE PJ"},{"$f":"+PARTES!H59","v":0},{"$f":"+PARTES!H59","v":0},{"$f":"+PARTES!I59","v":"DATOS DE RESOLUCIÓN Y FECHA DE INSCRIPCIÓN:"},{"$f":"IF(PARTES!J59>0,PARTES!J59,\"INCOMPLETO RECHAZAR\")","v":"INCOMPLETO RECHAZAR"}]
[{"$f":"+PARTES!G60","v":"c PARTE PJ"},{"$f":"+PARTES!H60","v":0},{"$f":"+PARTES!H60","v":0},{"$f":"+PARTES!I60","v":"FECHA DE INSCRIPCION:"},{"$f":"IF(PARTES!J60>0,PARTES!J60,\"INCOMPLETO RECHAZAR\")","v":"INCOMPLETO RECHAZAR"}]
[{"$f":"+PARTES!G61","v":"c PARTE PJ"},{"$f":"+PARTES!H61","v":0},{"$f":"+PARTES!H61","v":0},{"$f":"+PARTES!I61","v":"APELLIDO/S, NOMBRE/S,  DNI Y CARGO DE CADA PARTE DE SU ADMINISTRACIÓN:"},{"$f":"IF(PARTES!J61>0,PARTES!J61,\"INCOMPLETO RECHAZAR\")","v":"INCOMPLETO RECHAZAR"}]
[{"$f":"+PARTES!G62","v":"c PARTE PJ"},{"$f":"+PARTES!H62","v":0},{"$f":"+PARTES!H62","v":0},{"$f":"+PARTES!I62","v":"DOMICILIO SOCIAL:"},{"$f":"IF(PARTES!J62>0,PARTES!J62,\"INCOMPLETO RECHAZAR\")","v":"INCOMPLETO RECHAZAR"}]
[{"$f":"+PARTES!G63","v":"c PARTE PJ"},{"$f":"+PARTES!H63","v":0},{"$f":"+PARTES!H63","v":0},{"$f":"+PARTES!I63","v":"SEDE SOCIAL:"},{"$f":"IF(PARTES!J63>0,PARTES!J63,\"INCOMPLETO RECHAZAR\")","v":"INCOMPLETO RECHAZAR"}]
[{"$f":"+PARTES!G64","v":"c PARTE PJ"},{"$f":"+PARTES!H64","v":0},{"$f":"+PARTES!H64","v":0},{"$f":"+PARTES!I64","v":"CEL/TEL :"},{"$f":"IF(PARTES!J64>0,PARTES!J64,\"INCOMPLETO RECHAZAR\")","v":"INCOMPLETO RECHAZAR"}]
[{"$f":"+PARTES!G65","v":"c PARTE PJ"},{"$f":"+PARTES!H65","v":0},{"$f":"+PARTES!H65","v":0},{"$f":"+PARTES!I65","v":"OBJETO PRINCIPAL (EN FORMA RESUMIDA):"},{"$f":"IF(PARTES!J65>0,PARTES!J65,\"INCOMPLETO RECHAZAR\")","v":"INCOMPLETO RECHAZAR"}]
[{"$f":"+PARTES!G66","v":"d CONTRIB."},{"$f":"+PARTES!H66","v":0},{"$f":"+PARTES!H66","v":0},{"$f":"+PARTES!I66","v":"CARÁCTER DE PARTE:"},{"$f":"IF(PARTES!J66=\"ELEGIR\",\"INCOMPLETO RECHAZAR\",PARTES!J66)","v":"INCOMPLETO RECHAZAR"}]
[{"$f":"+PARTES!G67","v":"c PARTE PJ"},{"$f":"+PARTES!H67","v":0},{"$f":"+PARTES!H67","v":0},{"$f":"+PARTES!I67","v":"NOTA/OBSERVACIÓN -en mayúscula-:"},{"$f":"IF(PARTES!J67>0,PARTES!J67,\"INCOMPLETO RECHAZAR\")","v":"INCOMPLETO RECHAZAR"}]
[{"$f":"+PARTES!G68","v":"c PARTE PJ"},{"$f":"+PARTES!H68","v":0},{"$f":"+PARTES!H68","v":0},{"$f":"+PARTES!I68","v":"CUIT –sin puntos ni barras-:"},{"$f":"IF(PARTES!J68>0,PARTES!J68,\"INCOMPLETO RECHAZAR\")","v":"INCOMPLETO RECHAZAR"}]
[{"$f":"+PARTES!G69","v":"c PARTE PJ"},{"$f":"+PARTES!H69","v":0},{"$f":"+PARTES!H69","v":0},{"$f":"+PARTES!I69","v":"TIPO DE PERSONA JCA -FIDEICOMISO, asociación, mutual, etc-:"},{"$f":"IF(PARTES!J69>0,PARTES!J69,\"INCOMPLETO RECHAZAR\")","v":"INCOMPLETO RECHAZAR"}]
[{"$f":"+PARTES!G70","v":"c PARTE PJ"},{"$f":"+PARTES!H70","v":0},{"$f":"+PARTES!H70","v":0},{"$f":"+PARTES!I70","v":"ORGANISMO /s DONDE SE INSCRIBIÓ CONSTITUCIÓN (INDICAR LOCALIDAD/PCIA DEL ORG) -si no se inscribió poner: NO INSCRIPTO/A:"},{"$f":"IF(PARTES!J70>0,PARTES!J70,\"INCOMPLETO RECHAZAR\")","v":"INCOMPLETO RECHAZAR"}]
[{"$f":"+PARTES!G71","v":"c PARTE PJ"},{"$f":"+PARTES!H71","v":0},{"$f":"+PARTES!H71","v":0},{"$f":"+PARTES!I71","v":"DATOS DE RESOLUCIÓN Y FECHA DE INSCRIPCIÓN:"},{"$f":"IF(PARTES!J71>0,PARTES!J71,\"INCOMPLETO RECHAZAR\")","v":"INCOMPLETO RECHAZAR"}]
[{"$f":"+PARTES!G72","v":"c PARTE PJ"},{"$f":"+PARTES!H72","v":0},{"$f":"+PARTES!H72","v":0},{"$f":"+PARTES!I72","v":"FECHA DE INSCRIPCION:"},{"$f":"IF(PARTES!J72>0,PARTES!J72,\"INCOMPLETO RECHAZAR\")","v":"INCOMPLETO RECHAZAR"}]
[{"$f":"+PARTES!G73","v":"c PARTE PJ"},{"$f":"+PARTES!H73","v":0},{"$f":"+PARTES!H73","v":0},{"$f":"+PARTES!I73","v":"APELLIDO/S, NOMBRE/S,  DNI Y CARGO DE CADA PARTE DE SU ADMINISTRACIÓN:"},{"$f":"IF(PARTES!J73>0,PARTES!J73,\"INCOMPLETO RECHAZAR\")","v":"INCOMPLETO RECHAZAR"}]
[{"$f":"+PARTES!G74","v":"c PARTE PJ"},{"$f":"+PARTES!H74","v":0},{"$f":"+PARTES!H74","v":0},{"$f":"+PARTES!I74","v":"DOMICILIO SOCIAL:"},{"$f":"IF(PARTES!J74>0,PARTES!J74,\"INCOMPLETO RECHAZAR\")","v":"INCOMPLETO RECHAZAR"}]
[{"$f":"+PARTES!G75","v":"c PARTE PJ"},{"$f":"+PARTES!H75","v":0},{"$f":"+PARTES!H75","v":0},{"$f":"+PARTES!I75","v":"SEDE SOCIAL:"},{"$f":"IF(PARTES!J75>0,PARTES!J75,\"INCOMPLETO RECHAZAR\")","v":"INCOMPLETO RECHAZAR"}]
[{"$f":"+PARTES!G76","v":"c PARTE PJ"},{"$f":"+PARTES!H76","v":0},{"$f":"+PARTES!H76","v":0},{"$f":"+PARTES!I76","v":"CEL/TEL :"},{"$f":"IF(PARTES!J76>0,PARTES!J76,\"INCOMPLETO RECHAZAR\")","v":"INCOMPLETO RECHAZAR"}]
[{"$f":"+PARTES!G77","v":"c PARTE PJ"},{"$f":"+PARTES!H77","v":0},{"$f":"+PARTES!H77","v":0},{"$f":"+PARTES!I77","v":"OBJETO PRINCIPAL (EN FORMA RESUMIDA):"},{"$f":"IF(PARTES!J77>0,PARTES!J77,\"INCOMPLETO RECHAZAR\")","v":"INCOMPLETO RECHAZAR"}]
[{"$f":"+PARTES!G78","v":"d CONTRIB."},{"$f":"+PARTES!H78","v":0},{"$f":"+PARTES!H78","v":0},{"$f":"+PARTES!I78","v":"CARÁCTER DE PARTE:"},{"$f":"IF(PARTES!J78=\"ELEGIR\",\"INCOMPLETO RECHAZAR\",PARTES!J78)","v":"INCOMPLETO RECHAZAR"}]
[{"$f":"+PARTES!G79","v":"c PARTE PJ"},{"$f":"+PARTES!H79","v":0},{"$f":"+PARTES!H79","v":0},{"$f":"+PARTES!I79","v":"NOTA/OBSERVACIÓN -en mayúscula-:"},{"$f":"IF(PARTES!J79>0,PARTES!J79,\"INCOMPLETO RECHAZAR\")","v":"INCOMPLETO RECHAZAR"}]
[{"$f":"+PARTES!G80","v":"c PARTE PJ"},{"$f":"+PARTES!H80","v":0},{"$f":"+PARTES!H80","v":0},{"$f":"+PARTES!I80","v":"CUIT –sin puntos ni barras-:"},{"$f":"IF(PARTES!J80>0,PARTES!J80,\"INCOMPLETO RECHAZAR\")","v":"INCOMPLETO RECHAZAR"}]
[{"$f":"+PARTES!G81","v":"c PARTE PJ"},{"$f":"+PARTES!H81","v":0},{"$f":"+PARTES!H81","v":0},{"$f":"+PARTES!I81","v":"TIPO DE PERSONA JCA -FIDEICOMISO, asociación, mutual, etc-:"},{"$f":"IF(PARTES!J81>0,PARTES!J81,\"INCOMPLETO RECHAZAR\")","v":"INCOMPLETO RECHAZAR"}]
[{"$f":"+PARTES!G82","v":"c PARTE PJ"},{"$f":"+PARTES!H82","v":0},{"$f":"+PARTES!H82","v":0},{"$f":"+PARTES!I82","v":"ORGANISMO /s DONDE SE INSCRIBIÓ CONSTITUCIÓN (INDICAR LOCALIDAD/PCIA DEL ORG) -si no se inscribió poner: NO INSCRIPTO/A:"},{"$f":"IF(PARTES!J82>0,PARTES!J82,\"INCOMPLETO RECHAZAR\")","v":"INCOMPLETO RECHAZAR"}]
[{"$f":"+PARTES!G83","v":"c PARTE PJ"},{"$f":"+PARTES!H83","v":0},{"$f":"+PARTES!H83","v":0},{"$f":"+PARTES!I83","v":"DATOS DE RESOLUCIÓN Y FECHA DE INSCRIPCIÓN:"},{"$f":"IF(PARTES!J83>0,PARTES!J83,\"INCOMPLETO RECHAZAR\")","v":"INCOMPLETO RECHAZAR"}]
[{"$f":"+PARTES!G84","v":"c PARTE PJ"},{"$f":"+PARTES!H84","v":0},{"$f":"+PARTES!H84","v":0},{"$f":"+PARTES!I84","v":"FECHA DE INSCRIPCION:"},{"$f":"IF(PARTES!J84>0,PARTES!J84,\"INCOMPLETO RECHAZAR\")","v":"INCOMPLETO RECHAZAR"}]
[{"$f":"+PARTES!G85","v":"c PARTE PJ"},{"$f":"+PARTES!H85","v":0},{"$f":"+PARTES!H85","v":0},{"$f":"+PARTES!I85","v":"APELLIDO/S, NOMBRE/S,  DNI Y CARGO DE CADA PARTE DE SU ADMINISTRACIÓN:"},{"$f":"IF(PARTES!J85>0,PARTES!J85,\"INCOMPLETO RECHAZAR\")","v":"INCOMPLETO RECHAZAR"}]
[{"$f":"+PARTES!G86","v":"c PARTE PJ"},{"$f":"+PARTES!H86","v":0},{"$f":"+PARTES!H86","v":0},{"$f":"+PARTES!I86","v":"DOMICILIO SOCIAL:"},{"$f":"IF(PARTES!J86>0,PARTES!J86,\"INCOMPLETO RECHAZAR\")","v":"INCOMPLETO RECHAZAR"}]
[{"$f":"+PARTES!G87","v":"c PARTE PJ"},{"$f":"+PARTES!H87","v":0},{"$f":"+PARTES!H87","v":0},{"$f":"+PARTES!I87","v":"SEDE SOCIAL:"},{"$f":"IF(PARTES!J87>0,PARTES!J87,\"INCOMPLETO RECHAZAR\")","v":"INCOMPLETO RECHAZAR"}]
[{"$f":"+PARTES!G88","v":"c PARTE PJ"},{"$f":"+PARTES!H88","v":0},{"$f":"+PARTES!H88","v":0},{"$f":"+PARTES!I88","v":"CEL/TEL :"},{"$f":"IF(PARTES!J88>0,PARTES!J88,\"INCOMPLETO RECHAZAR\")","v":"INCOMPLETO RECHAZAR"}]
[{"$f":"+PARTES!G89","v":"c PARTE PJ"},{"$f":"+PARTES!H89","v":0},{"$f":"+PARTES!H89","v":0},{"$f":"+PARTES!I89","v":"OBJETO PRINCIPAL (EN FORMA RESUMIDA):"},{"$f":"IF(PARTES!J89>0,PARTES!J89,\"INCOMPLETO RECHAZAR\")","v":"INCOMPLETO RECHAZAR"}]
[{"$f":"+PARTES!G90","v":"d CONTRIB."},{"$f":"+PARTES!H90","v":0},{"$f":"+PARTES!H90","v":0},{"$f":"+PARTES!I90","v":"CARÁCTER DE PARTE:"},{"$f":"IF(PARTES!J90=\"ELEGIR\",\"INCOMPLETO RECHAZAR\",PARTES!J90)","v":"INCOMPLETO RECHAZAR"}]
[{"$f":"+PARTES!G91","v":"c PARTE PJ"},{"$f":"+PARTES!H91","v":0},{"$f":"+PARTES!H91","v":0},{"$f":"+PARTES!I91","v":"NOTA/OBSERVACIÓN -en mayúscula-:"},{"$f":"IF(PARTES!J91>0,PARTES!J91,\"INCOMPLETO RECHAZAR\")","v":"INCOMPLETO RECHAZAR"}]
[{"$f":"+PARTES!G92","v":"c PARTE PJ"},{"$f":"+PARTES!H92","v":0},{"$f":"+PARTES!H92","v":0},{"$f":"+PARTES!I92","v":"CUIT –sin puntos ni barras-:"},{"$f":"IF(PARTES!J92>0,PARTES!J92,\"INCOMPLETO RECHAZAR\")","v":"INCOMPLETO RECHAZAR"}]
[{"$f":"+PARTES!G93","v":"c PARTE PJ"},{"$f":"+PARTES!H93","v":0},{"$f":"+PARTES!H93","v":0},{"$f":"+PARTES!I93","v":"TIPO DE PERSONA JCA -FIDEICOMISO, asociación, mutual, etc-:"},{"$f":"IF(PARTES!J93>0,PARTES!J93,\"INCOMPLETO RECHAZAR\")","v":"INCOMPLETO RECHAZAR"}]
[{"$f":"+PARTES!G94","v":"c PARTE PJ"},{"$f":"+PARTES!H94","v":0},{"$f":"+PARTES!H94","v":0},{"$f":"+PARTES!I94","v":"ORGANISMO /s DONDE SE INSCRIBIÓ CONSTITUCIÓN (INDICAR LOCALIDAD/PCIA DEL ORG) -si no se inscribió poner: NO INSCRIPTO/A:"},{"$f":"IF(PARTES!J94>0,PARTES!J94,\"INCOMPLETO RECHAZAR\")","v":"INCOMPLETO RECHAZAR"}]
[{"$f":"+PARTES!G95","v":"c PARTE PJ"},{"$f":"+PARTES!H95","v":0},{"$f":"+PARTES!H95","v":0},{"$f":"+PARTES!I95","v":"DATOS DE RESOLUCIÓN Y FECHA DE INSCRIPCIÓN:"},{"$f":"IF(PARTES!J95>0,PARTES!J95,\"INCOMPLETO RECHAZAR\")","v":"INCOMPLETO RECHAZAR"}]
[{"$f":"+PARTES!G96","v":"c PARTE PJ"},{"$f":"+PARTES!H96","v":0},{"$f":"+PARTES!H96","v":0},{"$f":"+PARTES!I96","v":"FECHA DE INSCRIPCION:"},{"$f":"IF(PARTES!J96>0,PARTES!J96,\"INCOMPLETO RECHAZAR\")","v":"INCOMPLETO RECHAZAR"}]
[{"$f":"+PARTES!G97","v":"c PARTE PJ"},{"$f":"+PARTES!H97","v":0},{"$f":"+PARTES!H97","v":0},{"$f":"+PARTES!I97","v":"APELLIDO/S, NOMBRE/S,  DNI Y CARGO DE CADA PARTE DE SU ADMINISTRACIÓN:"},{"$f":"IF(PARTES!J97>0,PARTES!J97,\"INCOMPLETO RECHAZAR\")","v":"INCOMPLETO RECHAZAR"}]
[{"$f":"+PARTES!G98","v":"c PARTE PJ"},{"$f":"+PARTES!H98","v":0},{"$f":"+PARTES!H98","v":0},{"$f":"+PARTES!I98","v":"DOMICILIO SOCIAL:"},{"$f":"IF(PARTES!J98>0,PARTES!J98,\"INCOMPLETO RECHAZAR\")","v":"INCOMPLETO RECHAZAR"}]
[{"$f":"+PARTES!G99","v":"c PARTE PJ"},{"$f":"+PARTES!H99","v":0},{"$f":"+PARTES!H99","v":0},{"$f":"+PARTES!I99","v":"SEDE SOCIAL:"},{"$f":"IF(PARTES!J99>0,PARTES!J99,\"INCOMPLETO RECHAZAR\")","v":"INCOMPLETO RECHAZAR"}]
[{"$f":"+PARTES!G100","v":"c PARTE PJ"},{"$f":"+PARTES!H100","v":0},{"$f":"+PARTES!H100","v":0},{"$f":"+PARTES!I100","v":"CEL/TEL :"},{"$f":"IF(PARTES!J100>0,PARTES!J100,\"INCOMPLETO RECHAZAR\")","v":"INCOMPLETO RECHAZAR"}]
[{"$f":"+PARTES!G101","v":"c PARTE PJ"},{"$f":"+PARTES!H101","v":0},{"$f":"+PARTES!H101","v":0},{"$f":"+PARTES!I101","v":"OBJETO PRINCIPAL (EN FORMA RESUMIDA):"},{"$f":"IF(PARTES!J101>0,PARTES!J101,\"INCOMPLETO RECHAZAR\")","v":"INCOMPLETO RECHAZAR"}]
[{"$f":"+PARTES!G102","v":"d CONTRIB."},{"$f":"+PARTES!H102","v":0},{"$f":"+PARTES!H102","v":0},{"$f":"+PARTES!I102","v":"CARÁCTER DE PARTE:"},{"$f":"IF(PARTES!J102=\"ELEGIR\",\"INCOMPLETO RECHAZAR\",PARTES!J102)","v":"INCOMPLETO RECHAZAR"}]
[{"$f":"+PARTES!G103","v":"c PARTE PJ"},{"$f":"+PARTES!H103","v":0},{"$f":"+PARTES!H103","v":0},{"$f":"+PARTES!I103","v":"NOTA/OBSERVACIÓN -en mayúscula-:"},{"$f":"IF(PARTES!J103>0,PARTES!J103,\"INCOMPLETO RECHAZAR\")","v":"INCOMPLETO RECHAZAR"}]
[{"$f":"+PARTES!G104","v":"c PARTE PJ"},{"$f":"+PARTES!H104","v":0},{"$f":"+PARTES!H104","v":0},{"$f":"+PARTES!I104","v":"CUIT –sin puntos ni barras-:"},{"$f":"IF(PARTES!J104>0,PARTES!J104,\"INCOMPLETO RECHAZAR\")","v":"INCOMPLETO RECHAZAR"}]
[{"$f":"+PARTES!G105","v":"c PARTE PJ"},{"$f":"+PARTES!H105","v":0},{"$f":"+PARTES!H105","v":0},{"$f":"+PARTES!I105","v":"TIPO DE PERSONA JCA -FIDEICOMISO, asociación, mutual, etc-:"},{"$f":"IF(PARTES!J105>0,PARTES!J105,\"INCOMPLETO RECHAZAR\")","v":"INCOMPLETO RECHAZAR"}]
[{"$f":"+PARTES!G106","v":"c PARTE PJ"},{"$f":"+PARTES!H106","v":0},{"$f":"+PARTES!H106","v":0},{"$f":"+PARTES!I106","v":"ORGANISMO /s DONDE SE INSCRIBIÓ CONSTITUCIÓN (INDICAR LOCALIDAD/PCIA DEL ORG) -si no se inscribió poner: NO INSCRIPTO/A:"},{"$f":"IF(PARTES!J106>0,PARTES!J106,\"INCOMPLETO RECHAZAR\")","v":"INCOMPLETO RECHAZAR"}]
[{"$f":"+PARTES!G107","v":"c PARTE PJ"},{"$f":"+PARTES!H107","v":0},{"$f":"+PARTES!H107","v":0},{"$f":"+PARTES!I107","v":"DATOS DE RESOLUCIÓN Y FECHA DE INSCRIPCIÓN:"},{"$f":"IF(PARTES!J107>0,PARTES!J107,\"INCOMPLETO RECHAZAR\")","v":"INCOMPLETO RECHAZAR"}]
[{"$f":"+PARTES!G108","v":"c PARTE PJ"},{"$f":"+PARTES!H108","v":0},{"$f":"+PARTES!H108","v":0},{"$f":"+PARTES!I108","v":"FECHA DE INSCRIPCION:"},{"$f":"IF(PARTES!J108>0,PARTES!J108,\"INCOMPLETO RECHAZAR\")","v":"INCOMPLETO RECHAZAR"}]
[{"$f":"+PARTES!G109","v":"c PARTE PJ"},{"$f":"+PARTES!H109","v":0},{"$f":"+PARTES!H109","v":0},{"$f":"+PARTES!I109","v":"APELLIDO/S, NOMBRE/S,  DNI Y CARGO DE CADA PARTE DE SU ADMINISTRACIÓN:"},{"$f":"IF(PARTES!J109>0,PARTES!J109,\"INCOMPLETO RECHAZAR\")","v":"INCOMPLETO RECHAZAR"}]
[{"$f":"+PARTES!G110","v":"c PARTE PJ"},{"$f":"+PARTES!H110","v":0},{"$f":"+PARTES!H110","v":0},{"$f":"+PARTES!I110","v":"DOMICILIO SOCIAL:"},{"$f":"IF(PARTES!J110>0,PARTES!J110,\"INCOMPLETO RECHAZAR\")","v":"INCOMPLETO RECHAZAR"}]
[{"$f":"+PARTES!G111","v":"c PARTE PJ"},{"$f":"+PARTES!H111","v":0},{"$f":"+PARTES!H111","v":0},{"$f":"+PARTES!I111","v":"SEDE SOCIAL:"},{"$f":"IF(PARTES!J111>0,PARTES!J111,\"INCOMPLETO RECHAZAR\")","v":"INCOMPLETO RECHAZAR"}]
[{"$f":"+PARTES!G112","v":"c PARTE PJ"},{"$f":"+PARTES!H112","v":0},{"$f":"+PARTES!H112","v":0},{"$f":"+PARTES!I112","v":"CEL/TEL :"},{"$f":"IF(PARTES!J112>0,PARTES!J112,\"INCOMPLETO RECHAZAR\")","v":"INCOMPLETO RECHAZAR"}]
[{"$f":"+PARTES!G113","v":"c PARTE PJ"},{"$f":"+PARTES!H113","v":0},{"$f":"+PARTES!H113","v":0},{"$f":"+PARTES!I113","v":"OBJETO PRINCIPAL (EN FORMA RESUMIDA):"},{"$f":"IF(PARTES!J113>0,PARTES!J113,\"INCOMPLETO RECHAZAR\")","v":"INCOMPLETO RECHAZAR"}]
[{"$f":"+PARTES!G114","v":"d CONTRIB."},{"$f":"+PARTES!H114","v":0},{"$f":"+PARTES!H114","v":0},{"$f":"+PARTES!I114","v":"CARÁCTER DE PARTE:"},{"$f":"IF(PARTES!J114=\"ELEGIR\",\"INCOMPLETO RECHAZAR\",PARTES!J114)","v":"INCOMPLETO RECHAZAR"}]
[{"$f":"+PARTES!G115","v":"c PARTE PJ"},{"$f":"+PARTES!H115","v":0},{"$f":"+PARTES!H115","v":0},{"$f":"+PARTES!I115","v":"NOTA/OBSERVACIÓN -en mayúscula-:"},{"$f":"IF(PARTES!J115>0,PARTES!J115,\"INCOMPLETO RECHAZAR\")","v":"INCOMPLETO RECHAZAR"}]
[{"$f":"+PARTES!G116","v":"c PARTE PJ"},{"$f":"+PARTES!H116","v":0},{"$f":"+PARTES!H116","v":0},{"$f":"+PARTES!I116","v":"CUIT –sin puntos ni barras-:"},{"$f":"IF(PARTES!J116>0,PARTES!J116,\"INCOMPLETO RECHAZAR\")","v":"INCOMPLETO RECHAZAR"}]
[{"$f":"+PARTES!G117","v":"c PARTE PJ"},{"$f":"+PARTES!H117","v":0},{"$f":"+PARTES!H117","v":0},{"$f":"+PARTES!I117","v":"TIPO DE PERSONA JCA -FIDEICOMISO, asociación, mutual, etc-:"},{"$f":"IF(PARTES!J117>0,PARTES!J117,\"INCOMPLETO RECHAZAR\")","v":"INCOMPLETO RECHAZAR"}]
[{"$f":"+PARTES!G118","v":"c PARTE PJ"},{"$f":"+PARTES!H118","v":0},{"$f":"+PARTES!H118","v":0},{"$f":"+PARTES!I118","v":"ORGANISMO /s DONDE SE INSCRIBIÓ CONSTITUCIÓN (INDICAR LOCALIDAD/PCIA DEL ORG) -si no se inscribió poner: NO INSCRIPTO/A:"},{"$f":"IF(PARTES!J118>0,PARTES!J118,\"INCOMPLETO RECHAZAR\")","v":"INCOMPLETO RECHAZAR"}]
[{"$f":"+PARTES!G119","v":"c PARTE PJ"},{"$f":"+PARTES!H119","v":0},{"$f":"+PARTES!H119","v":0},{"$f":"+PARTES!I119","v":"DATOS DE RESOLUCIÓN Y FECHA DE INSCRIPCIÓN:"},{"$f":"IF(PARTES!J119>0,PARTES!J119,\"INCOMPLETO RECHAZAR\")","v":"INCOMPLETO RECHAZAR"}]
[{"$f":"+PARTES!G120","v":"c PARTE PJ"},{"$f":"+PARTES!H120","v":0},{"$f":"+PARTES!H120","v":0},{"$f":"+PARTES!I120","v":"FECHA DE INSCRIPCION:"},{"$f":"IF(PARTES!J120>0,PARTES!J120,\"INCOMPLETO RECHAZAR\")","v":"INCOMPLETO RECHAZAR"}]
[{"$f":"+PARTES!G121","v":"c PARTE PJ"},{"$f":"+PARTES!H121","v":0},{"$f":"+PARTES!H121","v":0},{"$f":"+PARTES!I121","v":"APELLIDO/S, NOMBRE/S,  DNI Y CARGO DE CADA PARTE DE SU ADMINISTRACIÓN:"},{"$f":"IF(PARTES!J121>0,PARTES!J121,\"INCOMPLETO RECHAZAR\")","v":"INCOMPLETO RECHAZAR"}]
[{"$f":"+PARTES!G122","v":"c PARTE PJ"},{"$f":"+PARTES!H122","v":0},{"$f":"+PARTES!H122","v":0},{"$f":"+PARTES!I122","v":"DOMICILIO SOCIAL:"},{"$f":"IF(PARTES!J122>0,PARTES!J122,\"INCOMPLETO RECHAZAR\")","v":"INCOMPLETO RECHAZAR"}]
[{"$f":"+PARTES!G123","v":"c PARTE PJ"},{"$f":"+PARTES!H123","v":0},{"$f":"+PARTES!H123","v":0},{"$f":"+PARTES!I123","v":"SEDE SOCIAL:"},{"$f":"IF(PARTES!J123>0,PARTES!J123,\"INCOMPLETO RECHAZAR\")","v":"INCOMPLETO RECHAZAR"}]
[{"$f":"+PARTES!G124","v":"c PARTE PJ"},{"$f":"+PARTES!H124","v":0},{"$f":"+PARTES!H124","v":0},{"$f":"+PARTES!I124","v":"CEL/TEL :"},{"$f":"IF(PARTES!J124>0,PARTES!J124,\"INCOMPLETO RECHAZAR\")","v":"INCOMPLETO RECHAZAR"}]
[{"$f":"+PARTES!G125","v":"c PARTE PJ"},{"$f":"+PARTES!H125","v":0},{"$f":"+PARTES!H125","v":0},{"$f":"+PARTES!I125","v":"OBJETO PRINCIPAL (EN FORMA RESUMIDA):"},{"$f":"IF(PARTES!J125>0,PARTES!J125,\"INCOMPLETO RECHAZAR\")","v":"INCOMPLETO RECHAZAR"}]
[{"$f":"+PARTES!G126","v":"d CONTRIB."},{"$f":"+PARTES!H126","v":0},{"$f":"+PARTES!H126","v":0},{"$f":"+PARTES!I126","v":"CARÁCTER DE PARTE:"},{"$f":"IF(PARTES!J126=\"ELEGIR\",\"INCOMPLETO RECHAZAR\",PARTES!J126)","v":"INCOMPLETO RECHAZAR"}]
[{"$f":"+PARTES!G127","v":"c PARTE PJ"},{"$f":"+PARTES!H127","v":0},{"$f":"+PARTES!H127","v":0},{"$f":"+PARTES!I127","v":"NOTA/OBSERVACIÓN -en mayúscula-:"},{"$f":"IF(PARTES!J127>0,PARTES!J127,\"INCOMPLETO RECHAZAR\")","v":"INCOMPLETO RECHAZAR"}]
[{"$f":"+PARTES!G128","v":"c PARTE PJ"},{"$f":"+PARTES!H128","v":0},{"$f":"+PARTES!H128","v":0},{"$f":"+PARTES!I128","v":"CUIT –sin puntos ni barras-:"},{"$f":"IF(PARTES!J128>0,PARTES!J128,\"INCOMPLETO RECHAZAR\")","v":"INCOMPLETO RECHAZAR"}]
[{"$f":"+PARTES!G129","v":"c PARTE PJ"},{"$f":"+PARTES!H129","v":0},{"$f":"+PARTES!H129","v":0},{"$f":"+PARTES!I129","v":"TIPO DE PERSONA JCA -FIDEICOMISO, asociación, mutual, etc-:"},{"$f":"IF(PARTES!J129>0,PARTES!J129,\"INCOMPLETO RECHAZAR\")","v":"INCOMPLETO RECHAZAR"}]
[{"$f":"+PARTES!G130","v":"c PARTE PJ"},{"$f":"+PARTES!H130","v":0},{"$f":"+PARTES!H130","v":0},{"$f":"+PARTES!I130","v":"ORGANISMO /s DONDE SE INSCRIBIÓ CONSTITUCIÓN (INDICAR LOCALIDAD/PCIA DEL ORG) -si no se inscribió poner: NO INSCRIPTO/A:"},{"$f":"IF(PARTES!J130>0,PARTES!J130,\"INCOMPLETO RECHAZAR\")","v":"INCOMPLETO RECHAZAR"}]
[{"$f":"+PARTES!G131","v":"c PARTE PJ"},{"$f":"+PARTES!H131","v":0},{"$f":"+PARTES!H131","v":0},{"$f":"+PARTES!I131","v":"DATOS DE RESOLUCIÓN Y FECHA DE INSCRIPCIÓN:"},{"$f":"IF(PARTES!J131>0,PARTES!J131,\"INCOMPLETO RECHAZAR\")","v":"INCOMPLETO RECHAZAR"}]
[{"$f":"+PARTES!G132","v":"c PARTE PJ"},{"$f":"+PARTES!H132","v":0},{"$f":"+PARTES!H132","v":0},{"$f":"+PARTES!I132","v":"FECHA DE INSCRIPCION:"},{"$f":"IF(PARTES!J132>0,PARTES!J132,\"INCOMPLETO RECHAZAR\")","v":"INCOMPLETO RECHAZAR"}]
[{"$f":"+PARTES!G133","v":"c PARTE PJ"},{"$f":"+PARTES!H133","v":0},{"$f":"+PARTES!H133","v":0},{"$f":"+PARTES!I133","v":"APELLIDO/S, NOMBRE/S,  DNI Y CARGO DE CADA PARTE DE SU ADMINISTRACIÓN:"},{"$f":"IF(PARTES!J133>0,PARTES!J133,\"INCOMPLETO RECHAZAR\")","v":"INCOMPLETO RECHAZAR"}]
[{"$f":"+PARTES!G134","v":"c PARTE PJ"},{"$f":"+PARTES!H134","v":0},{"$f":"+PARTES!H134","v":0},{"$f":"+PARTES!I134","v":"DOMICILIO SOCIAL:"},{"$f":"IF(PARTES!J134>0,PARTES!J134,\"INCOMPLETO RECHAZAR\")","v":"INCOMPLETO RECHAZAR"}]
[{"$f":"+PARTES!G135","v":"c PARTE PJ"},{"$f":"+PARTES!H135","v":0},{"$f":"+PARTES!H135","v":0},{"$f":"+PARTES!I135","v":"SEDE SOCIAL:"},{"$f":"IF(PARTES!J135>0,PARTES!J135,\"INCOMPLETO RECHAZAR\")","v":"INCOMPLETO RECHAZAR"}]
[{"$f":"+PARTES!G136","v":"c PARTE PJ"},{"$f":"+PARTES!H136","v":0},{"$f":"+PARTES!H136","v":0},{"$f":"+PARTES!I136","v":"CEL/TEL :"},{"$f":"IF(PARTES!J136>0,PARTES!J136,\"INCOMPLETO RECHAZAR\")","v":"INCOMPLETO RECHAZAR"}]
[{"$f":"+PARTES!G137","v":"c PARTE PJ"},{"$f":"+PARTES!H137","v":0},{"$f":"+PARTES!H137","v":0},{"$f":"+PARTES!I137","v":"OBJETO PRINCIPAL (EN FORMA RESUMIDA):"},{"$f":"IF(PARTES!J137>0,PARTES!J137,\"INCOMPLETO RECHAZAR\")","v":"INCOMPLETO RECHAZAR"}]
[{"$f":"+PARTES!G138","v":"d CONTRIB."},{"$f":"+PARTES!H138","v":0},{"$f":"+PARTES!H138","v":0},{"$f":"+PARTES!I138","v":"CARÁCTER DE PARTE:"},{"$f":"IF(PARTES!J138=\"ELEGIR\",\"INCOMPLETO RECHAZAR\",PARTES!J138)","v":"INCOMPLETO RECHAZAR"}]
[{"$f":"+PARTES!G139","v":"c PARTE PJ"},{"$f":"+PARTES!H139","v":0},{"$f":"+PARTES!H139","v":0},{"$f":"+PARTES!I139","v":"NOTA/OBSERVACIÓN -en mayúscula-:"},{"$f":"IF(PARTES!J139>0,PARTES!J139,\"INCOMPLETO RECHAZAR\")","v":"INCOMPLETO RECHAZAR"}]

{"sheet":"LISTADOS","index":4,"n_rows":43,"n_cols":5,"rows_kept":43,"cut":false,"hidden":true,"merged":[]}
["ESTADO CIVIL","ACTIVIDAD PRINCIPAL","ADMINISTRADOR SAS 1 socios","ADMINISTRADOR SAS 1 NO socios"]
["SOLTERO/A","COMERCIAL","SOCIO/A ADM. TITULAR","NO SOCIO/A ADM. TITULAR"]
["CASADO/A","INMOBILIARIA","SOCIO/A ADM. SUPLENTE","NO SOCIO/A ADM. SUPLENTE"]
["VIUDO/A","INDUSTRIAL"]
["DIVORCIADO/A","FINANCIERA",null,"SUMA ADM SUPLENTES SAS 1","SUMA ADM TITULAR SAS 1"]
[null,"TRANSPORTE",null,{"$f":"COUNTIFS(#REF!,\"*\"&\"SUPLENTE\"&\"*\")","v":{"$error":"#REF!"}},{"$f":"COUNTIFS(#REF!,\"*\"&\"TITULAR\"&\"*\")","v":{"$error":"#REF!"}}]
["GESTIONANTE","AGROPECUARIA",null,{"$f":"COUNTIFS(#REF!,\"*\"&\"SUPLENTE\"&\"*\")","v":{"$error":"#REF!"}},{"$f":"COUNTIFS(#REF!,\"*\"&\"TITULAR\"&\"*\")","v":{"$error":"#REF!"}}]
["ELEGIR","MINERA"]
["APODERADO/A LETRADO/A","EXTRACCIÓN PETROLEO Y/O GAS"]
["ESCRIBANO/A","CONSTRUCCIÓN"]
["AUTORIZADO/A","OTRA/S"]
["REP. LEGAL SOC."]
["CONTADOR"]
["CUIT"]
["NO POSEE"]
["POSEE"]
["EN TRAMITE"]
[]
["ADMINISTRADOR","RESOLUCION 70/2011 -SOCIO",null,"PREGUNTAS","UIF SAS 1"]
[0,"SI",null,"SI","SI"]
["ADMINISTRADOR/A TITULAR","NO",null,"NO","NO"]
["ADMINISTRADOR/A SUPLENTE","ORG. FISCALIZACION"]
["PRESIDENTE/A",0,"ADMINISTRADOR NO SOCIO"]
["VICEPRESIDENTE/A","SINDICO/A",0]
["DIRECTOR/A","SINDICO/A SUPLENTE","ADMINISTRADOR/A TITULAR"]
["DIRECTOR/A SUPLENTE","AUDITOR/A","ADMINISTRADOR/A SUPLENTE"]
["SUBDIRECTOR/A","AUDITOR/A SUPLENTE","PRESIDENTE/A"]
["SUBDIRECTOR/A SUPLENTE","SUBAUDITOR/A","VICEPRESIDENTE/A"]
["SOCIO/A GERENTE","CONTRALOR/A","DIRECTOR/A"]
["SOCIO/A GERENTE SUPLENTE","CONTRALOR/A SUPLENTE","DIRECTOR/A SUPLENTE"]
["GERENTE/A","OTRO/A","SUBDIRECTOR/A"]
["GERENTE/A SUPLENTE",null,"SUBDIRECTOR/A SUPLENTE"]
["OTRO/A",null,"GERENTE/A"]
[null,null,"GERENTE/A SUPLENTE"]
[null,null,"OTRO/A"]
[]
[null,"ELEGIR"]
[null,"FIDUCIANTE"]
[null,"FIDUCIARIO"]
["TRAMITES","BENEFICIARIO/A"]
["ELEGIR","OTRO/A"]
["INSCRIPCIÓN INICIAL"]
["MODIFICACION/ES"]

{"sheet":"BD-GRAL","index":5,"n_rows":378,"n_cols":18,"rows_kept":378,"cut":false,"hidden":true,"merged":[[4,0,5,0],[4,1,5,1],[4,2,4,3],[4,4,5,4],[4,5,5,5],[1,7,1,8],[2,7,2,8],[3,4,3,5],[3,7,3,8],[4,13,4,17],[4,6,4,7],[4,8,5,8],[4,9,5,9],[4,10,5,10],[4,11,5,11],[4,12,5,12]]}
["BASE DE DATOS"]
["FECHA DE CARGA BASE DATOS:",null,null,null,null,null,null,{"$f":"+IF(G2>0,\".\",\"ERROR llene FECHA\")","v":"ERROR llene FECHA"}]
["EXPTE. NRO. DONDE SE DENUNCIÓ DATOS:",null,null,null,null,null,null,{"$f":"+IF(G3>0,\".\",\"ERROR llene NRO. EXPTE.\")","v":"ERROR llene NRO. EXPTE."}]
[null,null,null,null,"NRO. DE LEGAJO",null,null,{"$f":"+IF(G4>0,\".\",\"ERROR llene NRO. LEGAJO\")","v":"ERROR llene NRO. LEGAJO"}]
["COD. Int.","FORM.","DATOS DENUNCIADOS",null,"VINCULADOS","VINCULADOS","DATOS",null,"FECHA","NRO. DE LEGAJO","EXPTE./OTROS","FS.","NOTA/ OTROS","OBSERVACION"]
[null,null,"INSCRIPTO RPC","FECHA ALTA/MO-DIFICACIÓN",null,null,"CONCEPTO","COMPLETAR -EN MAYUSCULA -",null,null,null,null,null,"FECHA","DETALLE","EXPTE./ OTRO/s","FS.","NOTA/ OTROS"]
[]
[null,{"$f":"IF(E8=0,0,IMPRIMIR!A7)","v":0},{"$f":"IF(E8=0,0,IMPRIMIR!$D$3)","v":0},{"$f":"IF(E8=\"0\",0,$G$2)","v":0},{"$f":"IMPRIMIR!B7","v":0},{"$f":"IMPRIMIR!C7","v":0},{"$f":"IF(E8=0,0,IMPRIMIR!D7)","v":0},{"$f":"IF(E8=0,0,IMPRIMIR!E7)","v":0},{"$f":"IF(E8=0,0,$G$2)","v":0},{"$f":"IF(E8=0,0,$G$4)","v":0},{"$f":"IF(E8=0,0,$G$3)","v":0}]
[null,{"$f":"IF(E9=0,0,IMPRIMIR!A8)","v":0},{"$f":"IF(E9=0,0,IMPRIMIR!$D$3)","v":0},{"$f":"IF(E9=\"0\",0,$G$2)","v":0},{"$f":"IMPRIMIR!B8","v":0},{"$f":"IMPRIMIR!C8","v":0},{"$f":"IF(E9=0,0,IMPRIMIR!D8)","v":0},{"$f":"IF(E9=0,0,IMPRIMIR!E8)","v":0},{"$f":"IF(E9=0,0,$G$2)","v":0},{"$f":"IF(E9=0,0,$G$4)","v":0},{"$f":"IF(E9=0,0,$G$3)","v":0}]
[null,{"$f":"IF(E10=0,0,IMPRIMIR!A9)","v":0},{"$f":"IF(E10=0,0,IMPRIMIR!$D$3)","v":0},0,{"$f":"IMPRIMIR!B9","v":0},{"$f":"IMPRIMIR!C9","v":0},{"$f":"IF(E10=0,0,IMPRIMIR!D9)","v":0},{"$f":"IF(E10=0,0,IMPRIMIR!E9)","v":0},0,0,0]
[null,{"$f":"IF(E11=0,0,IMPRIMIR!A10)","v":0},{"$f":"IF(E11=0,0,IMPRIMIR!$D$3)","v":0},0,{"$f":"IMPRIMIR!B10","v":0},{"$f":"IMPRIMIR!C10","v":0},{"$f":"IF(E11=0,0,IMPRIMIR!D10)","v":0},{"$f":"IF(E11=0,0,IMPRIMIR!E10)","v":0},0,0,0]
[null,{"$f":"IF(E12=0,0,IMPRIMIR!A11)","v":0},{"$f":"IF(E12=0,0,IMPRIMIR!$D$3)","v":0},0,{"$f":"IMPRIMIR!B11","v":0},{"$f":"IMPRIMIR!C11","v":0},{"$f":"IF(E12=0,0,IMPRIMIR!D11)","v":0},{"$f":"IF(E12=0,0,IMPRIMIR!E11)","v":0},0,0,0]
[null,{"$f":"IF(E13=0,0,IMPRIMIR!A12)","v":0},{"$f":"IF(E13=0,0,IMPRIMIR!$D$3)","v":0},0,{"$f":"IMPRIMIR!B12","v":0},{"$f":"IMPRIMIR!C12","v":0},{"$f":"IF(E13=0,0,IMPRIMIR!D12)","v":0},{"$f":"IF(E13=0,0,IMPRIMIR!E12)","v":0},0,0,0]
[null,{"$f":"IF(E14=0,0,IMPRIMIR!A13)","v":0},{"$f":"IF(E14=0,0,IMPRIMIR!$D$3)","v":0},0,{"$f":"IMPRIMIR!B13","v":0},{"$f":"IMPRIMIR!C13","v":0},{"$f":"IF(E14=0,0,IMPRIMIR!D13)","v":0},{"$f":"IF(E14=0,0,IMPRIMIR!E13)","v":0},0,0,0]
[null,{"$f":"IF(E15=0,0,IMPRIMIR!A14)","v":0},{"$f":"IF(E15=0,0,IMPRIMIR!$D$3)","v":0},0,{"$f":"IMPRIMIR!B14","v":0},{"$f":"IMPRIMIR!C14","v":0},{"$f":"IF(E15=0,0,IMPRIMIR!D14)","v":0},{"$f":"IF(E15=0,0,IMPRIMIR!E14)","v":0},0,0,0]
[null,{"$f":"IF(E16=0,0,IMPRIMIR!A15)","v":"ba FIDEICOMISO"},{"$f":"IF(E16=0,0,IMPRIMIR!$D$3)","v":0},0,{"$f":"IMPRIMIR!B15","v":"0"},{"$f":"IMPRIMIR!C15","v":"0"},{"$f":"IF(E16=0,0,IMPRIMIR!D15)","v":"CEL/TEL (de administración) -en su caso indicar que no posee-:"},{"$f":"IF(E16=0,0,IMPRIMIR!E15)","v":"INCOMPLETO RECHAZAR"},0,0,0]
[null,{"$f":"IF(E17=0,0,IMPRIMIR!A16)","v":"ba FIDEICOMISO"},{"$f":"IF(E17=0,0,IMPRIMIR!$D$3)","v":0},0,{"$f":"IMPRIMIR!B16","v":"0"},{"$f":"IMPRIMIR!C16","v":"0"},{"$f":"IF(E17=0,0,IMPRIMIR!D16)","v":"EMAIL (de administración)  -en su caso indicar que no posee-:"},{"$f":"IF(E17=0,0,IMPRIMIR!E16)","v":"INCOMPLETO RECHAZAR"},0,0,0]
[null,{"$f":"IF(E18=0,0,IMPRIMIR!A17)","v":"ba FIDEICOMISO"},{"$f":"IF(E18=0,0,IMPRIMIR!$D$3)","v":0},0,{"$f":"IMPRIMIR!B17","v":"0"},{"$f":"IMPRIMIR!C17","v":"0"},{"$f":"IF(E18=0,0,IMPRIMIR!D17)","v":"DIRECCION domicilio legal:"},{"$f":"IF(E18=0,0,IMPRIMIR!E17)","v":"INCOMPLETO RECHAZAR"},0,0,0]
[null,{"$f":"IF(E19=0,0,IMPRIMIR!A18)","v":"ba FIDEICOMISO"},{"$f":"IF(E19=0,0,IMPRIMIR!$D$3)","v":0},0,{"$f":"IMPRIMIR!B18","v":"0"},{"$f":"IMPRIMIR!C18","v":"0"},{"$f":"IF(E19=0,0,IMPRIMIR!D18)","v":"CUIT –sin puntos ni barras-:"},{"$f":"IF(E19=0,0,IMPRIMIR!E18)","v":"INCOMPLETO RECHAZAR"},0,0,0]
[null,{"$f":"IF(E20=0,0,IMPRIMIR!A19)","v":"ba FIDEICOMISO"},{"$f":"IF(E20=0,0,IMPRIMIR!$D$3)","v":0},0,{"$f":"IMPRIMIR!B19","v":"0"},{"$f":"IMPRIMIR!C19","v":"0"},{"$f":"IF(E20=0,0,IMPRIMIR!D19)","v":"FECHA DE INICIO DEL CONTRATO:"},{"$f":"IF(E20=0,0,IMPRIMIR!E19)","v":"INCOMPLETO RECHAZAR"},0,0,0]
[null,{"$f":"IF(E21=0,0,IMPRIMIR!A20)","v":0},{"$f":"IF(E21=0,0,IMPRIMIR!$D$3)","v":0},0,{"$f":"IMPRIMIR!B20","v":0},{"$f":"IMPRIMIR!C20","v":0},{"$f":"IF(E21=0,0,IMPRIMIR!D20)","v":0},{"$f":"IF(E21=0,0,IMPRIMIR!E20)","v":0},0,0,0]
[null,{"$f":"IF(E22=0,0,IMPRIMIR!A21)","v":0},{"$f":"IF(E22=0,0,IMPRIMIR!$D$3)","v":0},0,{"$f":"IMPRIMIR!B21","v":0},{"$f":"IMPRIMIR!C21","v":0},{"$f":"IF(E22=0,0,IMPRIMIR!D21)","v":0},{"$f":"IF(E22=0,0,IMPRIMIR!E21)","v":0},0,0,0]
[null,{"$f":"IF(E23=0,0,IMPRIMIR!A22)","v":0},{"$f":"IF(E23=0,0,IMPRIMIR!$D$3)","v":0},0,{"$f":"IMPRIMIR!B22","v":0},{"$f":"IMPRIMIR!C22","v":0},{"$f":"IF(E23=0,0,IMPRIMIR!D22)","v":0},{"$f":"IF(E23=0,0,IMPRIMIR!E22)","v":0},0,0,0]
[null,{"$f":"IF(E24=0,0,IMPRIMIR!A23)","v":0},{"$f":"IF(E24=0,0,IMPRIMIR!$D$3)","v":0},0,{"$f":"IMPRIMIR!B23","v":0},{"$f":"IMPRIMIR!C23","v":0},{"$f":"IF(E24=0,0,IMPRIMIR!D23)","v":0},{"$f":"IF(E24=0,0,IMPRIMIR!E23)","v":0},0,0,0]
[null,{"$f":"IF(E25=0,0,IMPRIMIR!A24)","v":0},{"$f":"IF(E25=0,0,IMPRIMIR!$D$3)","v":0},0,{"$f":"IMPRIMIR!B24","v":0},{"$f":"IMPRIMIR!C24","v":0},{"$f":"IF(E25=0,0,IMPRIMIR!D24)","v":0},{"$f":"IF(E25=0,0,IMPRIMIR!E24)","v":0},0,0,0]
[null,{"$f":"IF(E26=0,0,IMPRIMIR!A25)","v":0},{"$f":"IF(E26=0,0,IMPRIMIR!$D$3)","v":0},0,{"$f":"IMPRIMIR!B25","v":0},{"$f":"IMPRIMIR!C25","v":0},{"$f":"IF(E26=0,0,IMPRIMIR!D25)","v":0},{"$f":"IF(E26=0,0,IMPRIMIR!E25)","v":0},0,0,0]
[null,{"$f":"IF(E27=0,0,IMPRIMIR!A26)","v":0},{"$f":"IF(E27=0,0,IMPRIMIR!$D$3)","v":0},0,{"$f":"IMPRIMIR!B26","v":0},{"$f":"IMPRIMIR!C26","v":0},{"$f":"IF(E27=0,0,IMPRIMIR!D26)","v":0},{"$f":"IF(E27=0,0,IMPRIMIR!E26)","v":0},0,0,0]
[null,{"$f":"IF(E28=0,0,IMPRIMIR!A27)","v":0},{"$f":"IF(E28=0,0,IMPRIMIR!$D$3)","v":0},0,{"$f":"IMPRIMIR!B27","v":0},{"$f":"IMPRIMIR!C27","v":0},{"$f":"IF(E28=0,0,IMPRIMIR!D27)","v":0},{"$f":"IF(E28=0,0,IMPRIMIR!E27)","v":0},0,0,0]
[null,{"$f":"IF(E29=0,0,IMPRIMIR!A28)","v":0},{"$f":"IF(E29=0,0,IMPRIMIR!$D$3)","v":0},0,{"$f":"IMPRIMIR!B28","v":0},{"$f":"IMPRIMIR!C28","v":0},{"$f":"IF(E29=0,0,IMPRIMIR!D28)","v":0},{"$f":"IF(E29=0,0,IMPRIMIR!E28)","v":0},0,0,0]
[null,{"$f":"IF(E30=0,0,IMPRIMIR!A29)","v":0},{"$f":"IF(E30=0,0,IMPRIMIR!$D$3)","v":0},0,{"$f":"IMPRIMIR!B29","v":0},{"$f":"IMPRIMIR!C29","v":0},{"$f":"IF(E30=0,0,IMPRIMIR!D29)","v":0},{"$f":"IF(E30=0,0,IMPRIMIR!E29)","v":0},0,0,0]
[null,{"$f":"IF(E31=0,0,IMPRIMIR!A30)","v":0},{"$f":"IF(E31=0,0,IMPRIMIR!$D$3)","v":0},0,{"$f":"IMPRIMIR!B30","v":0},{"$f":"IMPRIMIR!C30","v":0},{"$f":"IF(E31=0,0,IMPRIMIR!D30)","v":0},{"$f":"IF(E31=0,0,IMPRIMIR!E30)","v":0},0,0,0]
[null,{"$f":"IF(E32=0,0,IMPRIMIR!A31)","v":0},{"$f":"IF(E32=0,0,IMPRIMIR!$D$3)","v":0},0,{"$f":"IMPRIMIR!B31","v":0},{"$f":"IMPRIMIR!C31","v":0},{"$f":"IF(E32=0,0,IMPRIMIR!D31)","v":0},{"$f":"IF(E32=0,0,IMPRIMIR!E31)","v":0},0,0,0]
[null,{"$f":"IF(E33=0,0,IMPRIMIR!A32)","v":0},{"$f":"IF(E33=0,0,IMPRIMIR!$D$3)","v":0},0,{"$f":"IMPRIMIR!B32","v":0},{"$f":"IMPRIMIR!C32","v":0},{"$f":"IF(E33=0,0,IMPRIMIR!D32)","v":0},{"$f":"IF(E33=0,0,IMPRIMIR!E32)","v":0},0,0,0]
[null,{"$f":"IF(E34=0,0,IMPRIMIR!A33)","v":0},{"$f":"IF(E34=0,0,IMPRIMIR!$D$3)","v":0},0,{"$f":"IMPRIMIR!B33","v":0},{"$f":"IMPRIMIR!C33","v":0},{"$f":"IF(E34=0,0,IMPRIMIR!D33)","v":0},{"$f":"IF(E34=0,0,IMPRIMIR!E33)","v":0},0,0,0]
[null,{"$f":"IF(E35=0,0,IMPRIMIR!A34)","v":0},{"$f":"IF(E35=0,0,IMPRIMIR!$D$3)","v":0},0,{"$f":"IMPRIMIR!B34","v":0},{"$f":"IMPRIMIR!C34","v":0},{"$f":"IF(E35=0,0,IMPRIMIR!D34)","v":0},{"$f":"IF(E35=0,0,IMPRIMIR!E34)","v":0},0,0,0]
[null,{"$f":"IF(E36=0,0,IMPRIMIR!A35)","v":0},{"$f":"IF(E36=0,0,IMPRIMIR!$D$3)","v":0},0,{"$f":"IMPRIMIR!B35","v":0},{"$f":"IMPRIMIR!C35","v":0},{"$f":"IF(E36=0,0,IMPRIMIR!D35)","v":0},{"$f":"IF(E36=0,0,IMPRIMIR!E35)","v":0},0,0,0]
[null,{"$f":"IF(E37=0,0,IMPRIMIR!A36)","v":0},{"$f":"IF(E37=0,0,IMPRIMIR!$D$3)","v":0},0,{"$f":"IMPRIMIR!B36","v":0},{"$f":"IMPRIMIR!C36","v":0},{"$f":"IF(E37=0,0,IMPRIMIR!D36)","v":0},{"$f":"IF(E37=0,0,IMPRIMIR!E36)","v":0},0,0,0]
[null,{"$f":"IF(E38=0,0,IMPRIMIR!A37)","v":0},{"$f":"IF(E38=0,0,IMPRIMIR!$D$3)","v":0},0,{"$f":"IMPRIMIR!B37","v":0},{"$f":"IMPRIMIR!C37","v":0},{"$f":"IF(E38=0,0,IMPRIMIR!D37)","v":0},{"$f":"IF(E38=0,0,IMPRIMIR!E37)","v":0},0,0,0]
[null,{"$f":"IF(E39=0,0,IMPRIMIR!A38)","v":0},{"$f":"IF(E39=0,0,IMPRIMIR!$D$3)","v":0},0,{"$f":"IMPRIMIR!B38","v":0},{"$f":"IMPRIMIR!C38","v":0},{"$f":"IF(E39=0,0,IMPRIMIR!D38)","v":0},{"$f":"IF(E39=0,0,IMPRIMIR!E38)","v":0},0,0,0]
[null,{"$f":"IF(E40=0,0,IMPRIMIR!A39)","v":0},{"$f":"IF(E40=0,0,IMPRIMIR!$D$3)","v":0},0,{"$f":"IMPRIMIR!B39","v":0},{"$f":"IMPRIMIR!C39","v":0},{"$f":"IF(E40=0,0,IMPRIMIR!D39)","v":0},{"$f":"IF(E40=0,0,IMPRIMIR!E39)","v":0},0,0,0]
[null,{"$f":"IF(E41=0,0,IMPRIMIR!A40)","v":0},{"$f":"IF(E41=0,0,IMPRIMIR!$D$3)","v":0},0,{"$f":"IMPRIMIR!B40","v":0},{"$f":"IMPRIMIR!C40","v":0},{"$f":"IF(E41=0,0,IMPRIMIR!D40)","v":0},{"$f":"IF(E41=0,0,IMPRIMIR!E40)","v":0},0,0,0]
[null,{"$f":"IF(E42=0,0,IMPRIMIR!A41)","v":0},{"$f":"IF(E42=0,0,IMPRIMIR!$D$3)","v":0},0,{"$f":"IMPRIMIR!B41","v":0},{"$f":"IMPRIMIR!C41","v":0},{"$f":"IF(E42=0,0,IMPRIMIR!D41)","v":0},{"$f":"IF(E42=0,0,IMPRIMIR!E41)","v":0},0,0,0]
[null,{"$f":"IF(E43=0,0,IMPRIMIR!A42)","v":0},{"$f":"IF(E43=0,0,IMPRIMIR!$D$3)","v":0},0,{"$f":"IMPRIMIR!B42","v":0},{"$f":"IMPRIMIR!C42","v":0},{"$f":"IF(E43=0,0,IMPRIMIR!D42)","v":0},{"$f":"IF(E43=0,0,IMPRIMIR!E42)","v":0},0,0,0]
[null,{"$f":"IF(E44=0,0,IMPRIMIR!A43)","v":0},{"$f":"IF(E44=0,0,IMPRIMIR!$D$3)","v":0},0,{"$f":"IMPRIMIR!B43","v":0},{"$f":"IMPRIMIR!C43","v":0},{"$f":"IF(E44=0,0,IMPRIMIR!D43)","v":0},{"$f":"IF(E44=0,0,IMPRIMIR!E43)","v":0},0,0,0]
[null,{"$f":"IF(E45=0,0,IMPRIMIR!A44)","v":0},{"$f":"IF(E45=0,0,IMPRIMIR!$D$3)","v":0},0,{"$f":"IMPRIMIR!B44","v":0},{"$f":"IMPRIMIR!C44","v":0},{"$f":"IF(E45=0,0,IMPRIMIR!D44)","v":0},{"$f":"IF(E45=0,0,IMPRIMIR!E44)","v":0},0,0,0]
[null,{"$f":"IF(E46=0,0,IMPRIMIR!A45)","v":0},{"$f":"IF(E46=0,0,IMPRIMIR!$D$3)","v":0},0,{"$f":"IMPRIMIR!B45","v":0},{"$f":"IMPRIMIR!C45","v":0},{"$f":"IF(E46=0,0,IMPRIMIR!D45)","v":0},{"$f":"IF(E46=0,0,IMPRIMIR!E45)","v":0},0,0,0]
[null,{"$f":"IF(E47=0,0,IMPRIMIR!A46)","v":0},{"$f":"IF(E47=0,0,IMPRIMIR!$D$3)","v":0},0,{"$f":"IMPRIMIR!B46","v":0},{"$f":"IMPRIMIR!C46","v":0},{"$f":"IF(E47=0,0,IMPRIMIR!D46)","v":0},{"$f":"IF(E47=0,0,IMPRIMIR!E46)","v":0},0,0,0]
[null,{"$f":"IF(E48=0,0,IMPRIMIR!A47)","v":0},{"$f":"IF(E48=0,0,IMPRIMIR!$D$3)","v":0},0,{"$f":"IMPRIMIR!B47","v":0},{"$f":"IMPRIMIR!C47","v":0},{"$f":"IF(E48=0,0,IMPRIMIR!D47)","v":0},{"$f":"IF(E48=0,0,IMPRIMIR!E47)","v":0},0,0,0]
[null,{"$f":"IF(E49=0,0,IMPRIMIR!A48)","v":0},{"$f":"IF(E49=0,0,IMPRIMIR!$D$3)","v":0},0,{"$f":"IMPRIMIR!B48","v":0},{"$f":"IMPRIMIR!C48","v":0},{"$f":"IF(E49=0,0,IMPRIMIR!D48)","v":0},{"$f":"IF(E49=0,0,IMPRIMIR!E48)","v":0},0,0,0]
[null,{"$f":"IF(E50=0,0,IMPRIMIR!A49)","v":0},{"$f":"IF(E50=0,0,IMPRIMIR!$D$3)","v":0},0,{"$f":"IMPRIMIR!B49","v":0},{"$f":"IMPRIMIR!C49","v":0},{"$f":"IF(E50=0,0,IMPRIMIR!D49)","v":0},{"$f":"IF(E50=0,0,IMPRIMIR!E49)","v":0},0,0,0]
[null,{"$f":"IF(E51=0,0,IMPRIMIR!A50)","v":0},{"$f":"IF(E51=0,0,IMPRIMIR!$D$3)","v":0},0,{"$f":"IMPRIMIR!B50","v":0},{"$f":"IMPRIMIR!C50","v":0},{"$f":"IF(E51=0,0,IMPRIMIR!D50)","v":0},{"$f":"IF(E51=0,0,IMPRIMIR!E50)","v":0},0,0,0]
[null,{"$f":"IF(E52=0,0,IMPRIMIR!A51)","v":0},{"$f":"IF(E52=0,0,IMPRIMIR!$D$3)","v":0},0,{"$f":"IMPRIMIR!B51","v":0},{"$f":"IMPRIMIR!C51","v":0},{"$f":"IF(E52=0,0,IMPRIMIR!D51)","v":0},{"$f":"IF(E52=0,0,IMPRIMIR!E51)","v":0},0,0,0]
[null,{"$f":"IF(E53=0,0,IMPRIMIR!A52)","v":0},{"$f":"IF(E53=0,0,IMPRIMIR!$D$3)","v":0},0,{"$f":"IMPRIMIR!B52","v":0},{"$f":"IMPRIMIR!C52","v":0},{"$f":"IF(E53=0,0,IMPRIMIR!D52)","v":0},{"$f":"IF(E53=0,0,IMPRIMIR!E52)","v":0},0,0,0]
[null,{"$f":"IF(E54=0,0,IMPRIMIR!A53)","v":0},{"$f":"IF(E54=0,0,IMPRIMIR!$D$3)","v":0},0,{"$f":"IMPRIMIR!B53","v":0},{"$f":"IMPRIMIR!C53","v":0},{"$f":"IF(E54=0,0,IMPRIMIR!D53)","v":0},{"$f":"IF(E54=0,0,IMPRIMIR!E53)","v":0},0,0,0]
[null,{"$f":"IF(E55=0,0,IMPRIMIR!A54)","v":0},{"$f":"IF(E55=0,0,IMPRIMIR!$D$3)","v":0},0,{"$f":"IMPRIMIR!B54","v":0},{"$f":"IMPRIMIR!C54","v":0},{"$f":"IF(E55=0,0,IMPRIMIR!D54)","v":0},{"$f":"IF(E55=0,0,IMPRIMIR!E54)","v":0},0,0,0]
[null,{"$f":"IF(E56=0,0,IMPRIMIR!A55)","v":0},{"$f":"IF(E56=0,0,IMPRIMIR!$D$3)","v":0},0,{"$f":"IMPRIMIR!B55","v":0},{"$f":"IMPRIMIR!C55","v":0},{"$f":"IF(E56=0,0,IMPRIMIR!D55)","v":0},{"$f":"IF(E56=0,0,IMPRIMIR!E55)","v":0},0,0,0]
[null,{"$f":"IF(E57=0,0,IMPRIMIR!A56)","v":0},{"$f":"IF(E57=0,0,IMPRIMIR!$D$3)","v":0},0,{"$f":"IMPRIMIR!B56","v":0},{"$f":"IMPRIMIR!C56","v":0},{"$f":"IF(E57=0,0,IMPRIMIR!D56)","v":0},{"$f":"IF(E57=0,0,IMPRIMIR!E56)","v":0},0,0,0]
[null,{"$f":"IF(E58=0,0,IMPRIMIR!A57)","v":0},{"$f":"IF(E58=0,0,IMPRIMIR!$D$3)","v":0},0,{"$f":"IMPRIMIR!B57","v":0},{"$f":"IMPRIMIR!C57","v":0},{"$f":"IF(E58=0,0,IMPRIMIR!D57)","v":0},{"$f":"IF(E58=0,0,IMPRIMIR!E57)","v":0},0,0,0]
[null,{"$f":"IF(E59=0,0,IMPRIMIR!A58)","v":0},{"$f":"IF(E59=0,0,IMPRIMIR!$D$3)","v":0},0,{"$f":"IMPRIMIR!B58","v":0},{"$f":"IMPRIMIR!C58","v":0},{"$f":"IF(E59=0,0,IMPRIMIR!D58)","v":0},{"$f":"IF(E59=0,0,IMPRIMIR!E58)","v":0},0,0,0]
[null,{"$f":"IF(E60=0,0,IMPRIMIR!A59)","v":0},{"$f":"IF(E60=0,0,IMPRIMIR!$D$3)","v":0},0,{"$f":"IMPRIMIR!B59","v":0},{"$f":"IMPRIMIR!C59","v":0},{"$f":"IF(E60=0,0,IMPRIMIR!D59)","v":0},{"$f":"IF(E60=0,0,IMPRIMIR!E59)","v":0},0,0,0]
[null,{"$f":"IF(E61=0,0,IMPRIMIR!A60)","v":0},{"$f":"IF(E61=0,0,IMPRIMIR!$D$3)","v":0},0,{"$f":"IMPRIMIR!B60","v":0},{"$f":"IMPRIMIR!C60","v":0},{"$f":"IF(E61=0,0,IMPRIMIR!D60)","v":0},{"$f":"IF(E61=0,0,IMPRIMIR!E60)","v":0},0,0,0]
[null,{"$f":"IF(E62=0,0,IMPRIMIR!A61)","v":0},{"$f":"IF(E62=0,0,IMPRIMIR!$D$3)","v":0},0,{"$f":"IMPRIMIR!B61","v":0},{"$f":"IMPRIMIR!C61","v":0},{"$f":"IF(E62=0,0,IMPRIMIR!D61)","v":0},{"$f":"IF(E62=0,0,IMPRIMIR!E61)","v":0},0,0,0]
[null,{"$f":"IF(E63=0,0,IMPRIMIR!A62)","v":0},{"$f":"IF(E63=0,0,IMPRIMIR!$D$3)","v":0},0,{"$f":"IMPRIMIR!B62","v":0},{"$f":"IMPRIMIR!C62","v":0},{"$f":"IF(E63=0,0,IMPRIMIR!D62)","v":0},{"$f":"IF(E63=0,0,IMPRIMIR!E62)","v":0},0,0,0]
[null,{"$f":"IF(E64=0,0,IMPRIMIR!A63)","v":0},{"$f":"IF(E64=0,0,IMPRIMIR!$D$3)","v":0},0,{"$f":"IMPRIMIR!B63","v":0},{"$f":"IMPRIMIR!C63","v":0},{"$f":"IF(E64=0,0,IMPRIMIR!D63)","v":0},{"$f":"IF(E64=0,0,IMPRIMIR!E63)","v":0},0,0,0]
[null,{"$f":"IF(E65=0,0,IMPRIMIR!A64)","v":0},{"$f":"IF(E65=0,0,IMPRIMIR!$D$3)","v":0},0,{"$f":"IMPRIMIR!B64","v":0},{"$f":"IMPRIMIR!C64","v":0},{"$f":"IF(E65=0,0,IMPRIMIR!D64)","v":0},{"$f":"IF(E65=0,0,IMPRIMIR!E64)","v":0},0,0,0]
[null,{"$f":"IF(E66=0,0,IMPRIMIR!A65)","v":0},{"$f":"IF(E66=0,0,IMPRIMIR!$D$3)","v":0},0,{"$f":"IMPRIMIR!B65","v":0},{"$f":"IMPRIMIR!C65","v":0},{"$f":"IF(E66=0,0,IMPRIMIR!D65)","v":0},{"$f":"IF(E66=0,0,IMPRIMIR!E65)","v":0},0,0,0]
[null,{"$f":"IF(E67=0,0,IMPRIMIR!A66)","v":0},{"$f":"IF(E67=0,0,IMPRIMIR!$D$3)","v":0},0,{"$f":"IMPRIMIR!B66","v":0},{"$f":"IMPRIMIR!C66","v":0},{"$f":"IF(E67=0,0,IMPRIMIR!D66)","v":0},{"$f":"IF(E67=0,0,IMPRIMIR!E66)","v":0},0,0,0]
[null,{"$f":"IF(E68=0,0,IMPRIMIR!A67)","v":0},{"$f":"IF(E68=0,0,IMPRIMIR!$D$3)","v":0},0,{"$f":"IMPRIMIR!B67","v":0},{"$f":"IMPRIMIR!C67","v":0},{"$f":"IF(E68=0,0,IMPRIMIR!D67)","v":0},{"$f":"IF(E68=0,0,IMPRIMIR!E67)","v":0},0,0,0]
[null,{"$f":"IF(E69=0,0,IMPRIMIR!A68)","v":0},{"$f":"IF(E69=0,0,IMPRIMIR!$D$3)","v":0},0,{"$f":"IMPRIMIR!B68","v":0},{"$f":"IMPRIMIR!C68","v":0},{"$f":"IF(E69=0,0,IMPRIMIR!D68)","v":0},{"$f":"IF(E69=0,0,IMPRIMIR!E68)","v":0},0,0,0]
[null,{"$f":"IF(E70=0,0,IMPRIMIR!A69)","v":0},{"$f":"IF(E70=0,0,IMPRIMIR!$D$3)","v":0},0,{"$f":"IMPRIMIR!B69","v":0},{"$f":"IMPRIMIR!C69","v":0},{"$f":"IF(E70=0,0,IMPRIMIR!D69)","v":0},{"$f":"IF(E70=0,0,IMPRIMIR!E69)","v":0},0,0,0]
[null,{"$f":"IF(E71=0,0,IMPRIMIR!A70)","v":0},{"$f":"IF(E71=0,0,IMPRIMIR!$D$3)","v":0},0,{"$f":"IMPRIMIR!B70","v":0},{"$f":"IMPRIMIR!C70","v":0},{"$f":"IF(E71=0,0,IMPRIMIR!D70)","v":0},{"$f":"IF(E71=0,0,IMPRIMIR!E70)","v":0},0,0,0]
[null,{"$f":"IF(E72=0,0,IMPRIMIR!A71)","v":0},{"$f":"IF(E72=0,0,IMPRIMIR!$D$3)","v":0},0,{"$f":"IMPRIMIR!B71","v":0},{"$f":"IMPRIMIR!C71","v":0},{"$f":"IF(E72=0,0,IMPRIMIR!D71)","v":0},{"$f":"IF(E72=0,0,IMPRIMIR!E71)","v":0},0,0,0]
[null,{"$f":"IF(E73=0,0,IMPRIMIR!A72)","v":0},{"$f":"IF(E73=0,0,IMPRIMIR!$D$3)","v":0},{"$f":"IF(E73=\"0\",0,$G$2)","v":0},{"$f":"IMPRIMIR!B72","v":0},{"$f":"IMPRIMIR!C72","v":0},{"$f":"IF(E73=0,0,IMPRIMIR!D72)","v":0},{"$f":"IF(E73=0,0,IMPRIMIR!E72)","v":0},{"$f":"IF(E73=0,0,$G$2)","v":0},{"$f":"IF(E73=0,0,$G$4)","v":0},{"$f":"IF(E73=0,0,$G$3)","v":0}]
[null,{"$f":"IF(E74=0,0,IMPRIMIR!A73)","v":0},{"$f":"IF(E74=0,0,IMPRIMIR!$D$3)","v":0},0,{"$f":"IMPRIMIR!B73","v":0},{"$f":"IMPRIMIR!C73","v":0},{"$f":"IF(E74=0,0,IMPRIMIR!D73)","v":0},{"$f":"IF(E74=0,0,IMPRIMIR!E73)","v":0},0,0,0]
[null,{"$f":"IF(E75=0,0,IMPRIMIR!A74)","v":0},{"$f":"IF(E75=0,0,IMPRIMIR!$D$3)","v":0},0,{"$f":"IMPRIMIR!B74","v":0},{"$f":"IMPRIMIR!C74","v":0},{"$f":"IF(E75=0,0,IMPRIMIR!D74)","v":0},{"$f":"IF(E75=0,0,IMPRIMIR!E74)","v":0},0,0,0]
[null,{"$f":"IF(E76=0,0,IMPRIMIR!A75)","v":0},{"$f":"IF(E76=0,0,IMPRIMIR!$D$3)","v":0},0,{"$f":"IMPRIMIR!B75","v":0},{"$f":"IMPRIMIR!C75","v":0},{"$f":"IF(E76=0,0,IMPRIMIR!D75)","v":0},{"$f":"IF(E76=0,0,IMPRIMIR!E75)","v":0},0,0,0]
[null,{"$f":"IF(E77=0,0,IMPRIMIR!A76)","v":0},{"$f":"IF(E77=0,0,IMPRIMIR!$D$3)","v":0},0,{"$f":"IMPRIMIR!B76","v":0},{"$f":"IMPRIMIR!C76","v":0},{"$f":"IF(E77=0,0,IMPRIMIR!D76)","v":0},{"$f":"IF(E77=0,0,IMPRIMIR!E76)","v":0},0,0,0]
[null,{"$f":"IF(E78=0,0,IMPRIMIR!A77)","v":0},{"$f":"IF(E78=0,0,IMPRIMIR!$D$3)","v":0},0,{"$f":"IMPRIMIR!B77","v":0},{"$f":"IMPRIMIR!C77","v":0},{"$f":"IF(E78=0,0,IMPRIMIR!D77)","v":0},{"$f":"IF(E78=0,0,IMPRIMIR!E77)","v":0},0,0,0]
[null,{"$f":"IF(E79=0,0,IMPRIMIR!A78)","v":0},{"$f":"IF(E79=0,0,IMPRIMIR!$D$3)","v":0},0,{"$f":"IMPRIMIR!B78","v":0},{"$f":"IMPRIMIR!C78","v":0},{"$f":"IF(E79=0,0,IMPRIMIR!D78)","v":0},{"$f":"IF(E79=0,0,IMPRIMIR!E78)","v":0},0,0,0]
[null,{"$f":"IF(E80=0,0,IMPRIMIR!A79)","v":0},{"$f":"IF(E80=0,0,IMPRIMIR!$D$3)","v":0},0,{"$f":"IMPRIMIR!B79","v":0},{"$f":"IMPRIMIR!C79","v":0},{"$f":"IF(E80=0,0,IMPRIMIR!D79)","v":0},{"$f":"IF(E80=0,0,IMPRIMIR!E79)","v":0},0,0,0]
[null,{"$f":"IF(E81=0,0,IMPRIMIR!A80)","v":0},{"$f":"IF(E81=0,0,IMPRIMIR!$D$3)","v":0},0,{"$f":"IMPRIMIR!B80","v":0},{"$f":"IMPRIMIR!C80","v":0},{"$f":"IF(E81=0,0,IMPRIMIR!D80)","v":0},{"$f":"IF(E81=0,0,IMPRIMIR!E80)","v":0},0,0,0]
[null,{"$f":"IF(E82=0,0,IMPRIMIR!A81)","v":0},{"$f":"IF(E82=0,0,IMPRIMIR!$D$3)","v":0},0,{"$f":"IMPRIMIR!B81","v":0},{"$f":"IMPRIMIR!C81","v":0},{"$f":"IF(E82=0,0,IMPRIMIR!D81)","v":0},{"$f":"IF(E82=0,0,IMPRIMIR!E81)","v":0},0,0,0]
[null,{"$f":"IF(E83=0,0,IMPRIMIR!A82)","v":0},{"$f":"IF(E83=0,0,IMPRIMIR!$D$3)","v":0},0,{"$f":"IMPRIMIR!B82","v":0},{"$f":"IMPRIMIR!C82","v":0},{"$f":"IF(E83=0,0,IMPRIMIR!D82)","v":0},{"$f":"IF(E83=0,0,IMPRIMIR!E82)","v":0},0,0,0]
[null,{"$f":"IF(E84=0,0,IMPRIMIR!A83)","v":0},{"$f":"IF(E84=0,0,IMPRIMIR!$D$3)","v":0},0,{"$f":"IMPRIMIR!B83","v":0},{"$f":"IMPRIMIR!C83","v":0},{"$f":"IF(E84=0,0,IMPRIMIR!D83)","v":0},{"$f":"IF(E84=0,0,IMPRIMIR!E83)","v":0},0,0,0]
[null,{"$f":"IF(E85=0,0,IMPRIMIR!A84)","v":0},{"$f":"IF(E85=0,0,IMPRIMIR!$D$3)","v":0},0,{"$f":"IMPRIMIR!B84","v":0},{"$f":"IMPRIMIR!C84","v":0},{"$f":"IF(E85=0,0,IMPRIMIR!D84)","v":0},{"$f":"IF(E85=0,0,IMPRIMIR!E84)","v":0},0,0,0]
[null,{"$f":"IF(E86=0,0,IMPRIMIR!A85)","v":0},{"$f":"IF(E86=0,0,IMPRIMIR!$D$3)","v":0},0,{"$f":"IMPRIMIR!B85","v":0},{"$f":"IMPRIMIR!C85","v":0},{"$f":"IF(E86=0,0,IMPRIMIR!D85)","v":0},{"$f":"IF(E86=0,0,IMPRIMIR!E85)","v":0},0,0,0]
[null,{"$f":"IF(E87=0,0,IMPRIMIR!A86)","v":0},{"$f":"IF(E87=0,0,IMPRIMIR!$D$3)","v":0},0,{"$f":"IMPRIMIR!B86","v":0},{"$f":"IMPRIMIR!C86","v":0},{"$f":"IF(E87=0,0,IMPRIMIR!D86)","v":0},{"$f":"IF(E87=0,0,IMPRIMIR!E86)","v":0},0,0,0]
[null,{"$f":"IF(E88=0,0,IMPRIMIR!A87)","v":0},{"$f":"IF(E88=0,0,IMPRIMIR!$D$3)","v":0},0,{"$f":"IMPRIMIR!B87","v":0},{"$f":"IMPRIMIR!C87","v":0},{"$f":"IF(E88=0,0,IMPRIMIR!D87)","v":0},{"$f":"IF(E88=0,0,IMPRIMIR!E87)","v":0},0,0,0]
[null,{"$f":"IF(E89=0,0,IMPRIMIR!A88)","v":0},{"$f":"IF(E89=0,0,IMPRIMIR!$D$3)","v":0},0,{"$f":"IMPRIMIR!B88","v":0},{"$f":"IMPRIMIR!C88","v":0},{"$f":"IF(E89=0,0,IMPRIMIR!D88)","v":0},{"$f":"IF(E89=0,0,IMPRIMIR!E88)","v":0},0,0,0]
[null,{"$f":"IF(E90=0,0,IMPRIMIR!A89)","v":0},{"$f":"IF(E90=0,0,IMPRIMIR!$D$3)","v":0},0,{"$f":"IMPRIMIR!B89","v":0},{"$f":"IMPRIMIR!C89","v":0},{"$f":"IF(E90=0,0,IMPRIMIR!D89)","v":0},{"$f":"IF(E90=0,0,IMPRIMIR!E89)","v":0},0,0,0]
[null,{"$f":"IF(E91=0,0,IMPRIMIR!A90)","v":0},{"$f":"IF(E91=0,0,IMPRIMIR!$D$3)","v":0},0,{"$f":"IMPRIMIR!B90","v":0},{"$f":"IMPRIMIR!C90","v":0},{"$f":"IF(E91=0,0,IMPRIMIR!D90)","v":0},{"$f":"IF(E91=0,0,IMPRIMIR!E90)","v":0},0,0,0]
[null,{"$f":"IF(E92=0,0,IMPRIMIR!A91)","v":0},{"$f":"IF(E92=0,0,IMPRIMIR!$D$3)","v":0},0,{"$f":"IMPRIMIR!B91","v":0},{"$f":"IMPRIMIR!C91","v":0},{"$f":"IF(E92=0,0,IMPRIMIR!D91)","v":0},{"$f":"IF(E92=0,0,IMPRIMIR!E91)","v":0},0,0,0]
[null,{"$f":"IF(E93=0,0,IMPRIMIR!A92)","v":0},{"$f":"IF(E93=0,0,IMPRIMIR!$D$3)","v":0},0,{"$f":"IMPRIMIR!B92","v":0},{"$f":"IMPRIMIR!C92","v":0},{"$f":"IF(E93=0,0,IMPRIMIR!D92)","v":0},{"$f":"IF(E93=0,0,IMPRIMIR!E92)","v":0},0,0,0]
[null,{"$f":"IF(E94=0,0,IMPRIMIR!A93)","v":0},{"$f":"IF(E94=0,0,IMPRIMIR!$D$3)","v":0},0,{"$f":"IMPRIMIR!B93","v":0},{"$f":"IMPRIMIR!C93","v":0},{"$f":"IF(E94=0,0,IMPRIMIR!D93)","v":0},{"$f":"IF(E94=0,0,IMPRIMIR!E93)","v":0},0,0,0]
[null,{"$f":"IF(E95=0,0,IMPRIMIR!A94)","v":0},{"$f":"IF(E95=0,0,IMPRIMIR!$D$3)","v":0},0,{"$f":"IMPRIMIR!B94","v":0},{"$f":"IMPRIMIR!C94","v":0},{"$f":"IF(E95=0,0,IMPRIMIR!D94)","v":0},{"$f":"IF(E95=0,0,IMPRIMIR!E94)","v":0},0,0,0]
[null,{"$f":"IF(E96=0,0,IMPRIMIR!A95)","v":0},{"$f":"IF(E96=0,0,IMPRIMIR!$D$3)","v":0},0,{"$f":"IMPRIMIR!B95","v":0},{"$f":"IMPRIMIR!C95","v":0},{"$f":"IF(E96=0,0,IMPRIMIR!D95)","v":0},{"$f":"IF(E96=0,0,IMPRIMIR!E95)","v":0},0,0,0]
[null,{"$f":"IF(E97=0,0,IMPRIMIR!A96)","v":0},{"$f":"IF(E97=0,0,IMPRIMIR!$D$3)","v":0},0,{"$f":"IMPRIMIR!B96","v":0},{"$f":"IMPRIMIR!C96","v":0},{"$f":"IF(E97=0,0,IMPRIMIR!D96)","v":0},{"$f":"IF(E97=0,0,IMPRIMIR!E96)","v":0},0,0,0]
[null,{"$f":"IF(E98=0,0,IMPRIMIR!A97)","v":0},{"$f":"IF(E98=0,0,IMPRIMIR!$D$3)","v":0},0,{"$f":"IMPRIMIR!B97","v":0},{"$f":"IMPRIMIR!C97","v":0},{"$f":"IF(E98=0,0,IMPRIMIR!D97)","v":0},{"$f":"IF(E98=0,0,IMPRIMIR!E97)","v":0},0,0,0]
[null,{"$f":"IF(E99=0,0,IMPRIMIR!A98)","v":0},{"$f":"IF(E99=0,0,IMPRIMIR!$D$3)","v":0},0,{"$f":"IMPRIMIR!B98","v":0},{"$f":"IMPRIMIR!C98","v":0},{"$f":"IF(E99=0,0,IMPRIMIR!D98)","v":0},{"$f":"IF(E99=0,0,IMPRIMIR!E98)","v":0},0,0,0]
[null,{"$f":"IF(E100=0,0,IMPRIMIR!A99)","v":0},{"$f":"IF(E100=0,0,IMPRIMIR!$D$3)","v":0},0,{"$f":"IMPRIMIR!B99","v":0},{"$f":"IMPRIMIR!C99","v":0},{"$f":"IF(E100=0,0,IMPRIMIR!D99)","v":0},{"$f":"IF(E100=0,0,IMPRIMIR!E99)","v":0},0,0,0]
[null,{"$f":"IF(E101=0,0,IMPRIMIR!A100)","v":0},{"$f":"IF(E101=0,0,IMPRIMIR!$D$3)","v":0},0,{"$f":"IMPRIMIR!B100","v":0},{"$f":"IMPRIMIR!C100","v":0},{"$f":"IF(E101=0,0,IMPRIMIR!D100)","v":0},{"$f":"IF(E101=0,0,IMPRIMIR!E100)","v":0},0,0,0]
[null,{"$f":"IF(E102=0,0,IMPRIMIR!A101)","v":0},{"$f":"IF(E102=0,0,IMPRIMIR!$D$3)","v":0},0,{"$f":"IMPRIMIR!B101","v":0},{"$f":"IMPRIMIR!C101","v":0},{"$f":"IF(E102=0,0,IMPRIMIR!D101)","v":0},{"$f":"IF(E102=0,0,IMPRIMIR!E101)","v":0},0,0,0]
[null,{"$f":"IF(E103=0,0,IMPRIMIR!A102)","v":0},{"$f":"IF(E103=0,0,IMPRIMIR!$D$3)","v":0},0,{"$f":"IMPRIMIR!B102","v":0},{"$f":"IMPRIMIR!C102","v":0},{"$f":"IF(E103=0,0,IMPRIMIR!D102)","v":0},{"$f":"IF(E103=0,0,IMPRIMIR!E102)","v":0},0,0,0]
[null,{"$f":"IF(E104=0,0,IMPRIMIR!A103)","v":0},{"$f":"IF(E104=0,0,IMPRIMIR!$D$3)","v":0},0,{"$f":"IMPRIMIR!B103","v":0},{"$f":"IMPRIMIR!C103","v":0},{"$f":"IF(E104=0,0,IMPRIMIR!D103)","v":0},{"$f":"IF(E104=0,0,IMPRIMIR!E103)","v":0},0,0,0]
[null,{"$f":"IF(E105=0,0,IMPRIMIR!A104)","v":0},{"$f":"IF(E105=0,0,IMPRIMIR!$D$3)","v":0},0,{"$f":"IMPRIMIR!B104","v":0},{"$f":"IMPRIMIR!C104","v":0},{"$f":"IF(E105=0,0,IMPRIMIR!D104)","v":0},{"$f":"IF(E105=0,0,IMPRIMIR!E104)","v":0},0,0,0]
[null,{"$f":"IF(E106=0,0,IMPRIMIR!A105)","v":0},{"$f":"IF(E106=0,0,IMPRIMIR!$D$3)","v":0},0,{"$f":"IMPRIMIR!B105","v":0},{"$f":"IMPRIMIR!C105","v":0},{"$f":"IF(E106=0,0,IMPRIMIR!D105)","v":0},{"$f":"IF(E106=0,0,IMPRIMIR!E105)","v":0},0,0,0]
[null,{"$f":"IF(E107=0,0,IMPRIMIR!A106)","v":0},{"$f":"IF(E107=0,0,IMPRIMIR!$D$3)","v":0},0,{"$f":"IMPRIMIR!B106","v":0},{"$f":"IMPRIMIR!C106","v":0},{"$f":"IF(E107=0,0,IMPRIMIR!D106)","v":0},{"$f":"IF(E107=0,0,IMPRIMIR!E106)","v":0},0,0,0]
[null,{"$f":"IF(E108=0,0,IMPRIMIR!A107)","v":0},{"$f":"IF(E108=0,0,IMPRIMIR!$D$3)","v":0},0,{"$f":"IMPRIMIR!B107","v":0},{"$f":"IMPRIMIR!C107","v":0},{"$f":"IF(E108=0,0,IMPRIMIR!D107)","v":0},{"$f":"IF(E108=0,0,IMPRIMIR!E107)","v":0},0,0,0]
[null,{"$f":"IF(E109=0,0,IMPRIMIR!A108)","v":0},{"$f":"IF(E109=0,0,IMPRIMIR!$D$3)","v":0},0,{"$f":"IMPRIMIR!B108","v":0},{"$f":"IMPRIMIR!C108","v":0},{"$f":"IF(E109=0,0,IMPRIMIR!D108)","v":0},{"$f":"IF(E109=0,0,IMPRIMIR!E108)","v":0},0,0,0]
[null,{"$f":"IF(E110=0,0,IMPRIMIR!A109)","v":0},{"$f":"IF(E110=0,0,IMPRIMIR!$D$3)","v":0},0,{"$f":"IMPRIMIR!B109","v":0},{"$f":"IMPRIMIR!C109","v":0},{"$f":"IF(E110=0,0,IMPRIMIR!D109)","v":0},{"$f":"IF(E110=0,0,IMPRIMIR!E109)","v":0},0,0,0]
[null,{"$f":"IF(E111=0,0,IMPRIMIR!A110)","v":0},{"$f":"IF(E111=0,0,IMPRIMIR!$D$3)","v":0},0,{"$f":"IMPRIMIR!B110","v":0},{"$f":"IMPRIMIR!C110","v":0},{"$f":"IF(E111=0,0,IMPRIMIR!D110)","v":0},{"$f":"IF(E111=0,0,IMPRIMIR!E110)","v":0},0,0,0]
[null,{"$f":"IF(E112=0,0,IMPRIMIR!A111)","v":0},{"$f":"IF(E112=0,0,IMPRIMIR!$D$3)","v":0},0,{"$f":"IMPRIMIR!B111","v":0},{"$f":"IMPRIMIR!C111","v":0},{"$f":"IF(E112=0,0,IMPRIMIR!D111)","v":0},{"$f":"IF(E112=0,0,IMPRIMIR!E111)","v":0},0,0,0]
[null,{"$f":"IF(E113=0,0,IMPRIMIR!A112)","v":0},{"$f":"IF(E113=0,0,IMPRIMIR!$D$3)","v":0},0,{"$f":"IMPRIMIR!B112","v":0},{"$f":"IMPRIMIR!C112","v":0},{"$f":"IF(E113=0,0,IMPRIMIR!D112)","v":0},{"$f":"IF(E113=0,0,IMPRIMIR!E112)","v":0},0,0,0]
[null,{"$f":"IF(E114=0,0,IMPRIMIR!A113)","v":0},{"$f":"IF(E114=0,0,IMPRIMIR!$D$3)","v":0},0,{"$f":"IMPRIMIR!B113","v":0},{"$f":"IMPRIMIR!C113","v":0},{"$f":"IF(E114=0,0,IMPRIMIR!D113)","v":0},{"$f":"IF(E114=0,0,IMPRIMIR!E113)","v":0},0,0,0]
[null,{"$f":"IF(E115=0,0,IMPRIMIR!A114)","v":0},{"$f":"IF(E115=0,0,IMPRIMIR!$D$3)","v":0},0,{"$f":"IMPRIMIR!B114","v":0},{"$f":"IMPRIMIR!C114","v":0},{"$f":"IF(E115=0,0,IMPRIMIR!D114)","v":0},{"$f":"IF(E115=0,0,IMPRIMIR!E114)","v":0},0,0,0]
[null,{"$f":"IF(E116=0,0,IMPRIMIR!A115)","v":0},{"$f":"IF(E116=0,0,IMPRIMIR!$D$3)","v":0},0,{"$f":"IMPRIMIR!B115","v":0},{"$f":"IMPRIMIR!C115","v":0},{"$f":"IF(E116=0,0,IMPRIMIR!D115)","v":0},{"$f":"IF(E116=0,0,IMPRIMIR!E115)","v":0},0,0,0]
[null,{"$f":"IF(E117=0,0,IMPRIMIR!A116)","v":0},{"$f":"IF(E117=0,0,IMPRIMIR!$D$3)","v":0},0,{"$f":"IMPRIMIR!B116","v":0},{"$f":"IMPRIMIR!C116","v":0},{"$f":"IF(E117=0,0,IMPRIMIR!D116)","v":0},{"$f":"IF(E117=0,0,IMPRIMIR!E116)","v":0},0,0,0]
[null,{"$f":"IF(E118=0,0,IMPRIMIR!A117)","v":0},{"$f":"IF(E118=0,0,IMPRIMIR!$D$3)","v":0},0,{"$f":"IMPRIMIR!B117","v":0},{"$f":"IMPRIMIR!C117","v":0},{"$f":"IF(E118=0,0,IMPRIMIR!D117)","v":0},{"$f":"IF(E118=0,0,IMPRIMIR!E117)","v":0},0,0,0]
[null,{"$f":"IF(E119=0,0,IMPRIMIR!A118)","v":0},{"$f":"IF(E119=0,0,IMPRIMIR!$D$3)","v":0},0,{"$f":"IMPRIMIR!B118","v":0},{"$f":"IMPRIMIR!C118","v":0},{"$f":"IF(E119=0,0,IMPRIMIR!D118)","v":0},{"$f":"IF(E119=0,0,IMPRIMIR!E118)","v":0},0,0,0]
[null,{"$f":"IF(E120=0,0,IMPRIMIR!A119)","v":0},{"$f":"IF(E120=0,0,IMPRIMIR!$D$3)","v":0},0,{"$f":"IMPRIMIR!B119","v":0},{"$f":"IMPRIMIR!C119","v":0},{"$f":"IF(E120=0,0,IMPRIMIR!D119)","v":0},{"$f":"IF(E120=0,0,IMPRIMIR!E119)","v":0},0,0,0]
[null,{"$f":"IF(E121=0,0,IMPRIMIR!A120)","v":0},{"$f":"IF(E121=0,0,IMPRIMIR!$D$3)","v":0},0,{"$f":"IMPRIMIR!B120","v":0},{"$f":"IMPRIMIR!C120","v":0},{"$f":"IF(E121=0,0,IMPRIMIR!D120)","v":0},{"$f":"IF(E121=0,0,IMPRIMIR!E120)","v":0},0,0,0]
[null,{"$f":"IF(E122=0,0,IMPRIMIR!A121)","v":0},{"$f":"IF(E122=0,0,IMPRIMIR!$D$3)","v":0},0,{"$f":"IMPRIMIR!B121","v":0},{"$f":"IMPRIMIR!C121","v":0},{"$f":"IF(E122=0,0,IMPRIMIR!D121)","v":0},{"$f":"IF(E122=0,0,IMPRIMIR!E121)","v":0},0,0,0]
[null,{"$f":"IF(E123=0,0,IMPRIMIR!A122)","v":0},{"$f":"IF(E123=0,0,IMPRIMIR!$D$3)","v":0},0,{"$f":"IMPRIMIR!B122","v":0},{"$f":"IMPRIMIR!C122","v":0},{"$f":"IF(E123=0,0,IMPRIMIR!D122)","v":0},{"$f":"IF(E123=0,0,IMPRIMIR!E122)","v":0},0,0,0]
[null,{"$f":"IF(E124=0,0,IMPRIMIR!A123)","v":0},{"$f":"IF(E124=0,0,IMPRIMIR!$D$3)","v":0},0,{"$f":"IMPRIMIR!B123","v":0},{"$f":"IMPRIMIR!C123","v":0},{"$f":"IF(E124=0,0,IMPRIMIR!D123)","v":0},{"$f":"IF(E124=0,0,IMPRIMIR!E123)","v":0},0,0,0]
[null,{"$f":"IF(E125=0,0,IMPRIMIR!A124)","v":0},{"$f":"IF(E125=0,0,IMPRIMIR!$D$3)","v":0},0,{"$f":"IMPRIMIR!B124","v":0},{"$f":"IMPRIMIR!C124","v":0},{"$f":"IF(E125=0,0,IMPRIMIR!D124)","v":0},{"$f":"IF(E125=0,0,IMPRIMIR!E124)","v":0},0,0,0]
[null,{"$f":"IF(E126=0,0,IMPRIMIR!A125)","v":0},{"$f":"IF(E126=0,0,IMPRIMIR!$D$3)","v":0},0,{"$f":"IMPRIMIR!B125","v":0},{"$f":"IMPRIMIR!C125","v":0},{"$f":"IF(E126=0,0,IMPRIMIR!D125)","v":0},{"$f":"IF(E126=0,0,IMPRIMIR!E125)","v":0},0,0,0]
[null,{"$f":"IF(E127=0,0,IMPRIMIR!A126)","v":0},{"$f":"IF(E127=0,0,IMPRIMIR!$D$3)","v":0},0,{"$f":"IMPRIMIR!B126","v":0},{"$f":"IMPRIMIR!C126","v":0},{"$f":"IF(E127=0,0,IMPRIMIR!D126)","v":0},{"$f":"IF(E127=0,0,IMPRIMIR!E126)","v":0},0,0,0]
[null,{"$f":"IF(E128=0,0,IMPRIMIR!A127)","v":0},{"$f":"IF(E128=0,0,IMPRIMIR!$D$3)","v":0},0,{"$f":"IMPRIMIR!B127","v":0},{"$f":"IMPRIMIR!C127","v":0},{"$f":"IF(E128=0,0,IMPRIMIR!D127)","v":0},{"$f":"IF(E128=0,0,IMPRIMIR!E127)","v":0},0,0,0]
[null,{"$f":"IF(E129=0,0,IMPRIMIR!A128)","v":0},{"$f":"IF(E129=0,0,IMPRIMIR!$D$3)","v":0},0,{"$f":"IMPRIMIR!B128","v":0},{"$f":"IMPRIMIR!C128","v":0},{"$f":"IF(E129=0,0,IMPRIMIR!D128)","v":0},{"$f":"IF(E129=0,0,IMPRIMIR!E128)","v":0},0,0,0]
[null,{"$f":"IF(E130=0,0,IMPRIMIR!A129)","v":0},{"$f":"IF(E130=0,0,IMPRIMIR!$D$3)","v":0},0,{"$f":"IMPRIMIR!B129","v":0},{"$f":"IMPRIMIR!C129","v":0},{"$f":"IF(E130=0,0,IMPRIMIR!D129)","v":0},{"$f":"IF(E130=0,0,IMPRIMIR!E129)","v":0},0,0,0]
[null,{"$f":"IF(E131=0,0,IMPRIMIR!A130)","v":0},{"$f":"IF(E131=0,0,IMPRIMIR!$D$3)","v":0},0,{"$f":"IMPRIMIR!B130","v":0},{"$f":"IMPRIMIR!C130","v":0},{"$f":"IF(E131=0,0,IMPRIMIR!D130)","v":0},{"$f":"IF(E131=0,0,IMPRIMIR!E130)","v":0},0,0,0]
[null,{"$f":"IF(E132=0,0,IMPRIMIR!A131)","v":0},{"$f":"IF(E132=0,0,IMPRIMIR!$D$3)","v":0},0,{"$f":"IMPRIMIR!B131","v":0},{"$f":"IMPRIMIR!C131","v":0},{"$f":"IF(E132=0,0,IMPRIMIR!D131)","v":0},{"$f":"IF(E132=0,0,IMPRIMIR!E131)","v":0},0,0,0]
[null,{"$f":"IF(E133=0,0,IMPRIMIR!A132)","v":0},{"$f":"IF(E133=0,0,IMPRIMIR!$D$3)","v":0},0,{"$f":"IMPRIMIR!B132","v":0},{"$f":"IMPRIMIR!C132","v":0},{"$f":"IF(E133=0,0,IMPRIMIR!D132)","v":0},{"$f":"IF(E133=0,0,IMPRIMIR!E132)","v":0},0,0,0]
[null,{"$f":"IF(E134=0,0,IMPRIMIR!A133)","v":0},{"$f":"IF(E134=0,0,IMPRIMIR!$D$3)","v":0},0,{"$f":"IMPRIMIR!B133","v":0},{"$f":"IMPRIMIR!C133","v":0},{"$f":"IF(E134=0,0,IMPRIMIR!D133)","v":0},{"$f":"IF(E134=0,0,IMPRIMIR!E133)","v":0},0,0,0]
[null,{"$f":"IF(E135=0,0,IMPRIMIR!A134)","v":0},{"$f":"IF(E135=0,0,IMPRIMIR!$D$3)","v":0},0,{"$f":"IMPRIMIR!B134","v":0},{"$f":"IMPRIMIR!C134","v":0},{"$f":"IF(E135=0,0,IMPRIMIR!D134)","v":0},{"$f":"IF(E135=0,0,IMPRIMIR!E134)","v":0},0,0,0]
[null,{"$f":"IF(E136=0,0,IMPRIMIR!A135)","v":0},{"$f":"IF(E136=0,0,IMPRIMIR!$D$3)","v":0},0,{"$f":"IMPRIMIR!B135","v":0},{"$f":"IMPRIMIR!C135","v":0},{"$f":"IF(E136=0,0,IMPRIMIR!D135)","v":0},{"$f":"IF(E136=0,0,IMPRIMIR!E135)","v":0},0,0,0]
[null,{"$f":"IF(E137=0,0,IMPRIMIR!A136)","v":0},{"$f":"IF(E137=0,0,IMPRIMIR!$D$3)","v":0},{"$f":"IF(E137=\"0\",0,$G$2)","v":0},{"$f":"IMPRIMIR!B136","v":0},{"$f":"IMPRIMIR!C136","v":0},{"$f":"IF(E137=0,0,IMPRIMIR!D136)","v":0},{"$f":"IF(E137=0,0,IMPRIMIR!E136)","v":0},{"$f":"IF(E137=0,0,$G$2)","v":0},{"$f":"IF(E137=0,0,$G$4)","v":0},{"$f":"IF(E137=0,0,$G$3)","v":0}]
[null,{"$f":"IF(E138=0,0,IMPRIMIR!A137)","v":0},{"$f":"IF(E138=0,0,IMPRIMIR!$D$3)","v":0},0,{"$f":"IMPRIMIR!B137","v":0},{"$f":"IMPRIMIR!C137","v":0},{"$f":"IF(E138=0,0,IMPRIMIR!D137)","v":0},{"$f":"IF(E138=0,0,IMPRIMIR!E137)","v":0},0,0,0]
[null,{"$f":"IF(E139=0,0,IMPRIMIR!A138)","v":0},{"$f":"IF(E139=0,0,IMPRIMIR!$D$3)","v":0},0,{"$f":"IMPRIMIR!B138","v":0},{"$f":"IMPRIMIR!C138","v":0},{"$f":"IF(E139=0,0,IMPRIMIR!D138)","v":0},{"$f":"IF(E139=0,0,IMPRIMIR!E138)","v":0},0,0,0]
[null,{"$f":"IF(E140=0,0,IMPRIMIR!A139)","v":0},{"$f":"IF(E140=0,0,IMPRIMIR!$D$3)","v":0},0,{"$f":"IMPRIMIR!B139","v":0},{"$f":"IMPRIMIR!C139","v":0},{"$f":"IF(E140=0,0,IMPRIMIR!D139)","v":0},{"$f":"IF(E140=0,0,IMPRIMIR!E139)","v":0},0,0,0]
[null,{"$f":"IF(E141=0,0,IMPRIMIR!A140)","v":0},{"$f":"IF(E141=0,0,IMPRIMIR!$D$3)","v":0},0,{"$f":"IMPRIMIR!B140","v":0},{"$f":"IMPRIMIR!C140","v":0},{"$f":"IF(E141=0,0,IMPRIMIR!D140)","v":0},{"$f":"IF(E141=0,0,IMPRIMIR!E140)","v":0},0,0,0]
[null,{"$f":"IF(E142=0,0,IMPRIMIR!A141)","v":0},{"$f":"IF(E142=0,0,IMPRIMIR!$D$3)","v":0},0,{"$f":"IMPRIMIR!B141","v":0},{"$f":"IMPRIMIR!C141","v":0},{"$f":"IF(E142=0,0,IMPRIMIR!D141)","v":0},{"$f":"IF(E142=0,0,IMPRIMIR!E141)","v":0},0,0,0]
[null,{"$f":"IF(E143=0,0,IMPRIMIR!A142)","v":0},{"$f":"IF(E143=0,0,IMPRIMIR!$D$3)","v":0},0,{"$f":"IMPRIMIR!B142","v":0},{"$f":"IMPRIMIR!C142","v":0},{"$f":"IF(E143=0,0,IMPRIMIR!D142)","v":0},{"$f":"IF(E143=0,0,IMPRIMIR!E142)","v":0},0,0,0]
[null,{"$f":"IF(E144=0,0,IMPRIMIR!A143)","v":0},{"$f":"IF(E144=0,0,IMPRIMIR!$D$3)","v":0},0,{"$f":"IMPRIMIR!B143","v":0},{"$f":"IMPRIMIR!C143","v":0},{"$f":"IF(E144=0,0,IMPRIMIR!D143)","v":0},{"$f":"IF(E144=0,0,IMPRIMIR!E143)","v":0},0,0,0]
[null,{"$f":"IF(E145=0,0,IMPRIMIR!A144)","v":0},{"$f":"IF(E145=0,0,IMPRIMIR!$D$3)","v":0},0,{"$f":"IMPRIMIR!B144","v":0},{"$f":"IMPRIMIR!C144","v":0},{"$f":"IF(E145=0,0,IMPRIMIR!D144)","v":0},{"$f":"IF(E145=0,0,IMPRIMIR!E144)","v":0},0,0,0]
[null,{"$f":"IF(E146=0,0,IMPRIMIR!A145)","v":0},{"$f":"IF(E146=0,0,IMPRIMIR!$D$3)","v":0},0,{"$f":"IMPRIMIR!B145","v":0},{"$f":"IMPRIMIR!C145","v":0},{"$f":"IF(E146=0,0,IMPRIMIR!D145)","v":0},{"$f":"IF(E146=0,0,IMPRIMIR!E145)","v":0},0,0,0]
[null,{"$f":"IF(E147=0,0,IMPRIMIR!A146)","v":0},{"$f":"IF(E147=0,0,IMPRIMIR!$D$3)","v":0},0,{"$f":"IMPRIMIR!B146","v":0},{"$f":"IMPRIMIR!C146","v":0},{"$f":"IF(E147=0,0,IMPRIMIR!D146)","v":0},{"$f":"IF(E147=0,0,IMPRIMIR!E146)","v":0},0,0,0]
[null,{"$f":"IF(E148=0,0,IMPRIMIR!A147)","v":0},{"$f":"IF(E148=0,0,IMPRIMIR!$D$3)","v":0},0,{"$f":"IMPRIMIR!B147","v":0},{"$f":"IMPRIMIR!C147","v":0},{"$f":"IF(E148=0,0,IMPRIMIR!D147)","v":0},{"$f":"IF(E148=0,0,IMPRIMIR!E147)","v":0},0,0,0]
[null,{"$f":"IF(E149=0,0,IMPRIMIR!A148)","v":0},{"$f":"IF(E149=0,0,IMPRIMIR!$D$3)","v":0},0,{"$f":"IMPRIMIR!B148","v":0},{"$f":"IMPRIMIR!C148","v":0},{"$f":"IF(E149=0,0,IMPRIMIR!D148)","v":0},{"$f":"IF(E149=0,0,IMPRIMIR!E148)","v":0},0,0,0]
[null,{"$f":"IF(E150=0,0,IMPRIMIR!A149)","v":0},{"$f":"IF(E150=0,0,IMPRIMIR!$D$3)","v":0},0,{"$f":"IMPRIMIR!B149","v":0},{"$f":"IMPRIMIR!C149","v":0},{"$f":"IF(E150=0,0,IMPRIMIR!D149)","v":0},{"$f":"IF(E150=0,0,IMPRIMIR!E149)","v":0},0,0,0]
[null,{"$f":"IF(E151=0,0,IMPRIMIR!A150)","v":0},{"$f":"IF(E151=0,0,IMPRIMIR!$D$3)","v":0},0,{"$f":"IMPRIMIR!B150","v":0},{"$f":"IMPRIMIR!C150","v":0},{"$f":"IF(E151=0,0,IMPRIMIR!D150)","v":0},{"$f":"IF(E151=0,0,IMPRIMIR!E150)","v":0},0,0,0]
[null,{"$f":"IF(E152=0,0,IMPRIMIR!A151)","v":0},{"$f":"IF(E152=0,0,IMPRIMIR!$D$3)","v":0},0,{"$f":"IMPRIMIR!B151","v":0},{"$f":"IMPRIMIR!C151","v":0},{"$f":"IF(E152=0,0,IMPRIMIR!D151)","v":0},{"$f":"IF(E152=0,0,IMPRIMIR!E151)","v":0},0,0,0]
[null,{"$f":"IF(E153=0,0,IMPRIMIR!A152)","v":0},{"$f":"IF(E153=0,0,IMPRIMIR!$D$3)","v":0},0,{"$f":"IMPRIMIR!B152","v":0},{"$f":"IMPRIMIR!C152","v":0},{"$f":"IF(E153=0,0,IMPRIMIR!D152)","v":0},{"$f":"IF(E153=0,0,IMPRIMIR!E152)","v":0},0,0,0]
[null,{"$f":"IF(E154=0,0,IMPRIMIR!A153)","v":0},{"$f":"IF(E154=0,0,IMPRIMIR!$D$3)","v":0},0,{"$f":"IMPRIMIR!B153","v":0},{"$f":"IMPRIMIR!C153","v":0},{"$f":"IF(E154=0,0,IMPRIMIR!D153)","v":0},{"$f":"IF(E154=0,0,IMPRIMIR!E153)","v":0},0,0,0]
[null,{"$f":"IF(E155=0,0,IMPRIMIR!A154)","v":0},{"$f":"IF(E155=0,0,IMPRIMIR!$D$3)","v":0},0,{"$f":"IMPRIMIR!B154","v":0},{"$f":"IMPRIMIR!C154","v":0},{"$f":"IF(E155=0,0,IMPRIMIR!D154)","v":0},{"$f":"IF(E155=0,0,IMPRIMIR!E154)","v":0},0,0,0]
[null,{"$f":"IF(E156=0,0,IMPRIMIR!A155)","v":0},{"$f":"IF(E156=0,0,IMPRIMIR!$D$3)","v":0},0,{"$f":"IMPRIMIR!B155","v":0},{"$f":"IMPRIMIR!C155","v":0},{"$f":"IF(E156=0,0,IMPRIMIR!D155)","v":0},{"$f":"IF(E156=0,0,IMPRIMIR!E155)","v":0},0,0,0]
[null,{"$f":"IF(E157=0,0,IMPRIMIR!A156)","v":0},{"$f":"IF(E157=0,0,IMPRIMIR!$D$3)","v":0},0,{"$f":"IMPRIMIR!B156","v":0},{"$f":"IMPRIMIR!C156","v":0},{"$f":"IF(E157=0,0,IMPRIMIR!D156)","v":0},{"$f":"IF(E157=0,0,IMPRIMIR!E156)","v":0},0,0,0]
[null,{"$f":"IF(E158=0,0,IMPRIMIR!A157)","v":0},{"$f":"IF(E158=0,0,IMPRIMIR!$D$3)","v":0},0,{"$f":"IMPRIMIR!B157","v":0},{"$f":"IMPRIMIR!C157","v":0},{"$f":"IF(E158=0,0,IMPRIMIR!D157)","v":0},{"$f":"IF(E158=0,0,IMPRIMIR!E157)","v":0},0,0,0]
[null,{"$f":"IF(E159=0,0,IMPRIMIR!A158)","v":0},{"$f":"IF(E159=0,0,IMPRIMIR!$D$3)","v":0},0,{"$f":"IMPRIMIR!B158","v":0},{"$f":"IMPRIMIR!C158","v":0},{"$f":"IF(E159=0,0,IMPRIMIR!D158)","v":0},{"$f":"IF(E159=0,0,IMPRIMIR!E158)","v":0},0,0,0]
[null,{"$f":"IF(E160=0,0,IMPRIMIR!A159)","v":0},{"$f":"IF(E160=0,0,IMPRIMIR!$D$3)","v":0},0,{"$f":"IMPRIMIR!B159","v":0},{"$f":"IMPRIMIR!C159","v":0},{"$f":"IF(E160=0,0,IMPRIMIR!D159)","v":0},{"$f":"IF(E160=0,0,IMPRIMIR!E159)","v":0},0,0,0]
[null,{"$f":"IF(E161=0,0,IMPRIMIR!A160)","v":0},{"$f":"IF(E161=0,0,IMPRIMIR!$D$3)","v":0},0,{"$f":"IMPRIMIR!B160","v":0},{"$f":"IMPRIMIR!C160","v":0},{"$f":"IF(E161=0,0,IMPRIMIR!D160)","v":0},{"$f":"IF(E161=0,0,IMPRIMIR!E160)","v":0},0,0,0]
[null,{"$f":"IF(E162=0,0,IMPRIMIR!A161)","v":0},{"$f":"IF(E162=0,0,IMPRIMIR!$D$3)","v":0},0,{"$f":"IMPRIMIR!B161","v":0},{"$f":"IMPRIMIR!C161","v":0},{"$f":"IF(E162=0,0,IMPRIMIR!D161)","v":0},{"$f":"IF(E162=0,0,IMPRIMIR!E161)","v":0},0,0,0]
[null,{"$f":"IF(E163=0,0,IMPRIMIR!A162)","v":0},{"$f":"IF(E163=0,0,IMPRIMIR!$D$3)","v":0},0,{"$f":"IMPRIMIR!B162","v":0},{"$f":"IMPRIMIR!C162","v":0},{"$f":"IF(E163=0,0,IMPRIMIR!D162)","v":0},{"$f":"IF(E163=0,0,IMPRIMIR!E162)","v":0},0,0,0]
[null,{"$f":"IF(E164=0,0,IMPRIMIR!A163)","v":0},{"$f":"IF(E164=0,0,IMPRIMIR!$D$3)","v":0},0,{"$f":"IMPRIMIR!B163","v":0},{"$f":"IMPRIMIR!C163","v":0},{"$f":"IF(E164=0,0,IMPRIMIR!D163)","v":0},{"$f":"IF(E164=0,0,IMPRIMIR!E163)","v":0},0,0,0]
[null,{"$f":"IF(E165=0,0,IMPRIMIR!A164)","v":0},{"$f":"IF(E165=0,0,IMPRIMIR!$D$3)","v":0},0,{"$f":"IMPRIMIR!B164","v":0},{"$f":"IMPRIMIR!C164","v":0},{"$f":"IF(E165=0,0,IMPRIMIR!D164)","v":0},{"$f":"IF(E165=0,0,IMPRIMIR!E164)","v":0},0,0,0]
[null,{"$f":"IF(E166=0,0,IMPRIMIR!A165)","v":0},{"$f":"IF(E166=0,0,IMPRIMIR!$D$3)","v":0},0,{"$f":"IMPRIMIR!B165","v":0},{"$f":"IMPRIMIR!C165","v":0},{"$f":"IF(E166=0,0,IMPRIMIR!D165)","v":0},{"$f":"IF(E166=0,0,IMPRIMIR!E165)","v":0},0,0,0]
[null,{"$f":"IF(E167=0,0,IMPRIMIR!A166)","v":0},{"$f":"IF(E167=0,0,IMPRIMIR!$D$3)","v":0},0,{"$f":"IMPRIMIR!B166","v":0},{"$f":"IMPRIMIR!C166","v":0},{"$f":"IF(E167=0,0,IMPRIMIR!D166)","v":0},{"$f":"IF(E167=0,0,IMPRIMIR!E166)","v":0},0,0,0]
[null,{"$f":"IF(E168=0,0,IMPRIMIR!A167)","v":0},{"$f":"IF(E168=0,0,IMPRIMIR!$D$3)","v":0},0,{"$f":"IMPRIMIR!B167","v":0},{"$f":"IMPRIMIR!C167","v":0},{"$f":"IF(E168=0,0,IMPRIMIR!D167)","v":0},{"$f":"IF(E168=0,0,IMPRIMIR!E167)","v":0},0,0,0]
[null,{"$f":"IF(E169=0,0,IMPRIMIR!A168)","v":0},{"$f":"IF(E169=0,0,IMPRIMIR!$D$3)","v":0},0,{"$f":"IMPRIMIR!B168","v":0},{"$f":"IMPRIMIR!C168","v":0},{"$f":"IF(E169=0,0,IMPRIMIR!D168)","v":0},{"$f":"IF(E169=0,0,IMPRIMIR!E168)","v":0},0,0,0]
[null,{"$f":"IF(E170=0,0,IMPRIMIR!A169)","v":0},{"$f":"IF(E170=0,0,IMPRIMIR!$D$3)","v":0},0,{"$f":"IMPRIMIR!B169","v":0},{"$f":"IMPRIMIR!C169","v":0},{"$f":"IF(E170=0,0,IMPRIMIR!D169)","v":0},{"$f":"IF(E170=0,0,IMPRIMIR!E169)","v":0},0,0,0]
[null,{"$f":"IF(E171=0,0,IMPRIMIR!A170)","v":0},{"$f":"IF(E171=0,0,IMPRIMIR!$D$3)","v":0},0,{"$f":"IMPRIMIR!B170","v":0},{"$f":"IMPRIMIR!C170","v":0},{"$f":"IF(E171=0,0,IMPRIMIR!D170)","v":0},{"$f":"IF(E171=0,0,IMPRIMIR!E170)","v":0},0,0,0]
[null,{"$f":"IF(E172=0,0,IMPRIMIR!A171)","v":0},{"$f":"IF(E172=0,0,IMPRIMIR!$D$3)","v":0},0,{"$f":"IMPRIMIR!B171","v":0},{"$f":"IMPRIMIR!C171","v":0},{"$f":"IF(E172=0,0,IMPRIMIR!D171)","v":0},{"$f":"IF(E172=0,0,IMPRIMIR!E171)","v":0},0,0,0]
[null,{"$f":"IF(E173=0,0,IMPRIMIR!A172)","v":0},{"$f":"IF(E173=0,0,IMPRIMIR!$D$3)","v":0},0,{"$f":"IMPRIMIR!B172","v":0},{"$f":"IMPRIMIR!C172","v":0},{"$f":"IF(E173=0,0,IMPRIMIR!D172)","v":0},{"$f":"IF(E173=0,0,IMPRIMIR!E172)","v":0},0,0,0]
[null,{"$f":"IF(E174=0,0,IMPRIMIR!A173)","v":0},{"$f":"IF(E174=0,0,IMPRIMIR!$D$3)","v":0},0,{"$f":"IMPRIMIR!B173","v":0},{"$f":"IMPRIMIR!C173","v":0},{"$f":"IF(E174=0,0,IMPRIMIR!D173)","v":0},{"$f":"IF(E174=0,0,IMPRIMIR!E173)","v":0},0,0,0]
[null,{"$f":"IF(E175=0,0,IMPRIMIR!A174)","v":0},{"$f":"IF(E175=0,0,IMPRIMIR!$D$3)","v":0},0,{"$f":"IMPRIMIR!B174","v":0},{"$f":"IMPRIMIR!C174","v":0},{"$f":"IF(E175=0,0,IMPRIMIR!D174)","v":0},{"$f":"IF(E175=0,0,IMPRIMIR!E174)","v":0},0,0,0]
[null,{"$f":"IF(E176=0,0,IMPRIMIR!A175)","v":0},{"$f":"IF(E176=0,0,IMPRIMIR!$D$3)","v":0},0,{"$f":"IMPRIMIR!B175","v":0},{"$f":"IMPRIMIR!C175","v":0},{"$f":"IF(E176=0,0,IMPRIMIR!D175)","v":0},{"$f":"IF(E176=0,0,IMPRIMIR!E175)","v":0},0,0,0]
[null,{"$f":"IF(E177=0,0,IMPRIMIR!A176)","v":0},{"$f":"IF(E177=0,0,IMPRIMIR!$D$3)","v":0},0,{"$f":"IMPRIMIR!B176","v":0},{"$f":"IMPRIMIR!C176","v":0},{"$f":"IF(E177=0,0,IMPRIMIR!D176)","v":0},{"$f":"IF(E177=0,0,IMPRIMIR!E176)","v":0},0,0,0]
[null,{"$f":"IF(E178=0,0,IMPRIMIR!A177)","v":0},{"$f":"IF(E178=0,0,IMPRIMIR!$D$3)","v":0},0,{"$f":"IMPRIMIR!B177","v":0},{"$f":"IMPRIMIR!C177","v":0},{"$f":"IF(E178=0,0,IMPRIMIR!D177)","v":0},{"$f":"IF(E178=0,0,IMPRIMIR!E177)","v":0},0,0,0]
[null,{"$f":"IF(E179=0,0,IMPRIMIR!A178)","v":0},{"$f":"IF(E179=0,0,IMPRIMIR!$D$3)","v":0},0,{"$f":"IMPRIMIR!B178","v":0},{"$f":"IMPRIMIR!C178","v":0},{"$f":"IF(E179=0,0,IMPRIMIR!D178)","v":0},{"$f":"IF(E179=0,0,IMPRIMIR!E178)","v":0},0,0,0]
[null,{"$f":"IF(E180=0,0,IMPRIMIR!A179)","v":0},{"$f":"IF(E180=0,0,IMPRIMIR!$D$3)","v":0},0,{"$f":"IMPRIMIR!B179","v":0},{"$f":"IMPRIMIR!C179","v":0},{"$f":"IF(E180=0,0,IMPRIMIR!D179)","v":0},{"$f":"IF(E180=0,0,IMPRIMIR!E179)","v":0},0,0,0]
[null,{"$f":"IF(E181=0,0,IMPRIMIR!A180)","v":0},{"$f":"IF(E181=0,0,IMPRIMIR!$D$3)","v":0},0,{"$f":"IMPRIMIR!B180","v":0},{"$f":"IMPRIMIR!C180","v":0},{"$f":"IF(E181=0,0,IMPRIMIR!D180)","v":0},{"$f":"IF(E181=0,0,IMPRIMIR!E180)","v":0},0,0,0]
[null,{"$f":"IF(E182=0,0,IMPRIMIR!A181)","v":0},{"$f":"IF(E182=0,0,IMPRIMIR!$D$3)","v":0},0,{"$f":"IMPRIMIR!B181","v":0},{"$f":"IMPRIMIR!C181","v":0},{"$f":"IF(E182=0,0,IMPRIMIR!D181)","v":0},{"$f":"IF(E182=0,0,IMPRIMIR!E181)","v":0},0,0,0]
[null,{"$f":"IF(E183=0,0,IMPRIMIR!A182)","v":0},{"$f":"IF(E183=0,0,IMPRIMIR!$D$3)","v":0},0,{"$f":"IMPRIMIR!B182","v":0},{"$f":"IMPRIMIR!C182","v":0},{"$f":"IF(E183=0,0,IMPRIMIR!D182)","v":0},{"$f":"IF(E183=0,0,IMPRIMIR!E182)","v":0},0,0,0]
[null,{"$f":"IF(E184=0,0,IMPRIMIR!A183)","v":0},{"$f":"IF(E184=0,0,IMPRIMIR!$D$3)","v":0},0,{"$f":"IMPRIMIR!B183","v":0},{"$f":"IMPRIMIR!C183","v":0},{"$f":"IF(E184=0,0,IMPRIMIR!D183)","v":0},{"$f":"IF(E184=0,0,IMPRIMIR!E183)","v":0},0,0,0]
[null,{"$f":"IF(E185=0,0,IMPRIMIR!A184)","v":0},{"$f":"IF(E185=0,0,IMPRIMIR!$D$3)","v":0},0,{"$f":"IMPRIMIR!B184","v":0},{"$f":"IMPRIMIR!C184","v":0},{"$f":"IF(E185=0,0,IMPRIMIR!D184)","v":0},{"$f":"IF(E185=0,0,IMPRIMIR!E184)","v":0},0,0,0]
[null,{"$f":"IF(E186=0,0,IMPRIMIR!A185)","v":0},{"$f":"IF(E186=0,0,IMPRIMIR!$D$3)","v":0},0,{"$f":"IMPRIMIR!B185","v":0},{"$f":"IMPRIMIR!C185","v":0},{"$f":"IF(E186=0,0,IMPRIMIR!D185)","v":0},{"$f":"IF(E186=0,0,IMPRIMIR!E185)","v":0},0,0,0]
[null,{"$f":"IF(E187=0,0,IMPRIMIR!A186)","v":0},{"$f":"IF(E187=0,0,IMPRIMIR!$D$3)","v":0},0,{"$f":"IMPRIMIR!B186","v":0},{"$f":"IMPRIMIR!C186","v":0},{"$f":"IF(E187=0,0,IMPRIMIR!D186)","v":0},{"$f":"IF(E187=0,0,IMPRIMIR!E186)","v":0},0,0,0]
[null,{"$f":"IF(E188=0,0,IMPRIMIR!A187)","v":0},{"$f":"IF(E188=0,0,IMPRIMIR!$D$3)","v":0},0,{"$f":"IMPRIMIR!B187","v":0},{"$f":"IMPRIMIR!C187","v":0},{"$f":"IF(E188=0,0,IMPRIMIR!D187)","v":0},{"$f":"IF(E188=0,0,IMPRIMIR!E187)","v":0},0,0,0]
[null,{"$f":"IF(E189=0,0,IMPRIMIR!A188)","v":0},{"$f":"IF(E189=0,0,IMPRIMIR!$D$3)","v":0},0,{"$f":"IMPRIMIR!B188","v":0},{"$f":"IMPRIMIR!C188","v":0},{"$f":"IF(E189=0,0,IMPRIMIR!D188)","v":0},{"$f":"IF(E189=0,0,IMPRIMIR!E188)","v":0},0,0,0]
[null,{"$f":"IF(E190=0,0,IMPRIMIR!A189)","v":0},{"$f":"IF(E190=0,0,IMPRIMIR!$D$3)","v":0},0,{"$f":"IMPRIMIR!B189","v":0},{"$f":"IMPRIMIR!C189","v":0},{"$f":"IF(E190=0,0,IMPRIMIR!D189)","v":0},{"$f":"IF(E190=0,0,IMPRIMIR!E189)","v":0},0,0,0]
[null,{"$f":"IF(E191=0,0,IMPRIMIR!A190)","v":0},{"$f":"IF(E191=0,0,IMPRIMIR!$D$3)","v":0},0,{"$f":"IMPRIMIR!B190","v":0},{"$f":"IMPRIMIR!C190","v":0},{"$f":"IF(E191=0,0,IMPRIMIR!D190)","v":0},{"$f":"IF(E191=0,0,IMPRIMIR!E190)","v":0},0,0,0]
[null,{"$f":"IF(E192=0,0,IMPRIMIR!A191)","v":0},{"$f":"IF(E192=0,0,IMPRIMIR!$D$3)","v":0},0,{"$f":"IMPRIMIR!B191","v":0},{"$f":"IMPRIMIR!C191","v":0},{"$f":"IF(E192=0,0,IMPRIMIR!D191)","v":0},{"$f":"IF(E192=0,0,IMPRIMIR!E191)","v":0},0,0,0]
[null,{"$f":"IF(E193=0,0,IMPRIMIR!A192)","v":0},{"$f":"IF(E193=0,0,IMPRIMIR!$D$3)","v":0},0,{"$f":"IMPRIMIR!B192","v":0},{"$f":"IMPRIMIR!C192","v":0},{"$f":"IF(E193=0,0,IMPRIMIR!D192)","v":0},{"$f":"IF(E193=0,0,IMPRIMIR!E192)","v":0},0,0,0]
[null,{"$f":"IF(E194=0,0,IMPRIMIR!A193)","v":0},{"$f":"IF(E194=0,0,IMPRIMIR!$D$3)","v":0},0,{"$f":"IMPRIMIR!B193","v":0},{"$f":"IMPRIMIR!C193","v":0},{"$f":"IF(E194=0,0,IMPRIMIR!D193)","v":0},{"$f":"IF(E194=0,0,IMPRIMIR!E193)","v":0},0,0,0]
[null,{"$f":"IF(E195=0,0,IMPRIMIR!A194)","v":0},{"$f":"IF(E195=0,0,IMPRIMIR!$D$3)","v":0},0,{"$f":"IMPRIMIR!B194","v":0},{"$f":"IMPRIMIR!C194","v":0},{"$f":"IF(E195=0,0,IMPRIMIR!D194)","v":0},{"$f":"IF(E195=0,0,IMPRIMIR!E194)","v":0},0,0,0]
[null,{"$f":"IF(E196=0,0,IMPRIMIR!A195)","v":0},{"$f":"IF(E196=0,0,IMPRIMIR!$D$3)","v":0},0,{"$f":"IMPRIMIR!B195","v":0},{"$f":"IMPRIMIR!C195","v":0},{"$f":"IF(E196=0,0,IMPRIMIR!D195)","v":0},{"$f":"IF(E196=0,0,IMPRIMIR!E195)","v":0},0,0,0]
[null,{"$f":"IF(E197=0,0,IMPRIMIR!A196)","v":0},{"$f":"IF(E197=0,0,IMPRIMIR!$D$3)","v":0},0,{"$f":"IMPRIMIR!B196","v":0},{"$f":"IMPRIMIR!C196","v":0},{"$f":"IF(E197=0,0,IMPRIMIR!D196)","v":0},{"$f":"IF(E197=0,0,IMPRIMIR!E196)","v":0},0,0,0]
[null,{"$f":"IF(E198=0,0,IMPRIMIR!A197)","v":0},{"$f":"IF(E198=0,0,IMPRIMIR!$D$3)","v":0},0,{"$f":"IMPRIMIR!B197","v":0},{"$f":"IMPRIMIR!C197","v":0},{"$f":"IF(E198=0,0,IMPRIMIR!D197)","v":0},{"$f":"IF(E198=0,0,IMPRIMIR!E197)","v":0},0,0,0]
[null,{"$f":"IF(E199=0,0,IMPRIMIR!A198)","v":0},{"$f":"IF(E199=0,0,IMPRIMIR!$D$3)","v":0},0,{"$f":"IMPRIMIR!B198","v":0},{"$f":"IMPRIMIR!C198","v":0},{"$f":"IF(E199=0,0,IMPRIMIR!D198)","v":0},{"$f":"IF(E199=0,0,IMPRIMIR!E198)","v":0},0,0,0]
[null,{"$f":"IF(E200=0,0,IMPRIMIR!A199)","v":0},{"$f":"IF(E200=0,0,IMPRIMIR!$D$3)","v":0},0,{"$f":"IMPRIMIR!B199","v":0},{"$f":"IMPRIMIR!C199","v":0},{"$f":"IF(E200=0,0,IMPRIMIR!D199)","v":0},{"$f":"IF(E200=0,0,IMPRIMIR!E199)","v":0},0,0,0]
[null,{"$f":"IF(E201=0,0,IMPRIMIR!A200)","v":0},{"$f":"IF(E201=0,0,IMPRIMIR!$D$3)","v":0},{"$f":"IF(E201=\"0\",0,$G$2)","v":0},{"$f":"IMPRIMIR!B200","v":0},{"$f":"IMPRIMIR!C200","v":0},{"$f":"IF(E201=0,0,IMPRIMIR!D200)","v":0},{"$f":"IF(E201=0,0,IMPRIMIR!E200)","v":0},{"$f":"IF(E201=0,0,$G$2)","v":0},{"$f":"IF(E201=0,0,$G$4)","v":0},{"$f":"IF(E201=0,0,$G$3)","v":0}]
[null,{"$f":"IF(E202=0,0,IMPRIMIR!A201)","v":0},{"$f":"IF(E202=0,0,IMPRIMIR!$D$3)","v":0},0,{"$f":"IMPRIMIR!B201","v":0},{"$f":"IMPRIMIR!C201","v":0},{"$f":"IF(E202=0,0,IMPRIMIR!D201)","v":0},{"$f":"IF(E202=0,0,IMPRIMIR!E201)","v":0},0,0,0]
[null,{"$f":"IF(E203=0,0,IMPRIMIR!A202)","v":0},{"$f":"IF(E203=0,0,IMPRIMIR!$D$3)","v":0},0,{"$f":"IMPRIMIR!B202","v":0},{"$f":"IMPRIMIR!C202","v":0},{"$f":"IF(E203=0,0,IMPRIMIR!D202)","v":0},{"$f":"IF(E203=0,0,IMPRIMIR!E202)","v":0},0,0,0]
[null,{"$f":"IF(E204=0,0,IMPRIMIR!A203)","v":0},{"$f":"IF(E204=0,0,IMPRIMIR!$D$3)","v":0},0,{"$f":"IMPRIMIR!B203","v":0},{"$f":"IMPRIMIR!C203","v":0},{"$f":"IF(E204=0,0,IMPRIMIR!D203)","v":0},{"$f":"IF(E204=0,0,IMPRIMIR!E203)","v":0},0,0,0]
[null,{"$f":"IF(E205=0,0,IMPRIMIR!A204)","v":0},{"$f":"IF(E205=0,0,IMPRIMIR!$D$3)","v":0},0,{"$f":"IMPRIMIR!B204","v":0},{"$f":"IMPRIMIR!C204","v":0},{"$f":"IF(E205=0,0,IMPRIMIR!D204)","v":0},{"$f":"IF(E205=0,0,IMPRIMIR!E204)","v":0},0,0,0]
[null,{"$f":"IF(E206=0,0,IMPRIMIR!A205)","v":0},{"$f":"IF(E206=0,0,IMPRIMIR!$D$3)","v":0},0,{"$f":"IMPRIMIR!B205","v":0},{"$f":"IMPRIMIR!C205","v":0},{"$f":"IF(E206=0,0,IMPRIMIR!D205)","v":0},{"$f":"IF(E206=0,0,IMPRIMIR!E205)","v":0},0,0,0]
[null,{"$f":"IF(E207=0,0,IMPRIMIR!A206)","v":0},{"$f":"IF(E207=0,0,IMPRIMIR!$D$3)","v":0},0,{"$f":"IMPRIMIR!B206","v":0},{"$f":"IMPRIMIR!C206","v":0},{"$f":"IF(E207=0,0,IMPRIMIR!D206)","v":0},{"$f":"IF(E207=0,0,IMPRIMIR!E206)","v":0},0,0,0]
[null,{"$f":"IF(E208=0,0,IMPRIMIR!A207)","v":0},{"$f":"IF(E208=0,0,IMPRIMIR!$D$3)","v":0},0,{"$f":"IMPRIMIR!B207","v":0},{"$f":"IMPRIMIR!C207","v":0},{"$f":"IF(E208=0,0,IMPRIMIR!D207)","v":0},{"$f":"IF(E208=0,0,IMPRIMIR!E207)","v":0},0,0,0]
[null,{"$f":"IF(E209=0,0,IMPRIMIR!A208)","v":0},{"$f":"IF(E209=0,0,IMPRIMIR!$D$3)","v":0},0,{"$f":"IMPRIMIR!B208","v":0},{"$f":"IMPRIMIR!C208","v":0},{"$f":"IF(E209=0,0,IMPRIMIR!D208)","v":0},{"$f":"IF(E209=0,0,IMPRIMIR!E208)","v":0},0,0,0]
[null,{"$f":"IF(E210=0,0,IMPRIMIR!A209)","v":0},{"$f":"IF(E210=0,0,IMPRIMIR!$D$3)","v":0},0,{"$f":"IMPRIMIR!B209","v":0},{"$f":"IMPRIMIR!C209","v":0},{"$f":"IF(E210=0,0,IMPRIMIR!D209)","v":0},{"$f":"IF(E210=0,0,IMPRIMIR!E209)","v":0},0,0,0]
[null,{"$f":"IF(E211=0,0,IMPRIMIR!A210)","v":0},{"$f":"IF(E211=0,0,IMPRIMIR!$D$3)","v":0},0,{"$f":"IMPRIMIR!B210","v":0},{"$f":"IMPRIMIR!C210","v":0},{"$f":"IF(E211=0,0,IMPRIMIR!D210)","v":0},{"$f":"IF(E211=0,0,IMPRIMIR!E210)","v":0},0,0,0]
[null,{"$f":"IF(E212=0,0,IMPRIMIR!A211)","v":0},{"$f":"IF(E212=0,0,IMPRIMIR!$D$3)","v":0},0,{"$f":"IMPRIMIR!B211","v":0},{"$f":"IMPRIMIR!C211","v":0},{"$f":"IF(E212=0,0,IMPRIMIR!D211)","v":0},{"$f":"IF(E212=0,0,IMPRIMIR!E211)","v":0},0,0,0]
[null,{"$f":"IF(E213=0,0,IMPRIMIR!A212)","v":0},{"$f":"IF(E213=0,0,IMPRIMIR!$D$3)","v":0},0,{"$f":"IMPRIMIR!B212","v":0},{"$f":"IMPRIMIR!C212","v":0},{"$f":"IF(E213=0,0,IMPRIMIR!D212)","v":0},{"$f":"IF(E213=0,0,IMPRIMIR!E212)","v":0},0,0,0]
[null,{"$f":"IF(E214=0,0,IMPRIMIR!A213)","v":0},{"$f":"IF(E214=0,0,IMPRIMIR!$D$3)","v":0},0,{"$f":"IMPRIMIR!B213","v":0},{"$f":"IMPRIMIR!C213","v":0},{"$f":"IF(E214=0,0,IMPRIMIR!D213)","v":0},{"$f":"IF(E214=0,0,IMPRIMIR!E213)","v":0},0,0,0]
[null,{"$f":"IF(E215=0,0,IMPRIMIR!A214)","v":0},{"$f":"IF(E215=0,0,IMPRIMIR!$D$3)","v":0},0,{"$f":"IMPRIMIR!B214","v":0},{"$f":"IMPRIMIR!C214","v":0},{"$f":"IF(E215=0,0,IMPRIMIR!D214)","v":0},{"$f":"IF(E215=0,0,IMPRIMIR!E214)","v":0},0,0,0]
[null,{"$f":"IF(E216=0,0,IMPRIMIR!A215)","v":0},{"$f":"IF(E216=0,0,IMPRIMIR!$D$3)","v":0},0,{"$f":"IMPRIMIR!B215","v":0},{"$f":"IMPRIMIR!C215","v":0},{"$f":"IF(E216=0,0,IMPRIMIR!D215)","v":0},{"$f":"IF(E216=0,0,IMPRIMIR!E215)","v":0},0,0,0]
[null,{"$f":"IF(E217=0,0,IMPRIMIR!A216)","v":0},{"$f":"IF(E217=0,0,IMPRIMIR!$D$3)","v":0},0,{"$f":"IMPRIMIR!B216","v":0},{"$f":"IMPRIMIR!C216","v":0},{"$f":"IF(E217=0,0,IMPRIMIR!D216)","v":0},{"$f":"IF(E217=0,0,IMPRIMIR!E216)","v":0},0,0,0]
[null,{"$f":"IF(E218=0,0,IMPRIMIR!A217)","v":0},{"$f":"IF(E218=0,0,IMPRIMIR!$D$3)","v":0},0,{"$f":"IMPRIMIR!B217","v":0},{"$f":"IMPRIMIR!C217","v":0},{"$f":"IF(E218=0,0,IMPRIMIR!D217)","v":0},{"$f":"IF(E218=0,0,IMPRIMIR!E217)","v":0},0,0,0]
[null,{"$f":"IF(E219=0,0,IMPRIMIR!A218)","v":0},{"$f":"IF(E219=0,0,IMPRIMIR!$D$3)","v":0},0,{"$f":"IMPRIMIR!B218","v":0},{"$f":"IMPRIMIR!C218","v":0},{"$f":"IF(E219=0,0,IMPRIMIR!D218)","v":0},{"$f":"IF(E219=0,0,IMPRIMIR!E218)","v":0},0,0,0]
[null,{"$f":"IF(E220=0,0,IMPRIMIR!A219)","v":0},{"$f":"IF(E220=0,0,IMPRIMIR!$D$3)","v":0},0,{"$f":"IMPRIMIR!B219","v":0},{"$f":"IMPRIMIR!C219","v":0},{"$f":"IF(E220=0,0,IMPRIMIR!D219)","v":0},{"$f":"IF(E220=0,0,IMPRIMIR!E219)","v":0},0,0,0]
[null,{"$f":"IF(E221=0,0,IMPRIMIR!A220)","v":0},{"$f":"IF(E221=0,0,IMPRIMIR!$D$3)","v":0},0,{"$f":"IMPRIMIR!B220","v":0},{"$f":"IMPRIMIR!C220","v":0},{"$f":"IF(E221=0,0,IMPRIMIR!D220)","v":0},{"$f":"IF(E221=0,0,IMPRIMIR!E220)","v":0},0,0,0]
[null,{"$f":"IF(E222=0,0,IMPRIMIR!A221)","v":0},{"$f":"IF(E222=0,0,IMPRIMIR!$D$3)","v":0},0,{"$f":"IMPRIMIR!B221","v":0},{"$f":"IMPRIMIR!C221","v":0},{"$f":"IF(E222=0,0,IMPRIMIR!D221)","v":0},{"$f":"IF(E222=0,0,IMPRIMIR!E221)","v":0},0,0,0]
[null,{"$f":"IF(E223=0,0,IMPRIMIR!A222)","v":0},{"$f":"IF(E223=0,0,IMPRIMIR!$D$3)","v":0},0,{"$f":"IMPRIMIR!B222","v":0},{"$f":"IMPRIMIR!C222","v":0},{"$f":"IF(E223=0,0,IMPRIMIR!D222)","v":0},{"$f":"IF(E223=0,0,IMPRIMIR!E222)","v":0},0,0,0]
[null,{"$f":"IF(E224=0,0,IMPRIMIR!A223)","v":0},{"$f":"IF(E224=0,0,IMPRIMIR!$D$3)","v":0},0,{"$f":"IMPRIMIR!B223","v":0},{"$f":"IMPRIMIR!C223","v":0},{"$f":"IF(E224=0,0,IMPRIMIR!D223)","v":0},{"$f":"IF(E224=0,0,IMPRIMIR!E223)","v":0},0,0,0]
[null,{"$f":"IF(E225=0,0,IMPRIMIR!A224)","v":0},{"$f":"IF(E225=0,0,IMPRIMIR!$D$3)","v":0},0,{"$f":"IMPRIMIR!B224","v":0},{"$f":"IMPRIMIR!C224","v":0},{"$f":"IF(E225=0,0,IMPRIMIR!D224)","v":0},{"$f":"IF(E225=0,0,IMPRIMIR!E224)","v":0},0,0,0]
[null,{"$f":"IF(E226=0,0,IMPRIMIR!A225)","v":0},{"$f":"IF(E226=0,0,IMPRIMIR!$D$3)","v":0},0,{"$f":"IMPRIMIR!B225","v":0},{"$f":"IMPRIMIR!C225","v":0},{"$f":"IF(E226=0,0,IMPRIMIR!D225)","v":0},{"$f":"IF(E226=0,0,IMPRIMIR!E225)","v":0},0,0,0]
[null,{"$f":"IF(E227=0,0,IMPRIMIR!A226)","v":0},{"$f":"IF(E227=0,0,IMPRIMIR!$D$3)","v":0},0,{"$f":"IMPRIMIR!B226","v":0},{"$f":"IMPRIMIR!C226","v":0},{"$f":"IF(E227=0,0,IMPRIMIR!D226)","v":0},{"$f":"IF(E227=0,0,IMPRIMIR!E226)","v":0},0,0,0]
[null,{"$f":"IF(E228=0,0,IMPRIMIR!A227)","v":0},{"$f":"IF(E228=0,0,IMPRIMIR!$D$3)","v":0},0,{"$f":"IMPRIMIR!B227","v":0},{"$f":"IMPRIMIR!C227","v":0},{"$f":"IF(E228=0,0,IMPRIMIR!D227)","v":0},{"$f":"IF(E228=0,0,IMPRIMIR!E227)","v":0},0,0,0]
[null,{"$f":"IF(E229=0,0,IMPRIMIR!A228)","v":0},{"$f":"IF(E229=0,0,IMPRIMIR!$D$3)","v":0},0,{"$f":"IMPRIMIR!B228","v":0},{"$f":"IMPRIMIR!C228","v":0},{"$f":"IF(E229=0,0,IMPRIMIR!D228)","v":0},{"$f":"IF(E229=0,0,IMPRIMIR!E228)","v":0},0,0,0]
[null,{"$f":"IF(E230=0,0,IMPRIMIR!A229)","v":0},{"$f":"IF(E230=0,0,IMPRIMIR!$D$3)","v":0},0,{"$f":"IMPRIMIR!B229","v":0},{"$f":"IMPRIMIR!C229","v":0},{"$f":"IF(E230=0,0,IMPRIMIR!D229)","v":0},{"$f":"IF(E230=0,0,IMPRIMIR!E229)","v":0},0,0,0]
[null,{"$f":"IF(E231=0,0,IMPRIMIR!A230)","v":0},{"$f":"IF(E231=0,0,IMPRIMIR!$D$3)","v":0},0,{"$f":"IMPRIMIR!B230","v":0},{"$f":"IMPRIMIR!C230","v":0},{"$f":"IF(E231=0,0,IMPRIMIR!D230)","v":0},{"$f":"IF(E231=0,0,IMPRIMIR!E230)","v":0},0,0,0]
[null,{"$f":"IF(E232=0,0,IMPRIMIR!A231)","v":0},{"$f":"IF(E232=0,0,IMPRIMIR!$D$3)","v":0},0,{"$f":"IMPRIMIR!B231","v":0},{"$f":"IMPRIMIR!C231","v":0},{"$f":"IF(E232=0,0,IMPRIMIR!D231)","v":0},{"$f":"IF(E232=0,0,IMPRIMIR!E231)","v":0},0,0,0]
[null,{"$f":"IF(E233=0,0,IMPRIMIR!A232)","v":0},{"$f":"IF(E233=0,0,IMPRIMIR!$D$3)","v":0},0,{"$f":"IMPRIMIR!B232","v":0},{"$f":"IMPRIMIR!C232","v":0},{"$f":"IF(E233=0,0,IMPRIMIR!D232)","v":0},{"$f":"IF(E233=0,0,IMPRIMIR!E232)","v":0},0,0,0]
[null,{"$f":"IF(E234=0,0,IMPRIMIR!A233)","v":0},{"$f":"IF(E234=0,0,IMPRIMIR!$D$3)","v":0},0,{"$f":"IMPRIMIR!B233","v":0},{"$f":"IMPRIMIR!C233","v":0},{"$f":"IF(E234=0,0,IMPRIMIR!D233)","v":0},{"$f":"IF(E234=0,0,IMPRIMIR!E233)","v":0},0,0,0]
[null,{"$f":"IF(E235=0,0,IMPRIMIR!A234)","v":0},{"$f":"IF(E235=0,0,IMPRIMIR!$D$3)","v":0},0,{"$f":"IMPRIMIR!B234","v":0},{"$f":"IMPRIMIR!C234","v":0},{"$f":"IF(E235=0,0,IMPRIMIR!D234)","v":0},{"$f":"IF(E235=0,0,IMPRIMIR!E234)","v":0},0,0,0]
[null,{"$f":"IF(E236=0,0,IMPRIMIR!A235)","v":0},{"$f":"IF(E236=0,0,IMPRIMIR!$D$3)","v":0},0,{"$f":"IMPRIMIR!B235","v":0},{"$f":"IMPRIMIR!C235","v":0},{"$f":"IF(E236=0,0,IMPRIMIR!D235)","v":0},{"$f":"IF(E236=0,0,IMPRIMIR!E235)","v":0},0,0,0]
[null,{"$f":"IF(E237=0,0,IMPRIMIR!A236)","v":0},{"$f":"IF(E237=0,0,IMPRIMIR!$D$3)","v":0},0,{"$f":"IMPRIMIR!B236","v":0},{"$f":"IMPRIMIR!C236","v":0},{"$f":"IF(E237=0,0,IMPRIMIR!D236)","v":0},{"$f":"IF(E237=0,0,IMPRIMIR!E236)","v":0},0,0,0]
[null,{"$f":"IF(E238=0,0,IMPRIMIR!A237)","v":0},{"$f":"IF(E238=0,0,IMPRIMIR!$D$3)","v":0},0,{"$f":"IMPRIMIR!B237","v":0},{"$f":"IMPRIMIR!C237","v":0},{"$f":"IF(E238=0,0,IMPRIMIR!D237)","v":0},{"$f":"IF(E238=0,0,IMPRIMIR!E237)","v":0},0,0,0]
[null,{"$f":"IF(E239=0,0,IMPRIMIR!A238)","v":0},{"$f":"IF(E239=0,0,IMPRIMIR!$D$3)","v":0},0,{"$f":"IMPRIMIR!B238","v":0},{"$f":"IMPRIMIR!C238","v":0},{"$f":"IF(E239=0,0,IMPRIMIR!D238)","v":0},{"$f":"IF(E239=0,0,IMPRIMIR!E238)","v":0},0,0,0]
[null,{"$f":"IF(E240=0,0,IMPRIMIR!A239)","v":0},{"$f":"IF(E240=0,0,IMPRIMIR!$D$3)","v":0},0,{"$f":"IMPRIMIR!B239","v":0},{"$f":"IMPRIMIR!C239","v":0},{"$f":"IF(E240=0,0,IMPRIMIR!D239)","v":0},{"$f":"IF(E240=0,0,IMPRIMIR!E239)","v":0},0,0,0]
[null,{"$f":"IF(E241=0,0,IMPRIMIR!A240)","v":0},{"$f":"IF(E241=0,0,IMPRIMIR!$D$3)","v":0},0,{"$f":"IMPRIMIR!B240","v":0},{"$f":"IMPRIMIR!C240","v":0},{"$f":"IF(E241=0,0,IMPRIMIR!D240)","v":0},{"$f":"IF(E241=0,0,IMPRIMIR!E240)","v":0},0,0,0]
[null,{"$f":"IF(E242=0,0,IMPRIMIR!A241)","v":0},{"$f":"IF(E242=0,0,IMPRIMIR!$D$3)","v":0},0,{"$f":"IMPRIMIR!B241","v":0},{"$f":"IMPRIMIR!C241","v":0},{"$f":"IF(E242=0,0,IMPRIMIR!D241)","v":0},{"$f":"IF(E242=0,0,IMPRIMIR!E241)","v":0},0,0,0]
[null,{"$f":"IF(E243=0,0,IMPRIMIR!A242)","v":0},{"$f":"IF(E243=0,0,IMPRIMIR!$D$3)","v":0},0,{"$f":"IMPRIMIR!B242","v":0},{"$f":"IMPRIMIR!C242","v":0},{"$f":"IF(E243=0,0,IMPRIMIR!D242)","v":0},{"$f":"IF(E243=0,0,IMPRIMIR!E242)","v":0},0,0,0]
[null,{"$f":"IF(E244=0,0,IMPRIMIR!A243)","v":0},{"$f":"IF(E244=0,0,IMPRIMIR!$D$3)","v":0},0,{"$f":"IMPRIMIR!B243","v":0},{"$f":"IMPRIMIR!C243","v":0},{"$f":"IF(E244=0,0,IMPRIMIR!D243)","v":0},{"$f":"IF(E244=0,0,IMPRIMIR!E243)","v":0},0,0,0]
[null,{"$f":"IF(E245=0,0,IMPRIMIR!A244)","v":0},{"$f":"IF(E245=0,0,IMPRIMIR!$D$3)","v":0},0,{"$f":"IMPRIMIR!B244","v":0},{"$f":"IMPRIMIR!C244","v":0},{"$f":"IF(E245=0,0,IMPRIMIR!D244)","v":0},{"$f":"IF(E245=0,0,IMPRIMIR!E244)","v":0},0,0,0]
[null,{"$f":"IF(E246=0,0,IMPRIMIR!A245)","v":0},{"$f":"IF(E246=0,0,IMPRIMIR!$D$3)","v":0},0,{"$f":"IMPRIMIR!B245","v":0},{"$f":"IMPRIMIR!C245","v":0},{"$f":"IF(E246=0,0,IMPRIMIR!D245)","v":0},{"$f":"IF(E246=0,0,IMPRIMIR!E245)","v":0},0,0,0]
[null,{"$f":"IF(E247=0,0,IMPRIMIR!A246)","v":0},{"$f":"IF(E247=0,0,IMPRIMIR!$D$3)","v":0},0,{"$f":"IMPRIMIR!B246","v":0},{"$f":"IMPRIMIR!C246","v":0},{"$f":"IF(E247=0,0,IMPRIMIR!D246)","v":0},{"$f":"IF(E247=0,0,IMPRIMIR!E246)","v":0},0,0,0]
[null,{"$f":"IF(E248=0,0,IMPRIMIR!A247)","v":0},{"$f":"IF(E248=0,0,IMPRIMIR!$D$3)","v":0},0,{"$f":"IMPRIMIR!B247","v":0},{"$f":"IMPRIMIR!C247","v":0},{"$f":"IF(E248=0,0,IMPRIMIR!D247)","v":0},{"$f":"IF(E248=0,0,IMPRIMIR!E247)","v":0},0,0,0]
[null,{"$f":"IF(E249=0,0,IMPRIMIR!A248)","v":0},{"$f":"IF(E249=0,0,IMPRIMIR!$D$3)","v":0},0,{"$f":"IMPRIMIR!B248","v":0},{"$f":"IMPRIMIR!C248","v":0},{"$f":"IF(E249=0,0,IMPRIMIR!D248)","v":0},{"$f":"IF(E249=0,0,IMPRIMIR!E248)","v":0},0,0,0]
[null,{"$f":"IF(E250=0,0,IMPRIMIR!A249)","v":0},{"$f":"IF(E250=0,0,IMPRIMIR!$D$3)","v":0},0,{"$f":"IMPRIMIR!B249","v":0},{"$f":"IMPRIMIR!C249","v":0},{"$f":"IF(E250=0,0,IMPRIMIR!D249)","v":0},{"$f":"IF(E250=0,0,IMPRIMIR!E249)","v":0},0,0,0]
[null,{"$f":"IF(E251=0,0,IMPRIMIR!A250)","v":0},{"$f":"IF(E251=0,0,IMPRIMIR!$D$3)","v":0},0,{"$f":"IMPRIMIR!B250","v":0},{"$f":"IMPRIMIR!C250","v":0},{"$f":"IF(E251=0,0,IMPRIMIR!D250)","v":0},{"$f":"IF(E251=0,0,IMPRIMIR!E250)","v":0},0,0,0]
[null,{"$f":"IF(E252=0,0,IMPRIMIR!A251)","v":0},{"$f":"IF(E252=0,0,IMPRIMIR!$D$3)","v":0},0,{"$f":"IMPRIMIR!B251","v":0},{"$f":"IMPRIMIR!C251","v":0},{"$f":"IF(E252=0,0,IMPRIMIR!D251)","v":0},{"$f":"IF(E252=0,0,IMPRIMIR!E251)","v":0},0,0,0]
[null,{"$f":"IF(E253=0,0,IMPRIMIR!A252)","v":0},{"$f":"IF(E253=0,0,IMPRIMIR!$D$3)","v":0},0,{"$f":"IMPRIMIR!B252","v":0},{"$f":"IMPRIMIR!C252","v":0},{"$f":"IF(E253=0,0,IMPRIMIR!D252)","v":0},{"$f":"IF(E253=0,0,IMPRIMIR!E252)","v":0},0,0,0]
[null,{"$f":"IF(E254=0,0,IMPRIMIR!A253)","v":0},{"$f":"IF(E254=0,0,IMPRIMIR!$D$3)","v":0},0,{"$f":"IMPRIMIR!B253","v":0},{"$f":"IMPRIMIR!C253","v":0},{"$f":"IF(E254=0,0,IMPRIMIR!D253)","v":0},{"$f":"IF(E254=0,0,IMPRIMIR!E253)","v":0},0,0,0]
[null,{"$f":"IF(E255=0,0,IMPRIMIR!A254)","v":0},{"$f":"IF(E255=0,0,IMPRIMIR!$D$3)","v":0},0,{"$f":"IMPRIMIR!B254","v":0},{"$f":"IMPRIMIR!C254","v":0},{"$f":"IF(E255=0,0,IMPRIMIR!D254)","v":0},{"$f":"IF(E255=0,0,IMPRIMIR!E254)","v":0},0,0,0]
[null,{"$f":"IF(E256=0,0,IMPRIMIR!A255)","v":0},{"$f":"IF(E256=0,0,IMPRIMIR!$D$3)","v":0},0,{"$f":"IMPRIMIR!B255","v":0},{"$f":"IMPRIMIR!C255","v":0},{"$f":"IF(E256=0,0,IMPRIMIR!D255)","v":0},{"$f":"IF(E256=0,0,IMPRIMIR!E255)","v":0},0,0,0]
[null,{"$f":"IF(E257=0,0,IMPRIMIR!A256)","v":0},{"$f":"IF(E257=0,0,IMPRIMIR!$D$3)","v":0},0,{"$f":"IMPRIMIR!B256","v":0},{"$f":"IMPRIMIR!C256","v":0},{"$f":"IF(E257=0,0,IMPRIMIR!D256)","v":0},{"$f":"IF(E257=0,0,IMPRIMIR!E256)","v":0},0,0,0]
[null,{"$f":"IF(E258=0,0,IMPRIMIR!A257)","v":0},{"$f":"IF(E258=0,0,IMPRIMIR!$D$3)","v":0},0,{"$f":"IMPRIMIR!B257","v":0},{"$f":"IMPRIMIR!C257","v":0},{"$f":"IF(E258=0,0,IMPRIMIR!D257)","v":0},{"$f":"IF(E258=0,0,IMPRIMIR!E257)","v":0},0,0,0]
[null,{"$f":"IF(E259=0,0,IMPRIMIR!A258)","v":0},{"$f":"IF(E259=0,0,IMPRIMIR!$D$3)","v":0},0,{"$f":"IMPRIMIR!B258","v":0},{"$f":"IMPRIMIR!C258","v":0},{"$f":"IF(E259=0,0,IMPRIMIR!D258)","v":0},{"$f":"IF(E259=0,0,IMPRIMIR!E258)","v":0},0,0,0]
[null,{"$f":"IF(E260=0,0,IMPRIMIR!A259)","v":0},{"$f":"IF(E260=0,0,IMPRIMIR!$D$3)","v":0},0,{"$f":"IMPRIMIR!B259","v":0},{"$f":"IMPRIMIR!C259","v":0},{"$f":"IF(E260=0,0,IMPRIMIR!D259)","v":0},{"$f":"IF(E260=0,0,IMPRIMIR!E259)","v":0},0,0,0]
[null,{"$f":"IF(E261=0,0,IMPRIMIR!A260)","v":0},{"$f":"IF(E261=0,0,IMPRIMIR!$D$3)","v":0},0,{"$f":"IMPRIMIR!B260","v":0},{"$f":"IMPRIMIR!C260","v":0},{"$f":"IF(E261=0,0,IMPRIMIR!D260)","v":0},{"$f":"IF(E261=0,0,IMPRIMIR!E260)","v":0},0,0,0]
[null,{"$f":"IF(E262=0,0,IMPRIMIR!A261)","v":0},{"$f":"IF(E262=0,0,IMPRIMIR!$D$3)","v":0},0,{"$f":"IMPRIMIR!B261","v":0},{"$f":"IMPRIMIR!C261","v":0},{"$f":"IF(E262=0,0,IMPRIMIR!D261)","v":0},{"$f":"IF(E262=0,0,IMPRIMIR!E261)","v":0},0,0,0]
[null,{"$f":"IF(E263=0,0,IMPRIMIR!A262)","v":0},{"$f":"IF(E263=0,0,IMPRIMIR!$D$3)","v":0},0,{"$f":"IMPRIMIR!B262","v":0},{"$f":"IMPRIMIR!C262","v":0},{"$f":"IF(E263=0,0,IMPRIMIR!D262)","v":0},{"$f":"IF(E263=0,0,IMPRIMIR!E262)","v":0},0,0,0]
[null,{"$f":"IF(E264=0,0,IMPRIMIR!A263)","v":0},{"$f":"IF(E264=0,0,IMPRIMIR!$D$3)","v":0},0,{"$f":"IMPRIMIR!B263","v":0},{"$f":"IMPRIMIR!C263","v":0},{"$f":"IF(E264=0,0,IMPRIMIR!D263)","v":0},{"$f":"IF(E264=0,0,IMPRIMIR!E263)","v":0},0,0,0]
[null,{"$f":"IF(E265=0,0,IMPRIMIR!A264)","v":0},{"$f":"IF(E265=0,0,IMPRIMIR!$D$3)","v":0},{"$f":"IF(E265=\"0\",0,$G$2)","v":0},{"$f":"IMPRIMIR!B264","v":0},{"$f":"IMPRIMIR!C264","v":0},{"$f":"IF(E265=0,0,IMPRIMIR!D264)","v":0},{"$f":"IF(E265=0,0,IMPRIMIR!E264)","v":0},{"$f":"IF(E265=0,0,$G$2)","v":0},{"$f":"IF(E265=0,0,$G$4)","v":0},{"$f":"IF(E265=0,0,$G$3)","v":0}]
[null,{"$f":"IF(E266=0,0,IMPRIMIR!A265)","v":0},{"$f":"IF(E266=0,0,IMPRIMIR!$D$3)","v":0},0,{"$f":"IMPRIMIR!B265","v":0},{"$f":"IMPRIMIR!C265","v":0},{"$f":"IF(E266=0,0,IMPRIMIR!D265)","v":0},{"$f":"IF(E266=0,0,IMPRIMIR!E265)","v":0},0,0,0]
[null,{"$f":"IF(E267=0,0,IMPRIMIR!A266)","v":0},{"$f":"IF(E267=0,0,IMPRIMIR!$D$3)","v":0},0,{"$f":"IMPRIMIR!B266","v":0},{"$f":"IMPRIMIR!C266","v":0},{"$f":"IF(E267=0,0,IMPRIMIR!D266)","v":0},{"$f":"IF(E267=0,0,IMPRIMIR!E266)","v":0},0,0,0]
[null,{"$f":"IF(E268=0,0,IMPRIMIR!A267)","v":0},{"$f":"IF(E268=0,0,IMPRIMIR!$D$3)","v":0},0,{"$f":"IMPRIMIR!B267","v":0},{"$f":"IMPRIMIR!C267","v":0},{"$f":"IF(E268=0,0,IMPRIMIR!D267)","v":0},{"$f":"IF(E268=0,0,IMPRIMIR!E267)","v":0},0,0,0]
[null,{"$f":"IF(E269=0,0,IMPRIMIR!A268)","v":0},{"$f":"IF(E269=0,0,IMPRIMIR!$D$3)","v":0},0,{"$f":"IMPRIMIR!B268","v":0},{"$f":"IMPRIMIR!C268","v":0},{"$f":"IF(E269=0,0,IMPRIMIR!D268)","v":0},{"$f":"IF(E269=0,0,IMPRIMIR!E268)","v":0},0,0,0]
[null,{"$f":"IF(E270=0,0,IMPRIMIR!A269)","v":0},{"$f":"IF(E270=0,0,IMPRIMIR!$D$3)","v":0},0,{"$f":"IMPRIMIR!B269","v":0},{"$f":"IMPRIMIR!C269","v":0},{"$f":"IF(E270=0,0,IMPRIMIR!D269)","v":0},{"$f":"IF(E270=0,0,IMPRIMIR!E269)","v":0},0,0,0]
[null,{"$f":"IF(E271=0,0,IMPRIMIR!A270)","v":0},{"$f":"IF(E271=0,0,IMPRIMIR!$D$3)","v":0},0,{"$f":"IMPRIMIR!B270","v":0},{"$f":"IMPRIMIR!C270","v":0},{"$f":"IF(E271=0,0,IMPRIMIR!D270)","v":0},{"$f":"IF(E271=0,0,IMPRIMIR!E270)","v":0},0,0,0]
[null,{"$f":"IF(E272=0,0,IMPRIMIR!A271)","v":0},{"$f":"IF(E272=0,0,IMPRIMIR!$D$3)","v":0},0,{"$f":"IMPRIMIR!B271","v":0},{"$f":"IMPRIMIR!C271","v":0},{"$f":"IF(E272=0,0,IMPRIMIR!D271)","v":0},{"$f":"IF(E272=0,0,IMPRIMIR!E271)","v":0},0,0,0]
[null,{"$f":"IF(E273=0,0,IMPRIMIR!A272)","v":0},{"$f":"IF(E273=0,0,IMPRIMIR!$D$3)","v":0},0,{"$f":"IMPRIMIR!B272","v":0},{"$f":"IMPRIMIR!C272","v":0},{"$f":"IF(E273=0,0,IMPRIMIR!D272)","v":0},{"$f":"IF(E273=0,0,IMPRIMIR!E272)","v":0},0,0,0]
[null,{"$f":"IF(E274=0,0,IMPRIMIR!A273)","v":0},{"$f":"IF(E274=0,0,IMPRIMIR!$D$3)","v":0},0,{"$f":"IMPRIMIR!B273","v":0},{"$f":"IMPRIMIR!C273","v":0},{"$f":"IF(E274=0,0,IMPRIMIR!D273)","v":0},{"$f":"IF(E274=0,0,IMPRIMIR!E273)","v":0},0,0,0]
[null,{"$f":"IF(E275=0,0,IMPRIMIR!A274)","v":0},{"$f":"IF(E275=0,0,IMPRIMIR!$D$3)","v":0},0,{"$f":"IMPRIMIR!B274","v":0},{"$f":"IMPRIMIR!C274","v":0},{"$f":"IF(E275=0,0,IMPRIMIR!D274)","v":0},{"$f":"IF(E275=0,0,IMPRIMIR!E274)","v":0},0,0,0]
[null,{"$f":"IF(E276=0,0,IMPRIMIR!A275)","v":0},{"$f":"IF(E276=0,0,IMPRIMIR!$D$3)","v":0},0,{"$f":"IMPRIMIR!B275","v":0},{"$f":"IMPRIMIR!C275","v":0},{"$f":"IF(E276=0,0,IMPRIMIR!D275)","v":0},{"$f":"IF(E276=0,0,IMPRIMIR!E275)","v":0},0,0,0]
[null,{"$f":"IF(E277=0,0,IMPRIMIR!A276)","v":0},{"$f":"IF(E277=0,0,IMPRIMIR!$D$3)","v":0},0,{"$f":"IMPRIMIR!B276","v":0},{"$f":"IMPRIMIR!C276","v":0},{"$f":"IF(E277=0,0,IMPRIMIR!D276)","v":0},{"$f":"IF(E277=0,0,IMPRIMIR!E276)","v":0},0,0,0]
[null,{"$f":"IF(E278=0,0,IMPRIMIR!A277)","v":0},{"$f":"IF(E278=0,0,IMPRIMIR!$D$3)","v":0},0,{"$f":"IMPRIMIR!B277","v":0},{"$f":"IMPRIMIR!C277","v":0},{"$f":"IF(E278=0,0,IMPRIMIR!D277)","v":0},{"$f":"IF(E278=0,0,IMPRIMIR!E277)","v":0},0,0,0]
[null,{"$f":"IF(E279=0,0,IMPRIMIR!A278)","v":0},{"$f":"IF(E279=0,0,IMPRIMIR!$D$3)","v":0},0,{"$f":"IMPRIMIR!B278","v":0},{"$f":"IMPRIMIR!C278","v":0},{"$f":"IF(E279=0,0,IMPRIMIR!D278)","v":0},{"$f":"IF(E279=0,0,IMPRIMIR!E278)","v":0},0,0,0]
[null,{"$f":"IF(E280=0,0,IMPRIMIR!A279)","v":0},{"$f":"IF(E280=0,0,IMPRIMIR!$D$3)","v":0},0,{"$f":"IMPRIMIR!B279","v":0},{"$f":"IMPRIMIR!C279","v":0},{"$f":"IF(E280=0,0,IMPRIMIR!D279)","v":0},{"$f":"IF(E280=0,0,IMPRIMIR!E279)","v":0},0,0,0]
[null,{"$f":"IF(E281=0,0,IMPRIMIR!A280)","v":0},{"$f":"IF(E281=0,0,IMPRIMIR!$D$3)","v":0},0,{"$f":"IMPRIMIR!B280","v":0},{"$f":"IMPRIMIR!C280","v":0},{"$f":"IF(E281=0,0,IMPRIMIR!D280)","v":0},{"$f":"IF(E281=0,0,IMPRIMIR!E280)","v":0},0,0,0]
[null,{"$f":"IF(E282=0,0,IMPRIMIR!A281)","v":0},{"$f":"IF(E282=0,0,IMPRIMIR!$D$3)","v":0},0,{"$f":"IMPRIMIR!B281","v":0},{"$f":"IMPRIMIR!C281","v":0},{"$f":"IF(E282=0,0,IMPRIMIR!D281)","v":0},{"$f":"IF(E282=0,0,IMPRIMIR!E281)","v":0},0,0,0]
[null,{"$f":"IF(E283=0,0,IMPRIMIR!A282)","v":0},{"$f":"IF(E283=0,0,IMPRIMIR!$D$3)","v":0},0,{"$f":"IMPRIMIR!B282","v":0},{"$f":"IMPRIMIR!C282","v":0},{"$f":"IF(E283=0,0,IMPRIMIR!D282)","v":0},{"$f":"IF(E283=0,0,IMPRIMIR!E282)","v":0},0,0,0]
[null,{"$f":"IF(E284=0,0,IMPRIMIR!A283)","v":0},{"$f":"IF(E284=0,0,IMPRIMIR!$D$3)","v":0},0,{"$f":"IMPRIMIR!B283","v":0},{"$f":"IMPRIMIR!C283","v":0},{"$f":"IF(E284=0,0,IMPRIMIR!D283)","v":0},{"$f":"IF(E284=0,0,IMPRIMIR!E283)","v":0},0,0,0]
[null,{"$f":"IF(E285=0,0,IMPRIMIR!A284)","v":0},{"$f":"IF(E285=0,0,IMPRIMIR!$D$3)","v":0},0,{"$f":"IMPRIMIR!B284","v":0},{"$f":"IMPRIMIR!C284","v":0},{"$f":"IF(E285=0,0,IMPRIMIR!D284)","v":0},{"$f":"IF(E285=0,0,IMPRIMIR!E284)","v":0},0,0,0]
[null,{"$f":"IF(E286=0,0,IMPRIMIR!A285)","v":0},{"$f":"IF(E286=0,0,IMPRIMIR!$D$3)","v":0},0,{"$f":"IMPRIMIR!B285","v":0},{"$f":"IMPRIMIR!C285","v":0},{"$f":"IF(E286=0,0,IMPRIMIR!D285)","v":0},{"$f":"IF(E286=0,0,IMPRIMIR!E285)","v":0},0,0,0]
[null,{"$f":"IF(E287=0,0,IMPRIMIR!A286)","v":0},{"$f":"IF(E287=0,0,IMPRIMIR!$D$3)","v":0},0,{"$f":"IMPRIMIR!B286","v":0},{"$f":"IMPRIMIR!C286","v":0},{"$f":"IF(E287=0,0,IMPRIMIR!D286)","v":0},{"$f":"IF(E287=0,0,IMPRIMIR!E286)","v":0},0,0,0]
[null,{"$f":"IF(E288=0,0,IMPRIMIR!A287)","v":0},{"$f":"IF(E288=0,0,IMPRIMIR!$D$3)","v":0},0,{"$f":"IMPRIMIR!B287","v":0},{"$f":"IMPRIMIR!C287","v":0},{"$f":"IF(E288=0,0,IMPRIMIR!D287)","v":0},{"$f":"IF(E288=0,0,IMPRIMIR!E287)","v":0},0,0,0]
[null,{"$f":"IF(E289=0,0,IMPRIMIR!A288)","v":0},{"$f":"IF(E289=0,0,IMPRIMIR!$D$3)","v":0},0,{"$f":"IMPRIMIR!B288","v":0},{"$f":"IMPRIMIR!C288","v":0},{"$f":"IF(E289=0,0,IMPRIMIR!D288)","v":0},{"$f":"IF(E289=0,0,IMPRIMIR!E288)","v":0},0,0,0]
[null,{"$f":"IF(E290=0,0,IMPRIMIR!A289)","v":0},{"$f":"IF(E290=0,0,IMPRIMIR!$D$3)","v":0},0,{"$f":"IMPRIMIR!B289","v":0},{"$f":"IMPRIMIR!C289","v":0},{"$f":"IF(E290=0,0,IMPRIMIR!D289)","v":0},{"$f":"IF(E290=0,0,IMPRIMIR!E289)","v":0},0,0,0]
[null,{"$f":"IF(E291=0,0,IMPRIMIR!A290)","v":0},{"$f":"IF(E291=0,0,IMPRIMIR!$D$3)","v":0},0,{"$f":"IMPRIMIR!B290","v":0},{"$f":"IMPRIMIR!C290","v":0},{"$f":"IF(E291=0,0,IMPRIMIR!D290)","v":0},{"$f":"IF(E291=0,0,IMPRIMIR!E290)","v":0},0,0,0]
[null,{"$f":"IF(E292=0,0,IMPRIMIR!A291)","v":0},{"$f":"IF(E292=0,0,IMPRIMIR!$D$3)","v":0},0,{"$f":"IMPRIMIR!B291","v":0},{"$f":"IMPRIMIR!C291","v":0},{"$f":"IF(E292=0,0,IMPRIMIR!D291)","v":0},{"$f":"IF(E292=0,0,IMPRIMIR!E291)","v":0},0,0,0]
[null,{"$f":"IF(E293=0,0,IMPRIMIR!A292)","v":0},{"$f":"IF(E293=0,0,IMPRIMIR!$D$3)","v":0},0,{"$f":"IMPRIMIR!B292","v":0},{"$f":"IMPRIMIR!C292","v":0},{"$f":"IF(E293=0,0,IMPRIMIR!D292)","v":0},{"$f":"IF(E293=0,0,IMPRIMIR!E292)","v":0},0,0,0]
[null,{"$f":"IF(E294=0,0,IMPRIMIR!A293)","v":0},{"$f":"IF(E294=0,0,IMPRIMIR!$D$3)","v":0},0,{"$f":"IMPRIMIR!B293","v":0},{"$f":"IMPRIMIR!C293","v":0},{"$f":"IF(E294=0,0,IMPRIMIR!D293)","v":0},{"$f":"IF(E294=0,0,IMPRIMIR!E293)","v":0},0,0,0]
[null,{"$f":"IF(E295=0,0,IMPRIMIR!A294)","v":0},{"$f":"IF(E295=0,0,IMPRIMIR!$D$3)","v":0},0,{"$f":"IMPRIMIR!B294","v":0},{"$f":"IMPRIMIR!C294","v":0},{"$f":"IF(E295=0,0,IMPRIMIR!D294)","v":0},{"$f":"IF(E295=0,0,IMPRIMIR!E294)","v":0},0,0,0]
[null,{"$f":"IF(E296=0,0,IMPRIMIR!A295)","v":0},{"$f":"IF(E296=0,0,IMPRIMIR!$D$3)","v":0},0,{"$f":"IMPRIMIR!B295","v":0},{"$f":"IMPRIMIR!C295","v":0},{"$f":"IF(E296=0,0,IMPRIMIR!D295)","v":0},{"$f":"IF(E296=0,0,IMPRIMIR!E295)","v":0},0,0,0]
[null,{"$f":"IF(E297=0,0,IMPRIMIR!A296)","v":0},{"$f":"IF(E297=0,0,IMPRIMIR!$D$3)","v":0},0,{"$f":"IMPRIMIR!B296","v":0},{"$f":"IMPRIMIR!C296","v":0},{"$f":"IF(E297=0,0,IMPRIMIR!D296)","v":0},{"$f":"IF(E297=0,0,IMPRIMIR!E296)","v":0},0,0,0]
[null,{"$f":"IF(E298=0,0,IMPRIMIR!A297)","v":0},{"$f":"IF(E298=0,0,IMPRIMIR!$D$3)","v":0},0,{"$f":"IMPRIMIR!B297","v":0},{"$f":"IMPRIMIR!C297","v":0},{"$f":"IF(E298=0,0,IMPRIMIR!D297)","v":0},{"$f":"IF(E298=0,0,IMPRIMIR!E297)","v":0},0,0,0]
[null,{"$f":"IF(E299=0,0,IMPRIMIR!A298)","v":0},{"$f":"IF(E299=0,0,IMPRIMIR!$D$3)","v":0},0,{"$f":"IMPRIMIR!B298","v":0},{"$f":"IMPRIMIR!C298","v":0},{"$f":"IF(E299=0,0,IMPRIMIR!D298)","v":0},{"$f":"IF(E299=0,0,IMPRIMIR!E298)","v":0},0,0,0]
[null,{"$f":"IF(E300=0,0,IMPRIMIR!A299)","v":0},{"$f":"IF(E300=0,0,IMPRIMIR!$D$3)","v":0},0,{"$f":"IMPRIMIR!B299","v":0},{"$f":"IMPRIMIR!C299","v":0},{"$f":"IF(E300=0,0,IMPRIMIR!D299)","v":0},{"$f":"IF(E300=0,0,IMPRIMIR!E299)","v":0},0,0,0]
[null,{"$f":"IF(E301=0,0,IMPRIMIR!A300)","v":0},{"$f":"IF(E301=0,0,IMPRIMIR!$D$3)","v":0},0,{"$f":"IMPRIMIR!B300","v":0},{"$f":"IMPRIMIR!C300","v":0},{"$f":"IF(E301=0,0,IMPRIMIR!D300)","v":0},{"$f":"IF(E301=0,0,IMPRIMIR!E300)","v":0},0,0,0]
[null,{"$f":"IF(E302=0,0,IMPRIMIR!A301)","v":0},{"$f":"IF(E302=0,0,IMPRIMIR!$D$3)","v":0},0,{"$f":"IMPRIMIR!B301","v":0},{"$f":"IMPRIMIR!C301","v":0},{"$f":"IF(E302=0,0,IMPRIMIR!D301)","v":0},{"$f":"IF(E302=0,0,IMPRIMIR!E301)","v":0},0,0,0]
[null,{"$f":"IF(E303=0,0,IMPRIMIR!A302)","v":0},{"$f":"IF(E303=0,0,IMPRIMIR!$D$3)","v":0},0,{"$f":"IMPRIMIR!B302","v":0},{"$f":"IMPRIMIR!C302","v":0},{"$f":"IF(E303=0,0,IMPRIMIR!D302)","v":0},{"$f":"IF(E303=0,0,IMPRIMIR!E302)","v":0},0,0,0]
[null,{"$f":"IF(E304=0,0,IMPRIMIR!A303)","v":0},{"$f":"IF(E304=0,0,IMPRIMIR!$D$3)","v":0},0,{"$f":"IMPRIMIR!B303","v":0},{"$f":"IMPRIMIR!C303","v":0},{"$f":"IF(E304=0,0,IMPRIMIR!D303)","v":0},{"$f":"IF(E304=0,0,IMPRIMIR!E303)","v":0},0,0,0]
[null,{"$f":"IF(E305=0,0,IMPRIMIR!A304)","v":0},{"$f":"IF(E305=0,0,IMPRIMIR!$D$3)","v":0},0,{"$f":"IMPRIMIR!B304","v":0},{"$f":"IMPRIMIR!C304","v":0},{"$f":"IF(E305=0,0,IMPRIMIR!D304)","v":0},{"$f":"IF(E305=0,0,IMPRIMIR!E304)","v":0},0,0,0]
[null,{"$f":"IF(E306=0,0,IMPRIMIR!A305)","v":0},{"$f":"IF(E306=0,0,IMPRIMIR!$D$3)","v":0},0,{"$f":"IMPRIMIR!B305","v":0},{"$f":"IMPRIMIR!C305","v":0},{"$f":"IF(E306=0,0,IMPRIMIR!D305)","v":0},{"$f":"IF(E306=0,0,IMPRIMIR!E305)","v":0},0,0,0]
[null,{"$f":"IF(E307=0,0,IMPRIMIR!A306)","v":0},{"$f":"IF(E307=0,0,IMPRIMIR!$D$3)","v":0},0,{"$f":"IMPRIMIR!B306","v":0},{"$f":"IMPRIMIR!C306","v":0},{"$f":"IF(E307=0,0,IMPRIMIR!D306)","v":0},{"$f":"IF(E307=0,0,IMPRIMIR!E306)","v":0},0,0,0]
[null,{"$f":"IF(E308=0,0,IMPRIMIR!A307)","v":0},{"$f":"IF(E308=0,0,IMPRIMIR!$D$3)","v":0},0,{"$f":"IMPRIMIR!B307","v":0},{"$f":"IMPRIMIR!C307","v":0},{"$f":"IF(E308=0,0,IMPRIMIR!D307)","v":0},{"$f":"IF(E308=0,0,IMPRIMIR!E307)","v":0},0,0,0]
[null,{"$f":"IF(E309=0,0,IMPRIMIR!A308)","v":0},{"$f":"IF(E309=0,0,IMPRIMIR!$D$3)","v":0},0,{"$f":"IMPRIMIR!B308","v":0},{"$f":"IMPRIMIR!C308","v":0},{"$f":"IF(E309=0,0,IMPRIMIR!D308)","v":0},{"$f":"IF(E309=0,0,IMPRIMIR!E308)","v":0},0,0,0]
[null,{"$f":"IF(E310=0,0,IMPRIMIR!A309)","v":0},{"$f":"IF(E310=0,0,IMPRIMIR!$D$3)","v":0},0,{"$f":"IMPRIMIR!B309","v":0},{"$f":"IMPRIMIR!C309","v":0},{"$f":"IF(E310=0,0,IMPRIMIR!D309)","v":0},{"$f":"IF(E310=0,0,IMPRIMIR!E309)","v":0},0,0,0]
[null,{"$f":"IF(E311=0,0,IMPRIMIR!A310)","v":0},{"$f":"IF(E311=0,0,IMPRIMIR!$D$3)","v":0},0,{"$f":"IMPRIMIR!B310","v":0},{"$f":"IMPRIMIR!C310","v":0},{"$f":"IF(E311=0,0,IMPRIMIR!D310)","v":0},{"$f":"IF(E311=0,0,IMPRIMIR!E310)","v":0},0,0,0]
[null,{"$f":"IF(E312=0,0,IMPRIMIR!A311)","v":0},{"$f":"IF(E312=0,0,IMPRIMIR!$D$3)","v":0},0,{"$f":"IMPRIMIR!B311","v":0},{"$f":"IMPRIMIR!C311","v":0},{"$f":"IF(E312=0,0,IMPRIMIR!D311)","v":0},{"$f":"IF(E312=0,0,IMPRIMIR!E311)","v":0},0,0,0]
[null,{"$f":"IF(E313=0,0,IMPRIMIR!A312)","v":0},{"$f":"IF(E313=0,0,IMPRIMIR!$D$3)","v":0},0,{"$f":"IMPRIMIR!B312","v":0},{"$f":"IMPRIMIR!C312","v":0},{"$f":"IF(E313=0,0,IMPRIMIR!D312)","v":0},{"$f":"IF(E313=0,0,IMPRIMIR!E312)","v":0},0,0,0]
[null,{"$f":"IF(E314=0,0,IMPRIMIR!A313)","v":0},{"$f":"IF(E314=0,0,IMPRIMIR!$D$3)","v":0},0,{"$f":"IMPRIMIR!B313","v":0},{"$f":"IMPRIMIR!C313","v":0},{"$f":"IF(E314=0,0,IMPRIMIR!D313)","v":0},{"$f":"IF(E314=0,0,IMPRIMIR!E313)","v":0},0,0,0]
[null,{"$f":"IF(E315=0,0,IMPRIMIR!A314)","v":0},{"$f":"IF(E315=0,0,IMPRIMIR!$D$3)","v":0},0,{"$f":"IMPRIMIR!B314","v":0},{"$f":"IMPRIMIR!C314","v":0},{"$f":"IF(E315=0,0,IMPRIMIR!D314)","v":0},{"$f":"IF(E315=0,0,IMPRIMIR!E314)","v":0},0,0,0]
[null,{"$f":"IF(E316=0,0,IMPRIMIR!A315)","v":0},{"$f":"IF(E316=0,0,IMPRIMIR!$D$3)","v":0},0,{"$f":"IMPRIMIR!B315","v":0},{"$f":"IMPRIMIR!C315","v":0},{"$f":"IF(E316=0,0,IMPRIMIR!D315)","v":0},{"$f":"IF(E316=0,0,IMPRIMIR!E315)","v":0},0,0,0]
[null,{"$f":"IF(E317=0,0,IMPRIMIR!A316)","v":0},{"$f":"IF(E317=0,0,IMPRIMIR!$D$3)","v":0},0,{"$f":"IMPRIMIR!B316","v":0},{"$f":"IMPRIMIR!C316","v":0},{"$f":"IF(E317=0,0,IMPRIMIR!D316)","v":0},{"$f":"IF(E317=0,0,IMPRIMIR!E316)","v":0},0,0,0]
[null,{"$f":"IF(E318=0,0,IMPRIMIR!A317)","v":0},{"$f":"IF(E318=0,0,IMPRIMIR!$D$3)","v":0},0,{"$f":"IMPRIMIR!B317","v":0},{"$f":"IMPRIMIR!C317","v":0},{"$f":"IF(E318=0,0,IMPRIMIR!D317)","v":0},{"$f":"IF(E318=0,0,IMPRIMIR!E317)","v":0},0,0,0]
[null,{"$f":"IF(E319=0,0,IMPRIMIR!A318)","v":0},{"$f":"IF(E319=0,0,IMPRIMIR!$D$3)","v":0},0,{"$f":"IMPRIMIR!B318","v":0},{"$f":"IMPRIMIR!C318","v":0},{"$f":"IF(E319=0,0,IMPRIMIR!D318)","v":0},{"$f":"IF(E319=0,0,IMPRIMIR!E318)","v":0},0,0,0]
[null,{"$f":"IF(E320=0,0,IMPRIMIR!A319)","v":0},{"$f":"IF(E320=0,0,IMPRIMIR!$D$3)","v":0},0,{"$f":"IMPRIMIR!B319","v":0},{"$f":"IMPRIMIR!C319","v":0},{"$f":"IF(E320=0,0,IMPRIMIR!D319)","v":0},{"$f":"IF(E320=0,0,IMPRIMIR!E319)","v":0},0,0,0]
[null,{"$f":"IF(E321=0,0,IMPRIMIR!A320)","v":0},{"$f":"IF(E321=0,0,IMPRIMIR!$D$3)","v":0},0,{"$f":"IMPRIMIR!B320","v":0},{"$f":"IMPRIMIR!C320","v":0},{"$f":"IF(E321=0,0,IMPRIMIR!D320)","v":0},{"$f":"IF(E321=0,0,IMPRIMIR!E320)","v":0},0,0,0]
[null,{"$f":"IF(E322=0,0,IMPRIMIR!A321)","v":0},{"$f":"IF(E322=0,0,IMPRIMIR!$D$3)","v":0},0,{"$f":"IMPRIMIR!B321","v":0},{"$f":"IMPRIMIR!C321","v":0},{"$f":"IF(E322=0,0,IMPRIMIR!D321)","v":0},{"$f":"IF(E322=0,0,IMPRIMIR!E321)","v":0},0,0,0]
[null,{"$f":"IF(E323=0,0,IMPRIMIR!A322)","v":0},{"$f":"IF(E323=0,0,IMPRIMIR!$D$3)","v":0},0,{"$f":"IMPRIMIR!B322","v":0},{"$f":"IMPRIMIR!C322","v":0},{"$f":"IF(E323=0,0,IMPRIMIR!D322)","v":0},{"$f":"IF(E323=0,0,IMPRIMIR!E322)","v":0},0,0,0]
[null,{"$f":"IF(E324=0,0,IMPRIMIR!A323)","v":0},{"$f":"IF(E324=0,0,IMPRIMIR!$D$3)","v":0},0,{"$f":"IMPRIMIR!B323","v":0},{"$f":"IMPRIMIR!C323","v":0},{"$f":"IF(E324=0,0,IMPRIMIR!D323)","v":0},{"$f":"IF(E324=0,0,IMPRIMIR!E323)","v":0},0,0,0]
[null,{"$f":"IF(E325=0,0,IMPRIMIR!A324)","v":0},{"$f":"IF(E325=0,0,IMPRIMIR!$D$3)","v":0},0,{"$f":"IMPRIMIR!B324","v":0},{"$f":"IMPRIMIR!C324","v":0},{"$f":"IF(E325=0,0,IMPRIMIR!D324)","v":0},{"$f":"IF(E325=0,0,IMPRIMIR!E324)","v":0},0,0,0]
[null,{"$f":"IF(E326=0,0,IMPRIMIR!A325)","v":0},{"$f":"IF(E326=0,0,IMPRIMIR!$D$3)","v":0},0,{"$f":"IMPRIMIR!B325","v":0},{"$f":"IMPRIMIR!C325","v":0},{"$f":"IF(E326=0,0,IMPRIMIR!D325)","v":0},{"$f":"IF(E326=0,0,IMPRIMIR!E325)","v":0},0,0,0]
[null,{"$f":"IF(E327=0,0,IMPRIMIR!A326)","v":0},{"$f":"IF(E327=0,0,IMPRIMIR!$D$3)","v":0},0,{"$f":"IMPRIMIR!B326","v":0},{"$f":"IMPRIMIR!C326","v":0},{"$f":"IF(E327=0,0,IMPRIMIR!D326)","v":0},{"$f":"IF(E327=0,0,IMPRIMIR!E326)","v":0},0,0,0]
[null,{"$f":"IF(E328=0,0,IMPRIMIR!A327)","v":0},{"$f":"IF(E328=0,0,IMPRIMIR!$D$3)","v":0},0,{"$f":"IMPRIMIR!B327","v":0},{"$f":"IMPRIMIR!C327","v":0},{"$f":"IF(E328=0,0,IMPRIMIR!D327)","v":0},{"$f":"IF(E328=0,0,IMPRIMIR!E327)","v":0},0,0,0]
[null,{"$f":"IF(E329=0,0,IMPRIMIR!A328)","v":0},{"$f":"IF(E329=0,0,IMPRIMIR!$D$3)","v":0},{"$f":"IF(E329=\"0\",0,$G$2)","v":0},{"$f":"IMPRIMIR!B328","v":0},{"$f":"IMPRIMIR!C328","v":0},{"$f":"IF(E329=0,0,IMPRIMIR!D328)","v":0},{"$f":"IF(E329=0,0,IMPRIMIR!E328)","v":0},{"$f":"IF(E329=0,0,$G$2)","v":0},{"$f":"IF(E329=0,0,$G$4)","v":0},{"$f":"IF(E329=0,0,$G$3)","v":0}]
[null,{"$f":"IF(E330=0,0,IMPRIMIR!A329)","v":0},{"$f":"IF(E330=0,0,IMPRIMIR!$D$3)","v":0},0,{"$f":"IMPRIMIR!B329","v":0},{"$f":"IMPRIMIR!C329","v":0},{"$f":"IF(E330=0,0,IMPRIMIR!D329)","v":0},{"$f":"IF(E330=0,0,IMPRIMIR!E329)","v":0},0,0,0]
[null,{"$f":"IF(E331=0,0,IMPRIMIR!A330)","v":0},{"$f":"IF(E331=0,0,IMPRIMIR!$D$3)","v":0},0,{"$f":"IMPRIMIR!B330","v":0},{"$f":"IMPRIMIR!C330","v":0},{"$f":"IF(E331=0,0,IMPRIMIR!D330)","v":0},{"$f":"IF(E331=0,0,IMPRIMIR!E330)","v":0},0,0,0]
[null,{"$f":"IF(E332=0,0,IMPRIMIR!A331)","v":0},{"$f":"IF(E332=0,0,IMPRIMIR!$D$3)","v":0},0,{"$f":"IMPRIMIR!B331","v":0},{"$f":"IMPRIMIR!C331","v":0},{"$f":"IF(E332=0,0,IMPRIMIR!D331)","v":0},{"$f":"IF(E332=0,0,IMPRIMIR!E331)","v":0},0,0,0]
[null,{"$f":"IF(E333=0,0,IMPRIMIR!A332)","v":0},{"$f":"IF(E333=0,0,IMPRIMIR!$D$3)","v":0},0,{"$f":"IMPRIMIR!B332","v":0},{"$f":"IMPRIMIR!C332","v":0},{"$f":"IF(E333=0,0,IMPRIMIR!D332)","v":0},{"$f":"IF(E333=0,0,IMPRIMIR!E332)","v":0},0,0,0]
[null,{"$f":"IF(E334=0,0,IMPRIMIR!A333)","v":0},{"$f":"IF(E334=0,0,IMPRIMIR!$D$3)","v":0},0,{"$f":"IMPRIMIR!B333","v":0},{"$f":"IMPRIMIR!C333","v":0},{"$f":"IF(E334=0,0,IMPRIMIR!D333)","v":0},{"$f":"IF(E334=0,0,IMPRIMIR!E333)","v":0},0,0,0]
[null,{"$f":"IF(E335=0,0,IMPRIMIR!A334)","v":0},{"$f":"IF(E335=0,0,IMPRIMIR!$D$3)","v":0},0,{"$f":"IMPRIMIR!B334","v":0},{"$f":"IMPRIMIR!C334","v":0},{"$f":"IF(E335=0,0,IMPRIMIR!D334)","v":0},{"$f":"IF(E335=0,0,IMPRIMIR!E334)","v":0},0,0,0]
[null,{"$f":"IF(E336=0,0,IMPRIMIR!A335)","v":0},{"$f":"IF(E336=0,0,IMPRIMIR!$D$3)","v":0},0,{"$f":"IMPRIMIR!B335","v":0},{"$f":"IMPRIMIR!C335","v":0},{"$f":"IF(E336=0,0,IMPRIMIR!D335)","v":0},{"$f":"IF(E336=0,0,IMPRIMIR!E335)","v":0},0,0,0]
[null,{"$f":"IF(E337=0,0,IMPRIMIR!A336)","v":0},{"$f":"IF(E337=0,0,IMPRIMIR!$D$3)","v":0},0,{"$f":"IMPRIMIR!B336","v":0},{"$f":"IMPRIMIR!C336","v":0},{"$f":"IF(E337=0,0,IMPRIMIR!D336)","v":0},{"$f":"IF(E337=0,0,IMPRIMIR!E336)","v":0},0,0,0]
[null,{"$f":"IF(E338=0,0,IMPRIMIR!A337)","v":0},{"$f":"IF(E338=0,0,IMPRIMIR!$D$3)","v":0},0,{"$f":"IMPRIMIR!B337","v":0},{"$f":"IMPRIMIR!C337","v":0},{"$f":"IF(E338=0,0,IMPRIMIR!D337)","v":0},{"$f":"IF(E338=0,0,IMPRIMIR!E337)","v":0},0,0,0]
[null,{"$f":"IF(E339=0,0,IMPRIMIR!A338)","v":0},{"$f":"IF(E339=0,0,IMPRIMIR!$D$3)","v":0},0,{"$f":"IMPRIMIR!B338","v":0},{"$f":"IMPRIMIR!C338","v":0},{"$f":"IF(E339=0,0,IMPRIMIR!D338)","v":0},{"$f":"IF(E339=0,0,IMPRIMIR!E338)","v":0},0,0,0]
[null,{"$f":"IF(E340=0,0,IMPRIMIR!A339)","v":0},{"$f":"IF(E340=0,0,IMPRIMIR!$D$3)","v":0},0,{"$f":"IMPRIMIR!B339","v":0},{"$f":"IMPRIMIR!C339","v":0},{"$f":"IF(E340=0,0,IMPRIMIR!D339)","v":0},{"$f":"IF(E340=0,0,IMPRIMIR!E339)","v":0},0,0,0]
[null,{"$f":"IF(E341=0,0,IMPRIMIR!A340)","v":0},{"$f":"IF(E341=0,0,IMPRIMIR!$D$3)","v":0},0,{"$f":"IMPRIMIR!B340","v":0},{"$f":"IMPRIMIR!C340","v":0},{"$f":"IF(E341=0,0,IMPRIMIR!D340)","v":0},{"$f":"IF(E341=0,0,IMPRIMIR!E340)","v":0},0,0,0]
[null,{"$f":"IF(E342=0,0,IMPRIMIR!A341)","v":0},{"$f":"IF(E342=0,0,IMPRIMIR!$D$3)","v":0},0,{"$f":"IMPRIMIR!B341","v":0},{"$f":"IMPRIMIR!C341","v":0},{"$f":"IF(E342=0,0,IMPRIMIR!D341)","v":0},{"$f":"IF(E342=0,0,IMPRIMIR!E341)","v":0},0,0,0]
[null,{"$f":"IF(E343=0,0,IMPRIMIR!A342)","v":0},{"$f":"IF(E343=0,0,IMPRIMIR!$D$3)","v":0},0,{"$f":"IMPRIMIR!B342","v":0},{"$f":"IMPRIMIR!C342","v":0},{"$f":"IF(E343=0,0,IMPRIMIR!D342)","v":0},{"$f":"IF(E343=0,0,IMPRIMIR!E342)","v":0},0,0,0]
[null,{"$f":"IF(E344=0,0,IMPRIMIR!A343)","v":0},{"$f":"IF(E344=0,0,IMPRIMIR!$D$3)","v":0},0,{"$f":"IMPRIMIR!B343","v":0},{"$f":"IMPRIMIR!C343","v":0},{"$f":"IF(E344=0,0,IMPRIMIR!D343)","v":0},{"$f":"IF(E344=0,0,IMPRIMIR!E343)","v":0},0,0,0]
[null,{"$f":"IF(E345=0,0,IMPRIMIR!A344)","v":0},{"$f":"IF(E345=0,0,IMPRIMIR!$D$3)","v":0},0,{"$f":"IMPRIMIR!B344","v":0},{"$f":"IMPRIMIR!C344","v":0},{"$f":"IF(E345=0,0,IMPRIMIR!D344)","v":0},{"$f":"IF(E345=0,0,IMPRIMIR!E344)","v":0},0,0,0]
[null,{"$f":"IF(E346=0,0,IMPRIMIR!A345)","v":0},{"$f":"IF(E346=0,0,IMPRIMIR!$D$3)","v":0},0,{"$f":"IMPRIMIR!B345","v":0},{"$f":"IMPRIMIR!C345","v":0},{"$f":"IF(E346=0,0,IMPRIMIR!D345)","v":0},{"$f":"IF(E346=0,0,IMPRIMIR!E345)","v":0},0,0,0]
[null,{"$f":"IF(E347=0,0,IMPRIMIR!A346)","v":0},{"$f":"IF(E347=0,0,IMPRIMIR!$D$3)","v":0},0,{"$f":"IMPRIMIR!B346","v":0},{"$f":"IMPRIMIR!C346","v":0},{"$f":"IF(E347=0,0,IMPRIMIR!D346)","v":0},{"$f":"IF(E347=0,0,IMPRIMIR!E346)","v":0},0,0,0]
[null,{"$f":"IF(E348=0,0,IMPRIMIR!A347)","v":0},{"$f":"IF(E348=0,0,IMPRIMIR!$D$3)","v":0},0,{"$f":"IMPRIMIR!B347","v":0},{"$f":"IMPRIMIR!C347","v":0},{"$f":"IF(E348=0,0,IMPRIMIR!D347)","v":0},{"$f":"IF(E348=0,0,IMPRIMIR!E347)","v":0},0,0,0]
[null,{"$f":"IF(E349=0,0,IMPRIMIR!A348)","v":0},{"$f":"IF(E349=0,0,IMPRIMIR!$D$3)","v":0},0,{"$f":"IMPRIMIR!B348","v":0},{"$f":"IMPRIMIR!C348","v":0},{"$f":"IF(E349=0,0,IMPRIMIR!D348)","v":0},{"$f":"IF(E349=0,0,IMPRIMIR!E348)","v":0},0,0,0]
[null,{"$f":"IF(E350=0,0,IMPRIMIR!A349)","v":0},{"$f":"IF(E350=0,0,IMPRIMIR!$D$3)","v":0},0,{"$f":"IMPRIMIR!B349","v":0},{"$f":"IMPRIMIR!C349","v":0},{"$f":"IF(E350=0,0,IMPRIMIR!D349)","v":0},{"$f":"IF(E350=0,0,IMPRIMIR!E349)","v":0},0,0,0]
[null,{"$f":"IF(E351=0,0,IMPRIMIR!A350)","v":0},{"$f":"IF(E351=0,0,IMPRIMIR!$D$3)","v":0},0,{"$f":"IMPRIMIR!B350","v":0},{"$f":"IMPRIMIR!C350","v":0},{"$f":"IF(E351=0,0,IMPRIMIR!D350)","v":0},{"$f":"IF(E351=0,0,IMPRIMIR!E350)","v":0},0,0,0]
[null,{"$f":"IF(E352=0,0,IMPRIMIR!A351)","v":0},{"$f":"IF(E352=0,0,IMPRIMIR!$D$3)","v":0},0,{"$f":"IMPRIMIR!B351","v":0},{"$f":"IMPRIMIR!C351","v":0},{"$f":"IF(E352=0,0,IMPRIMIR!D351)","v":0},{"$f":"IF(E352=0,0,IMPRIMIR!E351)","v":0},0,0,0]
[null,{"$f":"IF(E353=0,0,IMPRIMIR!A352)","v":0},{"$f":"IF(E353=0,0,IMPRIMIR!$D$3)","v":0},0,{"$f":"IMPRIMIR!B352","v":0},{"$f":"IMPRIMIR!C352","v":0},{"$f":"IF(E353=0,0,IMPRIMIR!D352)","v":0},{"$f":"IF(E353=0,0,IMPRIMIR!E352)","v":0},0,0,0]
[null,{"$f":"IF(E354=0,0,IMPRIMIR!A353)","v":0},{"$f":"IF(E354=0,0,IMPRIMIR!$D$3)","v":0},0,{"$f":"IMPRIMIR!B353","v":0},{"$f":"IMPRIMIR!C353","v":0},{"$f":"IF(E354=0,0,IMPRIMIR!D353)","v":0},{"$f":"IF(E354=0,0,IMPRIMIR!E353)","v":0},0,0,0]
[null,{"$f":"IF(E355=0,0,IMPRIMIR!A354)","v":0},{"$f":"IF(E355=0,0,IMPRIMIR!$D$3)","v":0},0,{"$f":"IMPRIMIR!B354","v":0},{"$f":"IMPRIMIR!C354","v":0},{"$f":"IF(E355=0,0,IMPRIMIR!D354)","v":0},{"$f":"IF(E355=0,0,IMPRIMIR!E354)","v":0},0,0,0]
[null,{"$f":"IF(E356=0,0,IMPRIMIR!A355)","v":0},{"$f":"IF(E356=0,0,IMPRIMIR!$D$3)","v":0},0,{"$f":"IMPRIMIR!B355","v":0},{"$f":"IMPRIMIR!C355","v":0},{"$f":"IF(E356=0,0,IMPRIMIR!D355)","v":0},{"$f":"IF(E356=0,0,IMPRIMIR!E355)","v":0},0,0,0]
[null,{"$f":"IF(E357=0,0,IMPRIMIR!A356)","v":0},{"$f":"IF(E357=0,0,IMPRIMIR!$D$3)","v":0},0,{"$f":"IMPRIMIR!B356","v":0},{"$f":"IMPRIMIR!C356","v":0},{"$f":"IF(E357=0,0,IMPRIMIR!D356)","v":0},{"$f":"IF(E357=0,0,IMPRIMIR!E356)","v":0},0,0,0]
[null,{"$f":"IF(E358=0,0,IMPRIMIR!A357)","v":0},{"$f":"IF(E358=0,0,IMPRIMIR!$D$3)","v":0},0,{"$f":"IMPRIMIR!B357","v":0},{"$f":"IMPRIMIR!C357","v":0},{"$f":"IF(E358=0,0,IMPRIMIR!D357)","v":0},{"$f":"IF(E358=0,0,IMPRIMIR!E357)","v":0},0,0,0]
[null,{"$f":"IF(E359=0,0,IMPRIMIR!A358)","v":0},{"$f":"IF(E359=0,0,IMPRIMIR!$D$3)","v":0},0,{"$f":"IMPRIMIR!B358","v":0},{"$f":"IMPRIMIR!C358","v":0},{"$f":"IF(E359=0,0,IMPRIMIR!D358)","v":0},{"$f":"IF(E359=0,0,IMPRIMIR!E358)","v":0},0,0,0]
[null,{"$f":"IF(E360=0,0,IMPRIMIR!A359)","v":0},{"$f":"IF(E360=0,0,IMPRIMIR!$D$3)","v":0},0,{"$f":"IMPRIMIR!B359","v":0},{"$f":"IMPRIMIR!C359","v":0},{"$f":"IF(E360=0,0,IMPRIMIR!D359)","v":0},{"$f":"IF(E360=0,0,IMPRIMIR!E359)","v":0},0,0,0]
[null,{"$f":"IF(E361=0,0,IMPRIMIR!A360)","v":0},{"$f":"IF(E361=0,0,IMPRIMIR!$D$3)","v":0},0,{"$f":"IMPRIMIR!B360","v":0},{"$f":"IMPRIMIR!C360","v":0},{"$f":"IF(E361=0,0,IMPRIMIR!D360)","v":0},{"$f":"IF(E361=0,0,IMPRIMIR!E360)","v":0},0,0,0]
[null,{"$f":"IF(E362=0,0,IMPRIMIR!A361)","v":0},{"$f":"IF(E362=0,0,IMPRIMIR!$D$3)","v":0},0,{"$f":"IMPRIMIR!B361","v":0},{"$f":"IMPRIMIR!C361","v":0},{"$f":"IF(E362=0,0,IMPRIMIR!D361)","v":0},{"$f":"IF(E362=0,0,IMPRIMIR!E361)","v":0},0,0,0]
[null,{"$f":"IF(E363=0,0,IMPRIMIR!A362)","v":0},{"$f":"IF(E363=0,0,IMPRIMIR!$D$3)","v":0},0,{"$f":"IMPRIMIR!B362","v":0},{"$f":"IMPRIMIR!C362","v":0},{"$f":"IF(E363=0,0,IMPRIMIR!D362)","v":0},{"$f":"IF(E363=0,0,IMPRIMIR!E362)","v":0},0,0,0]
[null,{"$f":"IF(E364=0,0,IMPRIMIR!A363)","v":0},{"$f":"IF(E364=0,0,IMPRIMIR!$D$3)","v":0},0,{"$f":"IMPRIMIR!B363","v":0},{"$f":"IMPRIMIR!C363","v":0},{"$f":"IF(E364=0,0,IMPRIMIR!D363)","v":0},{"$f":"IF(E364=0,0,IMPRIMIR!E363)","v":0},0,0,0]
[null,{"$f":"IF(E365=0,0,IMPRIMIR!A364)","v":0},{"$f":"IF(E365=0,0,IMPRIMIR!$D$3)","v":0},0,{"$f":"IMPRIMIR!B364","v":0},{"$f":"IMPRIMIR!C364","v":0},{"$f":"IF(E365=0,0,IMPRIMIR!D364)","v":0},{"$f":"IF(E365=0,0,IMPRIMIR!E364)","v":0},0,0,0]
[null,{"$f":"IF(E366=0,0,IMPRIMIR!A365)","v":0},{"$f":"IF(E366=0,0,IMPRIMIR!$D$3)","v":0},0,{"$f":"IMPRIMIR!B365","v":0},{"$f":"IMPRIMIR!C365","v":0},{"$f":"IF(E366=0,0,IMPRIMIR!D365)","v":0},{"$f":"IF(E366=0,0,IMPRIMIR!E365)","v":0},0,0,0]
[null,{"$f":"IF(E367=0,0,IMPRIMIR!A366)","v":0},{"$f":"IF(E367=0,0,IMPRIMIR!$D$3)","v":0},0,{"$f":"IMPRIMIR!B366","v":0},{"$f":"IMPRIMIR!C366","v":0},{"$f":"IF(E367=0,0,IMPRIMIR!D366)","v":0},{"$f":"IF(E367=0,0,IMPRIMIR!E366)","v":0},0,0,0]
[null,{"$f":"IF(E368=0,0,IMPRIMIR!A367)","v":0},{"$f":"IF(E368=0,0,IMPRIMIR!$D$3)","v":0},0,{"$f":"IMPRIMIR!B367","v":0},{"$f":"IMPRIMIR!C367","v":0},{"$f":"IF(E368=0,0,IMPRIMIR!D367)","v":0},{"$f":"IF(E368=0,0,IMPRIMIR!E367)","v":0},0,0,0]
[null,{"$f":"IF(E369=0,0,IMPRIMIR!A368)","v":0},{"$f":"IF(E369=0,0,IMPRIMIR!$D$3)","v":0},0,{"$f":"IMPRIMIR!B368","v":0},{"$f":"IMPRIMIR!C368","v":0},{"$f":"IF(E369=0,0,IMPRIMIR!D368)","v":0},{"$f":"IF(E369=0,0,IMPRIMIR!E368)","v":0},0,0,0]
[null,{"$f":"IF(E370=0,0,IMPRIMIR!A369)","v":0},{"$f":"IF(E370=0,0,IMPRIMIR!$D$3)","v":0},0,{"$f":"IMPRIMIR!B369","v":0},{"$f":"IMPRIMIR!C369","v":0},{"$f":"IF(E370=0,0,IMPRIMIR!D369)","v":0},{"$f":"IF(E370=0,0,IMPRIMIR!E369)","v":0},0,0,0]
[null,{"$f":"IF(E371=0,0,IMPRIMIR!A370)","v":0},{"$f":"IF(E371=0,0,IMPRIMIR!$D$3)","v":0},0,{"$f":"IMPRIMIR!B370","v":0},{"$f":"IMPRIMIR!C370","v":0},{"$f":"IF(E371=0,0,IMPRIMIR!D370)","v":0},{"$f":"IF(E371=0,0,IMPRIMIR!E370)","v":0},0,0,0]
[null,{"$f":"IF(E372=0,0,IMPRIMIR!A371)","v":0},{"$f":"IF(E372=0,0,IMPRIMIR!$D$3)","v":0},0,{"$f":"IMPRIMIR!B371","v":0},{"$f":"IMPRIMIR!C371","v":0},{"$f":"IF(E372=0,0,IMPRIMIR!D371)","v":0},{"$f":"IF(E372=0,0,IMPRIMIR!E371)","v":0},0,0,0]
[null,{"$f":"IF(E373=0,0,IMPRIMIR!A372)","v":0},{"$f":"IF(E373=0,0,IMPRIMIR!$D$3)","v":0},0,{"$f":"IMPRIMIR!B372","v":0},{"$f":"IMPRIMIR!C372","v":0},{"$f":"IF(E373=0,0,IMPRIMIR!D372)","v":0},{"$f":"IF(E373=0,0,IMPRIMIR!E372)","v":0},0,0,0]
[null,{"$f":"IF(E374=0,0,IMPRIMIR!A373)","v":0},{"$f":"IF(E374=0,0,IMPRIMIR!$D$3)","v":0},0,{"$f":"IMPRIMIR!B373","v":0},{"$f":"IMPRIMIR!C373","v":0},{"$f":"IF(E374=0,0,IMPRIMIR!D373)","v":0},{"$f":"IF(E374=0,0,IMPRIMIR!E373)","v":0},0,0,0]
[null,{"$f":"IF(E375=0,0,IMPRIMIR!A374)","v":0},{"$f":"IF(E375=0,0,IMPRIMIR!$D$3)","v":0},0,{"$f":"IMPRIMIR!B374","v":0},{"$f":"IMPRIMIR!C374","v":0},{"$f":"IF(E375=0,0,IMPRIMIR!D374)","v":0},{"$f":"IF(E375=0,0,IMPRIMIR!E374)","v":0},0,0,0]
[null,{"$f":"IF(E376=0,0,IMPRIMIR!A375)","v":0},{"$f":"IF(E376=0,0,IMPRIMIR!$D$3)","v":0},0,{"$f":"IMPRIMIR!B375","v":0},{"$f":"IMPRIMIR!C375","v":0},{"$f":"IF(E376=0,0,IMPRIMIR!D375)","v":0},{"$f":"IF(E376=0,0,IMPRIMIR!E375)","v":0},0,0,0]
[null,{"$f":"IF(E377=0,0,IMPRIMIR!A376)","v":0},{"$f":"IF(E377=0,0,IMPRIMIR!$D$3)","v":0},0,{"$f":"IMPRIMIR!B376","v":0},{"$f":"IMPRIMIR!C376","v":0},{"$f":"IF(E377=0,0,IMPRIMIR!D376)","v":0},{"$f":"IF(E377=0,0,IMPRIMIR!E376)","v":0},0,0,0]
[null,{"$f":"IF(E378=0,0,IMPRIMIR!A377)","v":0},{"$f":"IF(E378=0,0,IMPRIMIR!$D$3)","v":0},0,{"$f":"IMPRIMIR!B377","v":0},{"$f":"IMPRIMIR!C377","v":0},{"$f":"IF(E378=0,0,IMPRIMIR!D377)","v":0},{"$f":"IF(E378=0,0,IMPRIMIR!E377)","v":0},0,0,0]